siren,nic,siret,statutDiffusionEtablissement,dateCreationEtablissement,trancheEffectifsEtablissement,anneeEffectifsEtablissement,activitePrincipaleRegistreMetiersEtablissement,dateDernierTraitementEtablissement,etablissementSiege,nombrePeriodesEtablissement,complementAdresseEtablissement,numeroVoieEtablissement,indiceRepetitionEtablissement,typeVoieEtablissement,libelleVoieEtablissement,codePostalEtablissement,libelleCommuneEtablissement,libelleCommuneEtrangerEtablissement,distributionSpecialeEtablissement,codeCommuneEtablissement,codeCedexEtablissement,libelleCedexEtablissement,codePaysEtrangerEtablissement,libellePaysEtrangerEtablissement,complementAdresse2Etablissement,numeroVoie2Etablissement,indiceRepetition2Etablissement,typeVoie2Etablissement,libelleVoie2Etablissement,codePostal2Etablissement,libelleCommune2Etablissement,libelleCommuneEtranger2Etablissement,distributionSpeciale2Etablissement,codeCommune2Etablissement,codeCedex2Etablissement,libelleCedex2Etablissement,codePaysEtranger2Etablissement,libellePaysEtranger2Etablissement,dateDebut,etatAdministratifEtablissement,enseigne1Etablissement,enseigne2Etablissement,enseigne3Etablissement,denominationUsuelleEtablissement,activitePrincipaleEtablissement,nomenclatureActivitePrincipaleEtablissement,caractereEmployeurEtablissement,longitude,latitude,geo_score,geo_type,geo_adresse,geo_id,geo_ligne,geo_l4,geo_l5
213202534,00011,21320253400011,O,1983-03-01,11,2019,,2021-10-27T08:07:50,true,4,,4,,PL,DE LA MAIRIE,32340,MIRADOUX,,,32253,,,,,,,,,,,,,,,,,,,2008-01-01,A,MAIRIE,,,,84.11Z,NAFRev2,O,0.755635,43.998614,0.84,housenumber,4 Place de la Mairie 32340 Miradoux,32253_0043_00004,G,4 PLACE DE LA MAIRIE,
213202534,00029,21320253400029,O,1983-12-21,02,2019,,2021-10-27T08:07:50,false,3,,,,,,32340,MIRADOUX,,,32253,,,,,,,,,,,,,,,,,,,2008-01-01,A,ECOLE PRIMAIRE PUBLIQUE,,,,85.20Z,NAFRev2,N,,,0,,,,,,
213202534,00037,21320253400037,O,1996-01-01,NN,,,2008-01-04T18:30:59,false,3,MAIRIE,4,,PL,DE LA MAIRIE,32340,MIRADOUX,,,32253,,,,,,,,,,,,,,,,,,,2008-01-01,A,SCE EAU ASSAINISSEMENT,,,,36.00Z,NAFRev2,N,0.755635,43.998614,0.84,housenumber,4 Place de la Mairie 32340 Miradoux,32253_0043_00004,G,4 PLACE DE LA MAIRIE,
213202534,00045,21320253400045,O,1995-12-25,NN,,,2008-01-04T18:30:59,false,2,MAIRIE,4,,PL,DE LA MAIRIE,32340,MIRADOUX,,,32253,,,,,,,,,,,,,,,,,,,2008-01-01,A,TRANSPORTS SCOLAIRES,,,,49.31Z,NAFRev2,N,0.755635,43.998614,0.84,housenumber,4 Place de la Mairie 32340 Miradoux,32253_0043_00004,G,4 PLACE DE LA MAIRIE,
213202534,00052,21320253400052,O,2002-09-16,NN,,,2008-01-04T18:30:59,false,3,,,,,,32340,MIRADOUX,,,32253,,,,,,,,,,,,,,,,,,,2008-01-01,A,REGIE DES TRANSPORTS PUBLICS,,,,49.39A,NAFRev2,N,,,0,,,,,,
223200015,00848,22320001500848,O,2006-12-18,,,,2018-03-14T10:00:44,false,2,,,,RUE,MAJOR,32340,MIRADOUX,,,32253,,,,,,,,,,,,,,,,,,,2008-01-01,A,DIR SOLIDARITE DEPARTEMENTALE CENTRE MEDICO SOCIAL,,,,84.13Z,NAFRev2,N,0.756122,43.998777,0.94,street,Rue Major 32340 Miradoux,32253_0023,G,RUE MAJOR,
243200177,00018,24320017700018,O,1983-03-01,NN,,,2018-09-29T12:07:19,true,4,MAIRIE,4,,PL,DE LA MAIRIE,32340,MIRADOUX,,,32253,,,,,,,,,,,,,,,,,,,2017-05-02,F,,,,,84.11Z,NAFRev2,N,0.755635,43.998614,0.84,housenumber,4 Place de la Mairie 32340 Miradoux,32253_0043_00004,G,4 PLACE DE LA MAIRIE,
263201329,00012,26320132900012,O,1983-08-10,02,2019,,2022-02-11T04:00:10,true,5,MAIRIE,4,,PL,DE LA MAIRIE,32340,MIRADOUX,,,32253,,,,,,,,,,,,,,,,,,,2008-01-15,A,,,,,88.99B,NAFRev2,O,0.755635,43.998614,0.84,housenumber,4 Place de la Mairie 32340 Miradoux,32253_0043_00004,G,4 PLACE DE LA MAIRIE,
273202424,00019,27320242400019,O,,NN,,,,true,1,,,,,MAIRIE,32340,MIRADOUX,,,32253,,,,,,,,,,,,,,,,,,,1995-12-25,F,,,,,41.0Z,NAF1993,N,0.755626,43.998629,0.91,street,Place de la Mairie 32340 Miradoux,32253_0043,G,PLACE DE LA MAIRIE,
293202768,00017,29320276800017,O,1993-07-01,NN,,,2008-01-04T19:06:28,true,3,MAIRIE,4,,PL,DE LA MAIRIE,32340,MIRADOUX,,,32253,,,,,,,,,,,,,,,,,,,2008-01-01,A,,,,,42.99Z,NAFRev2,N,0.755635,43.998614,0.84,housenumber,4 Place de la Mairie 32340 Miradoux,32253_0043_00004,G,4 PLACE DE LA MAIRIE,
300251238,00014,30025123800014,O,1974-01-01,NN,,,2006-06-21T10:39:38,false,3,,,,,,32340,MIRADOUX,,,32253,,,,,,,,,,,,,,,,,,,1995-01-01,F,,,,,92.7C,NAF1993,N,,,0,,,,,,
300626686,00020,30062668600020,O,1984-02-20,NN,,,,true,1,,,,,GRAND RUE,32340,MIRADOUX,,,32253,,,,,,,,,,,,,,,,,,,1999-12-31,F,,,,,45.3E,NAF1993,N,0.756046,43.99899,0.95,street,Grand Rue 32340 Miradoux,32253_0028,G,GRAND RUE,
301524591,00031,30152459100031,O,1999-04-19,NN,,,2011-11-30T06:06:43,false,3,,,,LD,SAINTE ROSE,32340,MIRADOUX,,,32253,,,,,,,,,,,,,,,,,,,2006-04-11,F,,,,,01.2G,NAFRev1,N,0.773708,43.985887,0.94,locality,Sainte Rose 32340 Miradoux,32253_B136,G,SAINTE ROSE,
303673974,00018,30367397400018,O,,,,,,true,1,,,,PL,DE LA MAIRIE,32340,MIRADOUX,,,32253,,,,,,,,,,,,,,,,,,,1988-08-02,F,,,,,62.43,NAP,N,0.755626,43.998629,0.82,street,Place de la Mairie 32340 Miradoux,32253_0043,G,PLACE DE LA MAIRIE,
303673982,00011,30367398200011,O,,,,,,true,1,,,,,,32340,MIRADOUX,,,32253,,,,,,,,,,,,,,,,,,,1995-06-30,F,,,,,45.2V,NAF1993,N,,,0,,,,,,
305087942,00010,30508794200010,O,1976-01-01,NN,,,2008-12-06T05:01:42,true,3,,,,LD,AUX BRATAUX,32340,MIRADOUX,,,32253,,,,,,,,,,,,,,,,,,,2008-01-01,A,,,,,10.11Z,NAFRev2,N,,,0,,,,,,
305087942,00028,30508794200028,O,1982-01-01,NN,,,2008-01-22T13:52:23,false,4,,,,,BRETOUS,32340,MIRADOUX,,,32253,,,,,,,,,,,,,,,,,,,2008-01-01,F,,,,,01.50Z,NAFRev2,N,4.4780755,46.7372124,0.77,poi.bus_stop,Bois Bretoux (Arrêt de bus) Montchanin,https://osm.org/node/3044023349,G,,
305465783,00028,30546578300028,O,,NN,,,,true,1,,,,,REGIS,32340,MIRADOUX,,,32253,,,,,,,,,,,,,,,,,,,1989-06-30,F,,,,,55.40,NAP,N,2.410604,44.5454209,0.89,poi.park,Parc Régis Conques-en-Rouergue,https://osm.org/way/279748288,G,,
309029254,00013,30902925400013,O,,NN,,,,true,1,,,,RTE,DE LECTOURE,32340,MIRADOUX,,,32253,,,,,,,,,,,,,,,,,,,,F,,,,,67.01,NAP,N,0.755668,43.9962,0.84,street,Route de Lectoure 32340 Miradoux,32253_0040,G,ROUTE DE LECTOURE,
312984958,00016,31298495800016,O,1978-01-01,NN,,,2018-09-29T12:14:12,true,5,,,,RTE,DE LECTOURE,32340,MIRADOUX,,,32253,,,,,,,,,,,,,,,,,,,2016-11-30,F,,,,,47.73Z,NAFRev2,O,0.755668,43.9962,0.84,street,Route de Lectoure 32340 Miradoux,32253_0040,G,ROUTE DE LECTOURE,
315262832,00019,31526283200019,O,1900-01-01,,,,,false,3,,,,,LA PETITE BORDE,32340,MIRADOUX,,,32253,,,,,,,,,,,,,,,,,,,1994-07-01,F,,,,,01.1A,NAF1993,N,0.785332,43.964747,0.94,locality,La Petite Borde 32340 Miradoux,32253_B118,G,LA PETITE BORDE,
315262832,00027,31526283200027,O,1994-07-01,,,,,false,3,,,,,LA BORDE NEUVE,32340,MIRADOUX,,,32253,,,,,,,,,,,,,,,,,,,2002-06-30,F,,,,,01.1A,NAF1993,N,0.783656,43.958767,0.94,locality,La Borde Neuve 32340 Miradoux,32253_B010,G,LA BORDE NEUVE,
316514983,00014,31651498300014,O,1979-01-01,11,2019,,2021-10-27T08:19:47,true,8,,,,LD,NICOULEAU,32340,MIRADOUX,,,32253,,,,,,,,,,,,,,,,,,,2017-07-31,A,SONO DEPOT,,,DUNE,70.10Z,NAFRev2,O,2.8455147,44.2373254,0.89,poi.peak,Puech de Nicouleau (Pic) Ségur,https://osm.org/node/4604555392,G,,
316514983,00022,31651498300022,O,2010-08-05,,,,2017-10-27T03:14:49,false,2,,,,,ZA ROUNAC,32340,MIRADOUX,,,32253,,,,,,,,,,,,,,,,,,,2017-07-31,A,SONO DEPOT,,,,46.52Z,NAFRev2,N,0.761833,43.988299,0.64,locality,Petit Rounac 32340 Miradoux,32253_B117,G,PETIT ROUNAC,
317879310,00017,31787931000017,O,,NN,,,,true,1,,,,PL,DU FOIRAIL,32340,MIRADOUX,,,32253,,,,,,,,,,,,,,,,,,,,F,,,,,65.02,NAP,N,0.756928,43.998486,0.81,street,Place du Foirail 32340 Miradoux,32253_0026,G,PLACE DU FOIRAIL,
318731049,00025,31873104900025,O,,NN,,,,true,1,,,,LD,BORDE DE BAS,32340,MIRADOUX,,,32253,,,,,,,,,,,,,,,,,,,1995-02-14,F,,,,,45.4A,NAF1993,N,0.785332,43.964747,0.54,locality,La Petite Borde 32340 Miradoux,32253_B118,G,LA PETITE BORDE,
320092257,00015,32009225700015,O,,,,,,true,1,,,,,,32340,MIRADOUX,,,32253,,,,,,,,,,,,,,,,,,,1984-12-25,F,,,,,62.11,NAP,N,,,0,,,,,,
320389463,00011,32038946300011,O,,NN,,,,true,1,,,,,MAIRIE,32340,MIRADOUX,,,32253,,,,,,,,,,,,,,,,,,,1996-09-30,F,,,,,52.2C,NAF1993,N,0.755626,43.998629,0.91,street,Place de la Mairie 32340 Miradoux,32253_0043,G,PLACE DE LA MAIRIE,
321413494,00014,32141349400014,O,1996-11-12,,,,,false,3,,,,,GRANDE RUE,32340,MIRADOUX,,,32253,,,,,,,,,,,,,,,,,,,1999-09-30,F,,,,,74.1J,NAF1993,N,0.756046,43.99899,0.7,street,Grand Rue 32340 Miradoux,32253_0028,G,GRAND RUE,
322574153,00027,32257415300027,O,2006-01-09,,,,2014-07-08T00:27:04,true,3,,7,,,GRAND'RUE,32340,MIRADOUX,,,32253,,,,,,,,,,,,,,,,,,,2009-09-26,F,,,,,43.21A,NAFRev2,N,0.756339,43.998964,0.95,housenumber,7 Grand Rue 32340 Miradoux,32253_0028_00007,G,7 GRAND RUE,
322893355,00014,32289335500014,O,1902-06-02,NN,,,,true,3,,,,PL,DU VILLAGE,32340,MIRADOUX,,,32253,,,,,,,,,,,,,,,,,,,1992-01-01,F,,,,,65.1D,NAF1993,N,2.2389236,48.6678573,0.77,poi.park,Place du Village (Parc) Nozay,https://osm.org/way/26978864,G,,
323949719,00021,32394971900021,O,2007-01-12,,,,2008-11-07T00:40:46,false,2,,17,,,PORTE D'UZAN SUD,32340,MIRADOUX,,,32253,,,,,,,,,,,,,,,,,,,2007-07-17,F,,,,,52.6D,NAFRev1,O,0.753967,43.999196,0.95,housenumber,17 Porte d’Uzan Sud 32340 Miradoux,32253_2xsnx5_00017,G,17 PORTE D UZAN SUD,
324754621,00013,32475462100013,O,,NN,,,,true,1,,,,PL,DU FOIRAIL,32340,MIRADOUX,,,32253,,,,,,,,,,,,,,,,,,,1985-03-01,F,,,,,67.08,NAP,N,0.756928,43.998486,0.81,street,Place du Foirail 32340 Miradoux,32253_0026,G,PLACE DU FOIRAIL,
326214442,00013,32621444200013,O,1982-12-30,NN,,,2014-06-14T01:48:56,true,6,,,,LD,NICOULEAU,32340,MIRADOUX,,,32253,,,,,,,,,,,,,,,,,,,2012-12-31,A,,,,,46.69A,NAFRev2,N,2.8455147,44.2373254,0.89,poi.peak,Puech de Nicouleau (Pic) Ségur,https://osm.org/node/4604555392,G,,
326330081,00018,32633008100018,O,1983-01-01,NN,,,2012-12-10T19:33:00,true,4,,,,,,32340,MIRADOUX,,,32253,,,,,,,,,,,,,,,,,,,2012-11-20,F,,,,,01.11Z,NAFRev2,N,,,0,,,,,,
326371473,00017,32637147300017,O,1983-01-01,NN,,,2011-05-20T04:52:05,true,4,,,,,,32340,MIRADOUX,,,32253,,,,,,,,,,,,,,,,,,,2011-03-30,F,,,,,01.61Z,NAFRev2,N,,,0,,,,,,
327059432,00010,32705943200010,O,1983-04-13,NN,,,2008-01-05T19:25:26,true,3,,,,PL,FOIRAIL CENTRE COMMERCIAL,32340,MIRADOUX,,,32253,,,,,,,,,,,,,,,,,,,2008-01-01,A,,,,,68.20B,NAFRev2,N,0.756928,43.998486,0.35,street,Place du Foirail 32340 Miradoux,32253_0026,G,PLACE DU FOIRAIL,
327774154,00014,32777415400014,O,1983-05-01,NN,,,2013-03-04T19:39:32,true,4,,,,,,32340,MIRADOUX,,,32253,,,,,,,,,,,,,,,,,,,2012-12-31,F,,,,,01.11Z,NAFRev2,N,,,0,,,,,,
327859963,00016,32785996300016,O,1983-06-07,NN,,,2008-01-05T19:25:50,true,3,,,,,CHATEAU DE FIEUX,32340,MIRADOUX,,,32253,,,,,,,,,,,,,,,,,,,2008-01-01,A,,,,,68.20B,NAFRev2,N,0.732661,43.999323,0.94,locality,Château de Fieux 32340 Miradoux,32253_B033,G,CHATEAU DE FIEUX,
327961918,00015,32796191800015,O,1983-07-01,NN,,,2017-11-20T16:40:48,false,4,,,,,CHATEAU DE FIEUX,32340,MIRADOUX,,,32253,,,,,,,,,,,,,,,,,,,2017-05-02,F,,,,,68.20B,NAFRev2,N,0.732661,43.999323,0.94,locality,Château de Fieux 32340 Miradoux,32253_B033,G,CHATEAU DE FIEUX,
327961918,00023,32796191800023,O,2017-05-02,,,,2021-02-23T10:49:20,true,1,,,,,BELLERIVE,32340,MIRADOUX,,,32253,,,,,,,,,,,,,,,,,,,2017-05-02,A,,,,,68.20B,NAFRev2,N,4.9931758,44.2230148,0.9,poi.hotel,Hôtel Bellerive Rasteau,https://osm.org/way/80332934,G,,
328089305,00010,32808930500010,O,1983-07-06,NN,,,2013-08-09T12:35:26,true,4,,,,,CRCA,32340,MIRADOUX,,,32253,,,,,,,,,,,,,,,,,,,2013-07-25,F,,,,,01.61Z,NAFRev2,N,,,0,,,,,,
328180872,00017,32818087200017,O,1983-08-23,NN,,,2008-11-07T00:45:56,true,4,,,,PL,DU FOIRAIL,32340,MIRADOUX,,,32253,,,,,,,,,,,,,,,,,,,1999-05-10,F,,,,,52.2C,NAF1993,O,0.756928,43.998486,0.81,street,Place du Foirail 32340 Miradoux,32253_0026,G,PLACE DU FOIRAIL,
329895817,00016,32989581700016,O,,NN,,,,true,1,,,,LD,SOUBIRAN,32340,MIRADOUX,,,32253,,,,,,,,,,,,,,,,,,,,F,,,,,55.71,NAP,N,0.754459,43.999023,0.31,street,Porte d’Uzan Sud 32340 Miradoux,32253_2xsnx5,G,PORTE D UZAN SUD,
330094921,00013,33009492100013,O,1984-05-06,NN,,,2013-05-18T03:28:17,false,4,,10,,PL,DU FOIRAIL,32340,MIRADOUX,,,32253,,,,,,,,,,,,,,,,,,,2011-04-01,F,,,,,01.11Z,NAFRev2,N,0.7575,43.998889,0.84,housenumber,10 Place du Foirail 32340 Miradoux,32253_0026_00010,G,10 PLACE DU FOIRAIL,
330094921,00021,33009492100021,O,2011-04-01,01,2019,,2021-10-27T08:27:41,true,2,,,,,BELLERIVE,32340,MIRADOUX,,,32253,,,,,,,,,,,,,,,,,,,2012-12-31,A,,,,,01.11Z,NAFRev2,O,4.9931758,44.2230148,0.9,poi.hotel,Hôtel Bellerive Rasteau,https://osm.org/way/80332934,G,,
330666215,00018,33066621500018,O,1984-07-20,NN,,,2021-10-18T11:03:38,true,3,,,,LD,NICOULEAU,32340,MIRADOUX,,,32253,,,,,,,,,,,,,,,,,,,2008-01-01,A,,,,,68.20B,NAFRev2,N,2.8455147,44.2373254,0.89,poi.peak,Puech de Nicouleau (Pic) Ségur,https://osm.org/node/4604555392,G,,
331080853,00012,33108085300012,O,,NN,,,,true,1,,,,RTE,DE LECTOURE,32340,MIRADOUX,,,32253,,,,,,,,,,,,,,,,,,,,F,,,,,67.01,NAP,N,0.755668,43.9962,0.84,street,Route de Lectoure 32340 Miradoux,32253_0040,G,ROUTE DE LECTOURE,
331164749,00029,33116474900029,O,1999-01-01,NN,,,,false,3,,1,,,CHEMIN DE RONDE,32340,MIRADOUX,,,32253,,,,,,,,,,,,,,,,,,,2003-12-31,F,,,,,70.2B,NAFRev1,N,0.754721,43.998552,0.94,housenumber,1 Chemin de Ronde 32340 Miradoux,32253_0062_00001,G,1 CHEMIN DE RONDE,
332247345,00033,33224734500033,O,,NN,,,,true,1,,,,LD,LA FEZENDES,32340,MIRADOUX,,,32253,,,,,,,,,,,,,,,,,,,1995-12-31,F,,,,,45.2V,NAF1993,N,0.759218,43.998876,0.7,street,Rue de Fezendes 32340 Miradoux,32253_533cwl,G,RUE DE FEZENDES,
333054963,00025,33305496300025,O,,,,,,true,1,,,,,FAUBOURG DU LEVANT,32340,MIRADOUX,,,32253,,,,,,,,,,,,,,,,,,,1997-02-28,F,,,,,85.1G,NAF1993,N,0.758005,43.998647,0.94,locality,Faubourg du Levant 32340 Miradoux,32253_B047,G,FAUBOURG DU LEVANT,
333402634,00013,33340263400013,O,1985-08-15,NN,,,2020-10-17T03:41:23,true,4,,,,,NICOULEAU,32340,MIRADOUX,,,32253,,,,,,,,,,,,,,,,,,,2008-01-01,A,,,,,46.69A,NAFRev2,N,2.8455147,44.2373254,0.89,poi.peak,Puech de Nicouleau (Pic) Ségur,https://osm.org/node/4604555392,G,,
333403954,00063,33340395400063,O,1999-01-01,NN,,,,false,4,,12,,RUE,PORTE D'UZAN SUD,32340,MIRADOUX,,,32253,,,,,,,,,,,,,,,,,,,2001-01-01,F,,,,,92.6C,NAF1993,N,0.754349,43.999114,0.77,housenumber,12 Porte d’Uzan Sud 32340 Miradoux,32253_2xsnx5_00012,G,12 PORTE D UZAN SUD,
333403954,00097,33340395400097,O,2019-01-01,,,,2021-02-23T10:52:51,false,1,,14,,CHE,DE RONDE,32340,MIRADOUX,,,32253,,,,,,,,,,,,,,,,,,,2019-01-01,A,,,,,68.20A,NAFRev2,N,0.754207,43.998967,0.81,housenumber,14 Chemin de Ronde 32340 Miradoux,32253_0062_00014,G,14 CHEMIN DE RONDE,
333991347,00019,33399134700019,O,1985-11-12,NN,,,,false,4,,,,FG,DU LEVANT,32340,MIRADOUX,,,32253,,,,,,,,,,,,,,,,,,,1992-03-01,F,,,,,85.1C,NAF1993,N,0.758005,43.998647,0.79,locality,Faubourg du Levant 32340 Miradoux,32253_B047,G,FAUBOURG DU LEVANT,
334480423,00030,33448042300030,O,2004-06-30,,,,2015-06-26T04:12:27,true,4,,,,,MARENGO,32340,MIRADOUX,,,32253,,,,,,,,,,,,,,,,,,,2012-07-31,F,,,,,01.11Z,NAFRev2,N,0.758026,43.999075,0.33,street,Rue du 19 Mars 1962 32340 Miradoux,32253_0164,G,RUE DU 19 MARS 1962,
337533244,00014,33753324400014,O,,,,,,true,1,,,,RTE,DE LECTOURE,32340,MIRADOUX,,,32253,,,,,,,,,,,,,,,,,,,1991-06-28,F,,,,,67.01,NAP,N,0.755668,43.9962,0.84,street,Route de Lectoure 32340 Miradoux,32253_0040,G,ROUTE DE LECTOURE,
337557391,00014,33755739100014,O,,NN,,,,true,1,,,,,,32340,MIRADOUX,,,32253,,,,,,,,,,,,,,,,,,,1988-06-30,F,,,,,35.04,NAP,N,,,0,,,,,,
338754021,00016,33875402100016,O,1986-07-29,NN,,,2015-05-14T07:03:36,true,5,,,,,,32340,MIRADOUX,,,32253,,,,,,,,,,,,,,,,,,,2013-11-14,F,,,,,69.10Z,NAFRev2,O,,,0,,,,,,
338929474,00017,33892947400017,O,1986-09-01,NN,,,2008-11-07T00:58:17,true,4,,,,,LE NICOULEAU,32340,MIRADOUX,,,32253,,,,,,,,,,,,,,,,,,,1999-07-01,F,,,,,33.2B,NAF1993,N,2.8455147,44.2373254,0.76,poi.peak,Puech de Nicouleau (Pic) Ségur,https://osm.org/node/4604555392,G,,
339051344,00028,33905134400028,O,1992-02-28,NN,,,,false,3,,7,,RUE,MAJOR,32340,MIRADOUX,,,32253,,,,,,,,,,,,,,,,,,,1994-01-01,F,,,,,85.1C,NAF1993,N,0.75597,43.998832,0.94,housenumber,7 Rue Major 32340 Miradoux,32253_0023_00007,G,7 RUE MAJOR,
340090828,00013,34009082800013,O,1986-10-01,NN,,,2008-10-07T21:04:47,true,1,,,,LD,PAROT,32340,MIRADOUX,,,32253,,,,,,,,,,,,,,,,,,,2001-12-31,F,,,,,15.1E,NAF1993,N,4.422812,45.4327233,0.87,poi.bus_stop,Jean Parot (Arrêt de bus) Saint-Étienne,https://osm.org/node/2754838195,G,,
340483528,00014,34048352800014,O,1986-10-01,NN,,,,false,3,,,,LD,PAROT,32340,MIRADOUX,,,32253,,,,,,,,,,,,,,,,,,,2001-12-31,F,,,,,74.1J,NAF1993,N,4.422812,45.4327233,0.87,poi.bus_stop,Jean Parot (Arrêt de bus) Saint-Étienne,https://osm.org/node/2754838195,G,,
340483528,00022,34048352800022,O,1986-10-01,NN,,,2008-12-21T05:52:53,true,4,,,,,PAROT,32340,MIRADOUX,,,32253,,,,,,,,,,,,,,,,,,,2008-11-30,F,,,,,01.11Z,NAFRev2,N,4.422812,45.4327233,0.87,poi.bus_stop,Jean Parot (Arrêt de bus) Saint-Étienne,https://osm.org/node/2754838195,G,,
340893262,00022,34089326200022,O,2011-09-07,,,,2021-02-23T10:56:47,true,3,,6,,RUE,PORTE D UZAN NORD,32340,MIRADOUX,,,32253,,,,,,,,,,,,,,,,,,,2019-12-01,A,,,,,85.52Z,NAFRev2,N,0.754957,43.999138,0.77,housenumber,6 Porte d’Uzan Nord 32340 Miradoux,32253_er4lqp_00006,G,6 PORTE D UZAN NORD,
341168714,00010,34116871400010,O,1987-04-01,NN,,,2013-05-18T03:55:14,true,3,,,,,,32340,MIRADOUX,,,32253,,,,,,,,,,,,,,,,,,,2008-01-01,A,,,,,01.11Z,NAFRev2,N,,,0,,,,,,
342073533,00016,34207353300016,O,1987-08-01,NN,,,2020-01-14T12:50:27,false,4,,,,,,32340,MIRADOUX,,,32253,,,,,,,,,,,,,,,,,,,2019-12-05,F,,,,,01.11Z,NAFRev2,N,,,0,,,,,,
342073533,00024,34207353300024,O,2019-12-05,,,,2021-11-17T03:50:08,true,1,,,,LD,MONETON,32340,MIRADOUX,,,32253,,,,,,,,,,,,,,,,,,,2019-12-05,A,,,,,01.11Z,NAFRev2,N,,,0,,,,,,
342154093,00013,34215409300013,O,1987-08-03,01,2019,,2021-10-27T08:34:57,true,3,,,,,,32340,MIRADOUX,,,32253,,,,,,,,,,,,,,,,,,,2008-01-01,A,,,,,01.11Z,NAFRev2,N,,,0,,,,,,
342968823,00027,34296882300027,O,1992-08-01,NN,,,2011-04-28T00:35:49,false,4,,5,,PL,DU FOIRAIL,32340,MIRADOUX,,,32253,,,,,,,,,,,,,,,,,,,1998-12-31,F,,,,,93.0D,NAF1993,O,0.75676,43.998429,0.83,housenumber,5 Place du Foirail 32340 Miradoux,32253_0026_00005,G,5 PLACE DU FOIRAIL,
342968823,00043,34296882300043,O,2016-09-17,,,9602AB,2020-06-10T09:10:37,false,2,,4,,LOT,DU POINT DU JOUR,32340,MIRADOUX,,,32253,,,,,,,,,,,,,,,,,,,2017-03-31,F,,,,DOMYB,96.02A,NAFRev2,N,0.764076,44.00225,0.75,housenumber,4 Contre Allee du Point du Jour 32340 Miradoux,32253_ecwkzf_00004,G,4 CONTRE ALLEE DU POINT DU JOUR,
344950282,00014,34495028200014,O,,NN,,,,true,1,,,,,RANDE,32340,MIRADOUX,,,32253,,,,,,,,,,,,,,,,,,,1990-04-30,F,,,,,55.40,NAP,N,0.736176,44.01105,0.59,locality,La Grand Borde 32340 Miradoux,32253_B054,G,LA GRAND BORDE,
348400771,00013,34840077100013,O,1988-10-24,02,2019,4332AA,2021-10-27T08:38:40,true,4,,,,,LOTISSEMENT ARTISANAL,32340,MIRADOUX,,,32253,,,,,,,,,,,,,,,,,,,2008-01-01,A,,,,,43.32A,NAFRev2,O,1.7518932,46.1958765,0.89,poi.hostel,Lotissement Artisanal de la Jarrige (Auberge) Saint-Vaury,https://osm.org/node/4398829470,G,,
351409420,00020,35140942000020,O,1990-06-10,NN,,,,true,1,,,,PL,DU FOIRAIL,32340,MIRADOUX,,,32253,,,,,,,,,,,,,,,,,,,1998-12-10,F,,,,,85.1G,NAF1993,N,0.756928,43.998486,0.81,street,Place du Foirail 32340 Miradoux,32253_0026,G,PLACE DU FOIRAIL,
352497978,00010,35249797800010,O,1989-10-27,NN,,,2018-11-08T15:41:53,true,3,,,,,MAIRIE,32340,MIRADOUX,,,32253,,,,,,,,,,,,,,,,,,,2008-01-01,A,,,,,77.31Z,NAFRev2,N,0.755626,43.998629,0.91,street,Place de la Mairie 32340 Miradoux,32253_0043,G,PLACE DE LA MAIRIE,
352894422,00026,35289442200026,O,1990-06-10,NN,,,,false,4,,,,PL,DU FOIRAIL,32340,MIRADOUX,,,32253,,,,,,,,,,,,,,,,,,,2001-01-01,F,,,,,85.1G,NAF1993,N,0.756928,43.998486,0.81,street,Place du Foirail 32340 Miradoux,32253_0026,G,PLACE DU FOIRAIL,
352894422,00034,35289442200034,O,2001-01-01,NN,,,2014-04-02T16:01:10,false,4,,22,B,AV,DE LECTOURE,32340,MIRADOUX,,,32253,,,,,,,,,,,,,,,,,,,2014-01-01,F,,,,,86.90D,NAFRev2,N,0.755532,43.995751,0.71,housenumber,22bis Route de Lectoure 32340 Miradoux,32253_0040_00022_bis,G,22BIS ROUTE DE LECTOURE,
352894422,00042,35289442200042,O,2014-01-01,,,,2017-01-17T10:07:27,true,2,,14,,RTE,DE VALENCE D AGEN,32340,MIRADOUX,,,32253,,,,,,,,,,,,,,,,,,,2016-12-31,F,,,,,86.90D,NAFRev2,N,0.759583,44.000128,0.65,housenumber,14 Route de Valence 32340 Miradoux,32253_0065_00014,G,14 ROUTE DE VALENCE,
353263270,00053,35326327000053,O,2010-07-15,,,,2012-11-09T00:43:25,false,1,LAOUNGAOU,,,,,32340,MIRADOUX,,,32253,,,,,,,,,,,,,,,,,,,2010-07-15,F,,,,,85.59A,NAFRev2,N,,,0,,,,,,
353709512,00019,35370951200019,O,1990-01-01,NN,,,2019-06-24T13:07:20,true,4,,,,,PETIT DOURDE,32340,MIRADOUX,,,32253,,,,,,,,,,,,,,,,,,,2017-12-31,F,,,,,01.11Z,NAFRev2,N,0.745315,43.972982,0.94,locality,Petit Dourde 32340 Miradoux,32253_B114,G,PETIT DOURDE,
356000000,21530,35600000021530,O,2012-01-01,,,,2017-06-21T04:39:10,false,3,,11,,PL,DU FOIRAIL,32340,MIRADOUX,,,32253,,,,,,,,,,,,,,,,,,,2016-12-31,F,LA POSTE,,,,53.10Z,NAFRev2,N,0.757086,43.998419,0.84,housenumber,11 Place du Foirail 32340 Miradoux,32253_0026_00011,G,11 PLACE DU FOIRAIL,
356000737,02371,35600073702371,O,1991-01-01,NN,,,2013-03-05T10:37:07,false,4,,,,PL,CENTRALE,32340,MIRADOUX,,,32253,,,,,,,,,,,,,,,,,,,2011-12-31,F,BUREAU DE POSTE,,,,53.10Z,NAFRev2,O,3.1894095,45.6648291,0.75,poi.ruins,Place centrale (Ruines) Corent,https://osm.org/way/389431000,G,,
356000737,17221,35600073717221,O,2005-10-25,NN,,,2010-04-18T05:34:27,false,4,,,,PL,CENTRALE,32340,MIRADOUX,,,32253,,,,,,,,,,,,,,,,,,,2009-03-18,F,CENTRE COURRIER,,,,53.10Z,NAFRev2,O,3.1894095,45.6648291,0.75,poi.ruins,Place centrale (Ruines) Corent,https://osm.org/way/389431000,G,,
379479199,00026,37947919900026,O,2009-12-23,NN,,4332BB,2015-04-16T11:37:16,true,1,LA GRANDE BORDE,,,,LA GRAND BORDE,32340,MIRADOUX,,,32253,,,,,,,,,,,,,,,,,,,2009-12-23,A,,,,,25.99B,NAFRev2,O,0.736176,44.01105,0.94,locality,La Grand Borde 32340 Miradoux,32253_B054,G,LA GRAND BORDE,
380103325,00011,38010332500011,O,1990-08-17,NN,,,2019-04-12T03:59:36,true,3,,,,,TUCOIRE,32340,MIRADOUX,,,32253,,,,,,,,,,,,,,,,,,,2008-01-01,A,,,,,68.20B,NAFRev2,N,,,0,,,,,,
380950030,00045,38095003000045,O,2014-02-01,,,,2016-05-17T11:21:44,false,3,,,,,LIEU DIT MESTRE DOURDE,32340,MIRADOUX,,,32253,,,,,,,,,,,,,,,,,,,2016-05-01,F,,,,,47.89Z,NAFRev2,N,0.74837,43.975789,0.94,street,Mestre Dourde 32340 Miradoux,32253_B096,G,MESTRE DOURDE,
381667633,00014,38166763300014,O,1991-04-01,NN,,,2019-11-15T04:11:08,true,3,,,,LD,CAUSSIAC,32340,MIRADOUX,,,32253,,,,,,,,,,,,,,,,,,,2008-01-01,A,,,,,01.11Z,NAFRev2,N,0.7629514,44.0178827,0.89,poi.stream,Ruisseau de Caussiac Miradoux,https://osm.org/way/309725012,G,,
382063717,00385,38206371700385,O,1994-10-12,NN,,,2017-05-04T02:27:17,false,5,,,,,MIRADOUX,32340,MIRADOUX,,,32253,,,,,,,,,,,,,,,,,,,2012-12-07,A,,,,VAL DE GASCOGNE,46.21Z,NAFRev2,N,0.758909,43.998396,0.93,municipality,Miradoux,32253,G,MIRADOUX,
382377620,00010,38237762000010,O,1991-07-01,NN,,,,true,1,,,,,NICOULEAU,32340,MIRADOUX,,,32253,,,,,,,,,,,,,,,,,,,1999-08-04,F,,,,,51.6J,NAF1993,N,2.8455147,44.2373254,0.89,poi.peak,Puech de Nicouleau (Pic) Ségur,https://osm.org/node/4604555392,G,,
382415347,00014,38241534700014,O,,NN,,,,true,1,,,,LD,NICOULEAU,32340,MIRADOUX,,,32253,,,,,,,,,,,,,,,,,,,1995-06-30,F,,,,,51.4F,NAF1993,O,2.8455147,44.2373254,0.89,poi.peak,Puech de Nicouleau (Pic) Ségur,https://osm.org/node/4604555392,G,,
382872901,00014,38287290100014,O,1991-08-19,,,,,true,4,,,,,NICOULEAU,32340,MIRADOUX,,,32253,,,,,,,,,,,,,,,,,,,1997-06-30,F,,,,,51.6J,NAF1993,N,2.8455147,44.2373254,0.89,poi.peak,Puech de Nicouleau (Pic) Ségur,https://osm.org/node/4604555392,G,,
385050968,00010,38505096800010,O,1992-03-01,NN,,,2010-02-11T19:44:55,true,4,,,,,HORGUES,32340,MIRADOUX,,,32253,,,,,,,,,,,,,,,,,,,2008-10-31,F,,,,,01.11Z,NAFRev2,N,0.0904347,43.1874838,0.89,poi,(Pont) Horgues,https://osm.org/way/155197528,G,,