siren,nic,siret,statutDiffusionEtablissement,dateCreationEtablissement,trancheEffectifsEtablissement,anneeEffectifsEtablissement,activitePrincipaleRegistreMetiersEtablissement,dateDernierTraitementEtablissement,etablissementSiege,nombrePeriodesEtablissement,complementAdresseEtablissement,numeroVoieEtablissement,indiceRepetitionEtablissement,typeVoieEtablissement,libelleVoieEtablissement,codePostalEtablissement,libelleCommuneEtablissement,libelleCommuneEtrangerEtablissement,distributionSpecialeEtablissement,codeCommuneEtablissement,codeCedexEtablissement,libelleCedexEtablissement,codePaysEtrangerEtablissement,libellePaysEtrangerEtablissement,complementAdresse2Etablissement,numeroVoie2Etablissement,indiceRepetition2Etablissement,typeVoie2Etablissement,libelleVoie2Etablissement,codePostal2Etablissement,libelleCommune2Etablissement,libelleCommuneEtranger2Etablissement,distributionSpeciale2Etablissement,codeCommune2Etablissement,codeCedex2Etablissement,libelleCedex2Etablissement,codePaysEtranger2Etablissement,libellePaysEtranger2Etablissement,dateDebut,etatAdministratifEtablissement,enseigne1Etablissement,enseigne2Etablissement,enseigne3Etablissement,denominationUsuelleEtablissement,activitePrincipaleEtablissement,nomenclatureActivitePrincipaleEtablissement,caractereEmployeurEtablissement,longitude,latitude,geo_score,geo_type,geo_adresse,geo_id,geo_ligne,geo_l4,geo_l5
016380081,00063,01638008100063,O,1988-08-17,12,2019,,2021-10-27T08:00:38,true,4,ZI,,,RTE,DE BORDEAUX,47700,CASTELJALOUX,,,47052,,,,,,,,,,,,,,,,,,,2008-01-01,A,,,,,23.19Z,NAFRev2,O,0.071835,44.326729,0.85,street,Route de Bordeaux 47700 Casteljaloux,47052_0045,G,ROUTE DE BORDEAUX,
026811448,00039,02681144800039,O,,NN,,,,true,1,,50,,RUE,GRAND RUE,47700,CASTELJALOUX,,,47052,,,,,,,,,,,,,,,,,,,,F,,,,,67.06,NAP,N,0.088095,44.314228,0.84,housenumber,50 Grand Rue 47700 Casteljaloux,47052_0130_00050,G,50 GRAND RUE,
027212018,00058,02721201800058,O,,NN,,,,true,1,,69,,AV,DE LA LIBERATION,47700,CASTELJALOUX,,,47052,,,,,,,,,,,,,,,,,,,1989-09-01,F,,,,,62.11,NAP,N,0.080997,44.310896,0.88,housenumber,69 Avenue de la Libération 47700 Casteljaloux,47052_0175_00069,G,69 AVENUE DE LA LIBERATION,
077211050,00024,07721105000024,O,,,,,,true,1,,,,RUE,DES MUTILES DU TRAVAIL,47700,CASTELJALOUX,,,47052,,,,,,,,,,,,,,,,,,,1991-06-30,F,,,,,29.3D,NAF1993,N,0.086131,44.314876,0.96,street,Rue des Mutilés du Travail 47700 Casteljaloux,47052_0225,G,RUE DES MUTILES DU TRAVAIL,
085420172,01016,08542017201016,O,2002-01-01,NN,,,2008-04-26T08:11:15,false,3,,11,,PL,GAMBETTA,47700,CASTELJALOUX,,,47052,,,,,,,,,,,,,,,,,,,2006-10-31,F,,,,,65.1D,NAFRev1,O,0.085544,44.314308,0.83,housenumber,11 Place Gambetta 47700 Casteljaloux,47052_0110_00011,G,11 PLACE GAMBETTA,
130012875,00113,13001287500113,O,2010-11-01,03,2019,,2021-10-27T08:03:55,false,1,,,,PL,DE ROY,47700,CASTELJALOUX,,BP   8,47052,,,,,,,,,,,,,,,,,,,2010-11-01,A,TRESORERIE DE CASTELJALOUX,,,,84.11Z,NAFRev2,N,0.089615,44.314545,0.49,street,Place du Roy 47700 Casteljaloux,47052_0266,G,PLACE DU ROY,
173302308,00437,17330230800437,O,1993-01-01,,,,2008-01-04T18:14:59,false,3,,,,AV,CARCIN,47700,CASTELJALOUX,,,47052,,,,,,,,,,,,,,,,,,,2008-01-01,A,RECETTE LOCALE,,,,84.11Z,NAFRev2,N,0.082698,44.316185,0.77,street,Avenue Carcin 47700 Casteljaloux,47052_0115,G,AVENUE CARCIN,
174702118,00129,17470211800129,O,1983-11-29,,,,2013-04-29T22:36:20,false,4,,4,,AV,DU HUIT MAI 1945,47700,CASTELJALOUX,,,47052,,,,,,,,,,,,,,,,,,,2010-11-01,F,TRESORERIE DE CASTELJALOUX,,,,84.11Z,NAFRev2,N,0.083509,44.31418,0.62,housenumber,4 Avenue du 8 Mai 1945 47700 Casteljaloux,47052_0149_00004,G,4 AVENUE DU 8 MAI 1945,
174702217,00178,17470221700178,O,1983-12-01,NN,,,,false,3,,,,AV,CARCIN,47700,CASTELJALOUX,,,47052,,,,,,,,,,,,,,,,,,,1993-02-01,F,RECETTE LOCALE C E   CASTELJALOUX,,,,75.1A,NAF1993,N,0.082698,44.316185,0.77,street,Avenue Carcin 47700 Casteljaloux,47052_0115,G,AVENUE CARCIN,
174706614,00099,17470661400099,O,1985-03-14,NN,,,2010-04-18T03:07:14,false,4,,,,RUE,JEAN VICAN,47700,CASTELJALOUX,,BP 12,47052,,,,,,,,,,,,,,,,,,,2009-01-01,F,UNITE DEPARTEMENT.DES ROUTES DE L'ALBRET,,,,84.13Z,NAFRev2,N,0.078737,44.305307,0.95,street,Rue Jean Vican 47700 Casteljaloux,47052_0164,G,RUE JEAN VICAN,
180092355,00437,18009235500437,O,2014-02-01,NN,,,2019-06-24T13:07:39,false,2,DFCI DU LOT ET GARONNE,44,,RUE,GRAND RUE,47700,CASTELJALOUX,,,47052,,,,,,,,,,,,,,,,,,,2017-01-01,F,CRPF AQUITAINE,,,,84.13Z,NAFRev2,N,0.08844,44.31421,0.84,housenumber,44 Grand Rue 47700 Casteljaloux,47052_0130_00044,G,44 GRAND RUE,
194700126,00015,19470012600015,O,1983-03-01,12,2019,,2021-10-27T08:04:56,true,4,,7,,RUE,DES ARENES,47700,CASTELJALOUX,,,47052,,,,,,,,,,,,,,,,,,,2013-01-01,A,,,,,85.31Z,NAFRev2,O,0.084795,44.313438,0.96,housenumber,7 Rue des Arènes 47700 Casteljaloux,47052_0010_00007,G,7 RUE DES ARENES,
214700528,00018,21470052800018,O,1983-03-01,21,2019,,2021-10-27T08:08:34,true,4,,,,PL,DE LA REPUBLIQUE,47700,CASTELJALOUX,,,47052,,,,,,,,,,,,,,,,,,,2008-01-01,A,MAIRIE,,,,84.11Z,NAFRev2,O,0.08828,44.313803,0.86,street,Place de la République 47700 Casteljaloux,47052_0255,G,PLACE DE LA REPUBLIQUE,
214700528,00026,21470052800026,O,1983-03-16,NN,,,,false,4,,,,BD,VICTOR HUGO,47700,CASTELJALOUX,,,47052,,,,,,,,,,,,,,,,,,,2003-09-04,F,MAIRIE DE CASTELJALOUX CAFE,,,,55.4B,NAFRev1,N,0.088528,44.313386,0.83,street,Boulevard Victor Hugo 47700 Casteljaloux,47052_0305,G,BOULEVARD VICTOR HUGO,
214700528,00034,21470052800034,O,1983-10-01,NN,,,2016-05-11T16:59:43,false,4,,,,PL,DE LA REPUBLIQUE,47700,CASTELJALOUX,,,47052,,,,,,,,,,,,,,,,,,,2015-12-25,F,SERVICE DES EAUX,,,,36.00Z,NAFRev2,N,0.08828,44.313803,0.86,street,Place de la République 47700 Casteljaloux,47052_0255,G,PLACE DE LA REPUBLIQUE,
214700528,00042,21470052800042,O,1983-12-21,11,2019,,2021-10-27T08:08:34,false,4,,4,,AV,DE LIRAC,47700,CASTELJALOUX,,,47052,,,,,,,,,,,,,,,,,,,2008-01-01,A,ECOLE ELEMENTAIRE JF SAMAZEUILH,,,,85.20Z,NAFRev2,N,0.08841,44.317439,0.82,housenumber,4 Avenue de Lirac 47700 Casteljaloux,47052_0190_00004,G,4 AVENUE DE LIRAC,
214700528,00059,21470052800059,O,1983-12-21,NN,,,2009-10-08T09:53:49,false,4,,,,PL,JEAN JAURES,47700,CASTELJALOUX,,,47052,,,,,,,,,,,,,,,,,,,2008-01-01,F,ECOL PRIM GROUPE-1,,,,85.20Z,NAFRev2,N,0.084312,44.313997,0.83,street,Place Jean Jaurès 47700 Casteljaloux,47052_0160,G,PLACE JEAN JAURES,
214700528,00067,21470052800067,O,1983-12-21,03,2019,,2021-10-27T08:08:34,false,3,,,,PL,DE KUNHEIM,47700,CASTELJALOUX,,,47052,,,,,,,,,,,,,,,,,,,2008-01-01,A,ECOLE MATERN PUBL JEAN DE LA FONTAINE,,,,85.10Z,NAFRev2,N,0.087829,44.316336,0.82,street,Place de Kunheim 47700 Casteljaloux,47052_0261,G,PLACE DE KUNHEIM,
214700528,00075,21470052800075,O,1993-04-26,NN,,,2016-04-26T01:23:34,false,3,,,,RTE,DE COCUMONT,47700,CASTELJALOUX,,,47052,,,,,,,,,,,,,,,,,,,2008-01-01,A,CENTRE DE LOISIRS MUNICIPAL,,,,93.29Z,NAFRev2,N,0.081491,44.327248,0.85,street,Route de Cocumont 47700 Casteljaloux,47052_0080,G,ROUTE DE COCUMONT,
214700528,00083,21470052800083,O,1996-12-25,NN,,,2016-05-11T17:01:34,false,3,MAIRIE,,,PL,DE LA REPUBLIQUE,47700,CASTELJALOUX,,,47052,,,,,,,,,,,,,,,,,,,2015-12-25,F,SERVICE ASSAINISSEMENT,,,,37.00Z,NAFRev2,N,0.08828,44.313803,0.86,street,Place de la République 47700 Casteljaloux,47052_0255,G,PLACE DE LA REPUBLIQUE,
214700528,00091,21470052800091,O,1996-12-25,NN,,,2008-01-04T18:34:32,false,2,MAIRIE,,,PL,DE LA REPUBLIQUE,47700,CASTELJALOUX,,,47052,,,,,,,,,,,,,,,,,,,2008-01-01,A,PISCINE,,,,93.11Z,NAFRev2,N,0.08828,44.313803,0.86,street,Place de la République 47700 Casteljaloux,47052_0255,G,PLACE DE LA REPUBLIQUE,
214700528,00109,21470052800109,O,1996-12-25,NN,,,2016-01-10T18:09:42,false,3,MAIRIE,,,PL,DE LA REPUBLIQUE,47700,CASTELJALOUX,,,47052,,,,,,,,,,,,,,,,,,,2016-01-10,A,COMPLEXE TOURISTIQUE,,,,93.29Z,NAFRev2,O,0.08828,44.313803,0.86,street,Place de la République 47700 Casteljaloux,47052_0255,G,PLACE DE LA REPUBLIQUE,
214700528,00117,21470052800117,O,2001-01-01,NN,,,2014-08-01T15:37:55,false,4,,,,,LA VILLE,47700,CASTELJALOUX,,,47052,,,,,,,,,,,,,,,,,,,2011-04-14,F,ZAC THERMALE DE LA BARTERE,,,,96.04Z,NAFRev2,N,0.088807,44.313968,0.95,street,La Ville 47700 Casteljaloux,47052_md1him,G,LA VILLE,
214700528,00125,21470052800125,O,2003-05-25,01,2019,,2021-10-27T08:08:34,false,3,,,,RTE,DE MARMANDE,47700,CASTELJALOUX,,,47052,,,,,,,,,,,,,,,,,,,2008-01-01,A,CAMPING MUNICIPAL DE LA PISCINE,,,,55.30Z,NAFRev2,N,0.095892,44.325538,0.83,street,Route de Marmande 47700 Casteljaloux,47052_0210,G,ROUTE DE MARMANDE,
224700013,00069,22470001300069,O,1985-03-07,NN,,,2008-01-04T18:46:29,false,3,,7,,RUE,DE L HOPITAL,47700,CASTELJALOUX,,,47052,,,,,,,,,,,,,,,,,,,2008-01-01,A,DISPENSAIRE SOINS P M I,,,,86.21Z,NAFRev2,N,0.08941,44.314971,0.96,housenumber,7 Rue de l’Hôpital 47700 Casteljaloux,47052_0135_00007,G,7 RUE DE L HOPITAL,
224700013,00465,22470001300465,O,2003-01-01,NN,,,2020-02-11T10:22:57,false,4,,,,,LA BARTERE,47700,CASTELJALOUX,,,47052,,,,,,,,,,,,,,,,,,,2018-12-31,F,THERMES DE CASTELJALOUX,,,,68.20B,NAFRev2,N,0.086522,44.311024,0.95,street,La Bartere 47700 Casteljaloux,47052_avivhd,G,LA BARTERE,
244700084,00019,24470008400019,O,1983-03-01,NN,,,2017-05-04T01:33:24,true,5,,,,RUE,DU TURON,47700,CASTELJALOUX,,,47052,,,,,,,,,,,,,,,,,,,2016-05-17,F,,,,,84.11Z,NAFRev2,O,0.082186,44.314548,0.96,street,Rue du Turon 47700 Casteljaloux,47052_0295,G,RUE DU TURON,
244700084,00027,24470008400027,O,2000-12-25,NN,,,2017-01-06T08:35:59,false,3,,,,RUE,DU TURON,47700,CASTELJALOUX,,,47052,,,,,,,,,,,,,,,,,,,2016-05-17,F,SERVICE DES EAUX,,,,36.00Z,NAFRev2,N,0.082186,44.314548,0.96,street,Rue du Turon 47700 Casteljaloux,47052_0295,G,RUE DU TURON,
244700084,00035,24470008400035,O,2001-12-25,NN,,,2017-01-06T08:35:59,false,3,,20,,RUE,DU TURON,47700,CASTELJALOUX,,,47052,,,,,,,,,,,,,,,,,,,2016-05-17,F,SERVICE ASSAINISSEMENT,,,,37.00Z,NAFRev2,N,0.081501,44.31468,0.96,housenumber,20 Rue du Turon 47700 Casteljaloux,47052_0295_00020,G,20 RUE DU TURON,
244700084,00043,24470008400043,O,2001-12-25,NN,,,2006-10-26T23:42:31,false,2,,20,,RUE,DU TURON,47700,CASTELJALOUX,,,47052,,,,,,,,,,,,,,,,,,,2005-06-28,F,CONTRAT DE PAYS,,,,75.1A,NAFRev1,N,0.081501,44.31468,0.96,housenumber,20 Rue du Turon 47700 Casteljaloux,47052_0295_00020,G,20 RUE DU TURON,
254700636,00023,25470063600023,O,1999-01-29,NN,,,,true,1,,,,RUE,TEMBOURY,47700,CASTELJALOUX,,,47052,,,,,,,,,,,,,,,,,,,2002-12-31,F,,,,,90.0A,NAF1993,O,0.077649,44.304808,0.95,street,Rue Temboury 47700 Casteljaloux,47052_0283,G,RUE TEMBOURY,
254700719,00019,25470071900019,O,1983-03-01,NN,,,2009-06-27T03:29:05,true,3,,,,PL,DE LA REPUBLIQUE,47700,CASTELJALOUX,,,47052,,,,,,,,,,,,,,,,,,,2007-05-31,F,,,,,75.1E,NAFRev1,N,0.08828,44.313803,0.86,street,Place de la République 47700 Casteljaloux,47052_0255,G,PLACE DE LA REPUBLIQUE,
264700410,00014,26470041000014,O,1983-03-01,01,2019,,2021-10-27T08:12:56,true,4,,,,PL,DE LA REPUBLIQUE,47700,CASTELJALOUX,,,47052,,,,,,,,,,,,,,,,,,,2016-04-01,A,CCAS,,,,88.99B,NAFRev2,O,0.08828,44.313803,0.86,street,Place de la République 47700 Casteljaloux,47052_0255,G,PLACE DE LA REPUBLIQUE,
264703489,00015,26470348900015,O,1983-03-01,NN,,,2016-04-26T01:33:29,false,5,,,,RUE,SAINT VINCENT DE PAUL,47700,CASTELJALOUX,,,47052,,,,,,,,,,,,,,,,,,,2014-07-07,F,,,,,86.10Z,NAFRev2,O,0.090379,44.314508,0.95,street,Rue Saint Vincent de Paul 47700 Casteljaloux,47052_ou2l39,G,RUE SAINT VINCENT DE PAUL,
264703489,00049,26470348900049,O,2014-07-07,22,2019,,2021-10-27T08:12:57,true,1,,14,A,RUE,DES ABEILLES,47700,CASTELJALOUX,,,47052,,,,,,,,,,,,,,,,,,,2014-07-07,A,,,,,86.10Z,NAFRev2,O,0.079125,44.312999,0.96,housenumber,14a Rue des Abeilles 47700 Casteljaloux,47052_0003_00014_a,G,14A RUE DES ABEILLES,
264703489,00056,26470348900056,O,2014-07-07,,,,2021-02-23T10:35:09,false,1,,14,A,RUE,DES ABEILLES,47700,CASTELJALOUX,,,47052,,,,,,,,,,,,,,,,,,,2014-07-07,A,EHPAD,,,,87.30A,NAFRev2,N,0.079125,44.312999,0.96,housenumber,14a Rue des Abeilles 47700 Casteljaloux,47052_0003_00014_a,G,14A RUE DES ABEILLES,
294701248,00014,29470124800014,O,1948-07-17,01,2019,,2021-10-27T08:13:33,true,4,,1,,PL,DE LA REPUBLIQUE,47700,CASTELJALOUX,,,47052,,,,,,,,,,,,,,,,,,,2008-01-01,A,,,,,42.99Z,NAFRev2,O,0.088131,44.31351,0.87,housenumber,1 Place de la République 47700 Casteljaloux,47052_0255_00001,G,1 PLACE DE LA REPUBLIQUE,
294701271,00016,29470127100016,O,1947-07-15,NN,,,2015-05-14T03:53:00,true,3,,1,,PL,DE LA REPUBLIQUE,47700,CASTELJALOUX,,,47052,,,,,,,,,,,,,,,,,,,2008-01-01,A,,,,,42.99Z,NAFRev2,N,0.088131,44.31351,0.87,housenumber,1 Place de la République 47700 Casteljaloux,47052_0255_00001,G,1 PLACE DE LA REPUBLIQUE,
294701669,00011,29470166900011,O,2001-12-25,,,,2008-01-04T19:06:51,true,2,CHEZ M. FRAUCIEL,,,,VILLENAVE,47700,CASTELJALOUX,,,47052,,,,,,,,,,,,,,,,,,,2008-01-01,A,,,,,42.99Z,NAFRev2,N,0.100334,44.311299,0.49,street,Route de Villefranche 47700 Casteljaloux,47052_0315,G,ROUTE DE VILLEFRANCHE,
300013158,00039,30001315800039,O,,NN,,,,true,1,,41,,AV,DE LA LIBERATION,47700,CASTELJALOUX,,,47052,,,,,,,,,,,,,,,,,,,1997-06-03,F,,,,,15.8C,NAF1993,O,0.08228,44.312453,0.88,housenumber,41 Avenue de la Libération 47700 Casteljaloux,47052_0175_00041,G,41 AVENUE DE LA LIBERATION,
300534377,00019,30053437700019,O,1973-01-01,,,,2016-06-07T07:52:51,true,4,,,,,VILLENAVE,47700,CASTELJALOUX,,,47052,,,,,,,,,,,,,,,,,,,2015-11-26,F,,,,,01.61Z,NAFRev2,N,0.100334,44.311299,0.49,street,Route de Villefranche 47700 Casteljaloux,47052_0315,G,ROUTE DE VILLEFRANCHE,
300583127,00026,30058312700026,O,1991-07-01,NN,,,,false,4,,6,,RUE,DE VEYRIES,47700,CASTELJALOUX,,,47052,,,,,,,,,,,,,,,,,,,2002-10-01,F,,,,,92.3A,NAF1993,N,0.088226,44.314501,0.96,housenumber,6 Rue de Veyries 47700 Casteljaloux,47052_0300_00006,G,6 RUE DE VEYRIES,
300679925,00028,30067992500028,O,,NN,,,,true,1,,,,CHE,LATERAL A LA GARE,47700,CASTELJALOUX,,,47052,,,,,,,,,,,,,,,,,,,2000-09-19,F,,,,,21.08,NAP,N,0.102335,44.32138,0.35,street,Chemin de la Petite Serre 47700 Casteljaloux,47052_0322,G,CHEMIN DE LA PETITE SERRE,
300740883,00016,30074088300016,O,,,,,,true,1,,,,PL,LOUIS JEAN CAPPES,47700,CASTELJALOUX,,,47052,,,,,,,,,,,,,,,,,,,1997-03-29,F,,,,,85.1C,NAF1993,N,0.08375,44.312623,0.6,street,Place Louis Cappes 47700 Casteljaloux,47052_0200,G,PLACE LOUIS CAPPES,
300771623,00018,30077162300018,O,,,,,,true,1,,,,PL,GAMBETTA,47700,CASTELJALOUX,,,47052,,,,,,,,,,,,,,,,,,,1985-12-25,F,,,,,57.01,NAP,N,0.085604,44.313956,0.8,street,Place Gambetta 47700 Casteljaloux,47052_0110,G,PLACE GAMBETTA,
300872470,00012,30087247000012,O,1900-01-01,NN,,,2021-02-23T10:35:48,true,4,DOMAINE DE LAROQUE,,,AV,JOSEPH TURROQUES,47700,CASTELJALOUX,,,47052,,,,,,,,,,,,,,,,,,,2020-11-12,A,,,,,02.10Z,NAFRev2,N,0.07781,44.306197,0.87,street,Avenue Joseph Turroques 47700 Casteljaloux,47052_0258,G,AVENUE JOSEPH TURROQUES,
300925930,00012,30092593000012,O,1974-01-01,NN,,,2009-06-27T03:35:11,true,4,,,,RTE,DU PEYRAMA,47700,CASTELJALOUX,,,47052,,,,,,,,,,,,,,,,,,,2007-08-31,F,,,,,45.4A,NAFRev1,O,0.07236,44.309195,0.76,street,Impasse du Peyrama 47700 Casteljaloux,47052_bztd5y,G,IMPASSE DU PEYRAMA,
300998002,00046,30099800200046,O,1994-10-01,NN,,,2017-11-16T08:32:55,true,5,,7,,AV,DU HUIT MAI 1945,47700,CASTELJALOUX,,,47052,,,,,,,,,,,,,,,,,,,2008-01-01,F,,,,,70.22Z,NAFRev2,N,0.082678,44.314079,0.62,housenumber,7 Avenue du 8 Mai 1945 47700 Casteljaloux,47052_0149_00007,G,7 AVENUE DU 8 MAI 1945,
301142949,00017,30114294900017,O,,,,,,true,1,,11,,RUE,POSTERNE,47700,CASTELJALOUX,,,47052,,,,,,,,,,,,,,,,,,,1990-09-26,F,,,,,67.08,NAP,N,0.086741,44.314651,0.96,housenumber,11 Rue Posterne 47700 Casteljaloux,47052_0250_00011,G,11 RUE POSTERNE,
301142956,00012,30114295600012,O,,,,,,true,1,,51,,RUE,DE VEYRIES,47700,CASTELJALOUX,,,47052,,,,,,,,,,,,,,,,,,,1991-08-18,F,,,,,62.43,NAP,N,0.088354,44.315697,0.96,housenumber,51 Rue de Veyries 47700 Casteljaloux,47052_0300_00051,G,51 RUE DE VEYRIES,
301260238,00029,30126023800029,O,2001-08-06,NN,,,2008-11-07T00:17:19,true,3,RTE DE ST MICHEL,,,,PEYRAMA BAS,47700,CASTELJALOUX,,,47052,,,,,,,,,,,,,,,,,,,2005-01-31,F,,,,,45.2V,NAFRev1,N,0.074625,44.307094,0.95,street,Peyrama Bas 47700 Casteljaloux,47052_B108,G,PEYRAMA BAS,
301302592,00011,30130259200011,O,1974-01-01,NN,,,,true,1,,,,PL,JEAN JAURES,47700,CASTELJALOUX,,,47052,,,,,,,,,,,,,,,,,,,2002-06-30,F,,,,,15.8C,NAF1993,O,0.084312,44.313997,0.83,street,Place Jean Jaurès 47700 Casteljaloux,47052_0160,G,PLACE JEAN JAURES,
301335535,00011,30133553500011,O,,,,,,true,1,,,,RTE,DE MARMANDE,47700,CASTELJALOUX,,,47052,,,,,,,,,,,,,,,,,,,1991-12-31,F,,,,,55.10,NAP,N,0.095892,44.325538,0.83,street,Route de Marmande 47700 Casteljaloux,47052_0210,G,ROUTE DE MARMANDE,
301347324,00016,30134732400016,O,,,,,,true,1,,,,PL,GAMBETTA,47700,CASTELJALOUX,,,47052,,,,,,,,,,,,,,,,,,,1984-12-25,F,,,,,64.46,NAP,N,0.085604,44.313956,0.8,street,Place Gambetta 47700 Casteljaloux,47052_0110,G,PLACE GAMBETTA,
301662524,00026,30166252400026,O,,NN,,,,true,1,,6,,CHE,LATERAL A LA GARE,47700,CASTELJALOUX,,,47052,,,,,,,,,,,,,,,,,,,,F,,,,,00.10,NAP,N,0.083286,44.313797,0.34,housenumber,6 Avenue de la Libération 47700 Casteljaloux,47052_0175_00006,G,6 AVENUE DE LA LIBERATION,
301743209,00027,30174320900027,O,1900-01-01,NN,,,2011-04-28T00:10:57,false,3,,,,RTE,DE MARMANDE,47700,CASTELJALOUX,,,47052,,,,,,,,,,,,,,,,,,,1994-12-25,F,,,,,55.3A,NAF1993,O,0.095892,44.325538,0.83,street,Route de Marmande 47700 Casteljaloux,47052_0210,G,ROUTE DE MARMANDE,
301928875,00014,30192887500014,O,,,,,,true,1,,,,RUE,DU TREN,47700,CASTELJALOUX,,,47052,,,,,,,,,,,,,,,,,,,1984-12-25,F,,,,,64.14,NAP,N,0.081727,44.313303,0.96,street,Rue du Tren 47700 Casteljaloux,47052_0290,G,RUE DU TREN,
301976650,00012,30197665000012,O,,,,,,true,1,,,,RUE,DE VEYRIES,47700,CASTELJALOUX,,,47052,,,,,,,,,,,,,,,,,,,1984-12-25,F,,,,,64.12,NAP,N,0.088571,44.315222,0.96,street,Rue de Veyries 47700 Casteljaloux,47052_0300,G,RUE DE VEYRIES,
301976940,00074,30197694000074,O,2011-06-01,,,7420ZQ,2017-01-04T14:07:00,true,2,,,,,MOREY,47700,CASTELJALOUX,,,47052,,,,,,,,,,,,,,,,,,,2015-12-31,F,,,,,74.20Z,NAFRev2,N,0.055058,44.306227,0.93,street,Chemin de Morey 47700 Casteljaloux,47052_0222,G,CHEMIN DE MOREY,
302170089,00023,30217008900023,O,1900-01-01,NN,,,2014-07-08T00:11:35,true,5,,41,,RUE,GRAND RUE,47700,CASTELJALOUX,,,47052,,,,,,,,,,,,,,,,,,,2011-06-30,F,,,,,47.77Z,NAFRev2,O,0.087945,44.314171,0.84,housenumber,41 Grand Rue 47700 Casteljaloux,47052_0130_00041,G,41 GRAND RUE,
302368030,00011,30236803000011,O,1975-01-01,NN,,,2013-08-01T08:43:36,false,4,,,,RUE,GRAND RUE,47700,CASTELJALOUX,,,47052,,,,,,,,,,,,,,,,,,,2002-12-25,F,,,,,52.4E,NAF1993,N,0.088077,44.314045,0.89,street,Grand Rue 47700 Casteljaloux,47052_0130,G,GRAND RUE,
303315451,00011,30331545100011,O,1900-01-01,NN,,,2006-11-25T09:15:48,true,3,,25,,RUE,DE VEYRIES,47700,CASTELJALOUX,,,47052,,,,,,,,,,,,,,,,,,,2004-08-01,F,,,,,85.1E,NAFRev1,N,0.088247,44.314964,0.96,housenumber,25 Rue de Veyries 47700 Casteljaloux,47052_0300_00025,G,25 RUE DE VEYRIES,
303399646,00015,30339964600015,O,,,,,,true,1,,,,,MOULIN DE LAS BOUSSES,47700,CASTELJALOUX,,,47052,,,,,,,,,,,,,,,,,,,1984-12-25,F,,,,,39.01,NAP,N,0.131559,44.323805,0.34,street,Chemin de Labarrière 47700 Casteljaloux,47052_0163,G,CHEMIN DE LABARRIERE,
303457915,00013,30345791500013,O,1975-01-01,11,2019,,2021-10-27T08:14:42,true,5,,,,RTE,DE NERAC,47700,CASTELJALOUX,,,47052,,,,,,,,,,,,,,,,,,,2008-01-01,A,,,,,46.61Z,NAFRev2,O,0.09658,44.300527,0.82,street,Route de Nérac 47700 Casteljaloux,47052_0230,G,ROUTE DE NERAC,
304207525,00011,30420752500011,O,,NN,,,2006-11-25T09:17:03,true,1,,52,,RUE,GRAND RUE,47700,CASTELJALOUX,,,47052,,,,,,,,,,,,,,,,,,,2002-06-07,F,,,,,74.1J,NAF1993,N,0.087989,44.314224,0.84,housenumber,52 Grand Rue 47700 Casteljaloux,47052_0130_00052,G,52 GRAND RUE,
304226582,00027,30422658200027,O,,NN,,,,true,1,,,,AV,DE LA LIBERATION,47700,CASTELJALOUX,,,47052,,,,,,,,,,,,,,,,,,,,F,,,,,67.04,NAP,N,0.082364,44.312528,0.87,street,Avenue de la Libération 47700 Casteljaloux,47052_0175,G,AVENUE DE LA LIBERATION,
304424898,00019,30442489800019,O,,NN,,,,true,1,,57,,RUE,GRAND RUE,47700,CASTELJALOUX,,,47052,,,,,,,,,,,,,,,,,,,1997-11-01,F,,,,,52.4N,NAF1993,O,0.087304,44.314169,0.84,housenumber,57 Grand Rue 47700 Casteljaloux,47052_0130_00057,G,57 GRAND RUE,
304729643,00011,30472964300011,O,,,,,,true,1,,,,PL,JEAN JAURES,47700,CASTELJALOUX,,,47052,,,,,,,,,,,,,,,,,,,1984-12-25,F,,,,,62.11,NAP,N,0.084312,44.313997,0.83,street,Place Jean Jaurès 47700 Casteljaloux,47052_0160,G,PLACE JEAN JAURES,
304762867,00014,30476286700014,O,,NN,,,,true,1,,,,RTE,DE NERAC,47700,CASTELJALOUX,,,47052,,,,,,,,,,,,,,,,,,,,F,,,,,48.01,NAP,N,0.09658,44.300527,0.82,street,Route de Nérac 47700 Casteljaloux,47052_0230,G,ROUTE DE NERAC,
304933336,00014,30493333600014,O,1967-01-01,NN,,,2006-12-15T00:15:49,false,4,,,,RTE,DE NERAC,47700,CASTELJALOUX,,,47052,,,,,,,,,,,,,,,,,,,2002-11-30,F,,,,,70.2C,NAF1993,N,0.09658,44.300527,0.82,street,Route de Nérac 47700 Casteljaloux,47052_0230,G,ROUTE DE NERAC,
304989932,00039,30498993200039,O,,NN,,,,true,1,,2,,RTE,DE BORDEAUX,47700,CASTELJALOUX,,,47052,,,,,,,,,,,,,,,,,,,1987-09-30,F,,,,,64.42,NAP,N,0.079263,44.31881,0.86,housenumber,2 Route de Bordeaux 47700 Casteljaloux,47052_0045_00002,G,2 ROUTE DE BORDEAUX,
305267866,00021,30526786600021,O,1996-06-03,NN,,,2018-03-26T08:38:28,true,4,,3,,PL,DE L EGLISE,47700,CASTELJALOUX,,,47052,,,,,,,,,,,,,,,,,,,2018-03-30,F,,,,,86.90E,NAFRev2,N,0.090142,44.313557,0.85,housenumber,3 Place de l’Eglise 47700 Casteljaloux,47052_0095_00003,G,3 PLACE DE L EGLISE,
305468936,00011,30546893600011,O,,NN,,,,true,1,,,,RUE,DES ARENES,47700,CASTELJALOUX,,,47052,,,,,,,,,,,,,,,,,,,,F,,,,,55.10,NAP,N,0.084471,44.313353,0.96,street,Rue des Arènes 47700 Casteljaloux,47052_0010,G,RUE DES ARENES,
305856460,00012,30585646000012,O,1976-01-01,NN,,,2008-11-07T00:21:35,false,4,RTE DE VILLEFRANCHE,,,,GUICHENE,47700,CASTELJALOUX,,,47052,,,,,,,,,,,,,,,,,,,2004-02-01,F,,,,,45.4F,NAFRev1,O,0.107496,44.310558,0.95,street,Guichene 47700 Casteljaloux,47052_swweau,G,GUICHENE,
305856460,00038,30585646000038,O,1991-07-15,NN,,,,false,3,,35,,RUE,GRAND RUE,47700,CASTELJALOUX,,,47052,,,,,,,,,,,,,,,,,,,1996-11-30,F,PLEINS FEUX,,,,45.2V,NAF1993,N,0.088526,44.314158,0.84,housenumber,35 Grand Rue 47700 Casteljaloux,47052_0130_00035,G,35 GRAND RUE,
305856460,00046,30585646000046,O,2004-02-01,NN,,,2014-07-08T00:13:10,true,4,ZONE INDUSTRIELLE DE BACOU,,,RTE,DE BORDEAUX,47700,CASTELJALOUX,,,47052,,,,,,,,,,,,,,,,,,,2011-09-30,F,,,,,43.33Z,NAFRev2,O,0.071835,44.326729,0.85,street,Route de Bordeaux 47700 Casteljaloux,47052_0045,G,ROUTE DE BORDEAUX,
305856569,00010,30585656900010,O,,,,,,true,1,,,,,LANIN,47700,CASTELJALOUX,,,47052,,,,,,,,,,,,,,,,,,,1992-12-31,F,,,,,45.3E,NAF1993,N,0.100688,44.296136,0.95,street,Lanin 47700 Casteljaloux,47052_8p90en,G,LANIN,
305856577,00013,30585657700013,O,1976-01-01,NN,,,2014-10-14T10:43:44,true,4,RES DES CORDELIERS,,,RUE,DES CORDELIERS,47700,CASTELJALOUX,,,47052,,,,,,,,,,,,,,,,,,,2014-10-14,F,,,,,70.10Z,NAFRev2,N,0.08555,44.313066,0.95,street,Rue des Cordeliers 47700 Casteljaloux,47052_0085,G,RUE DES CORDELIERS,
305856585,00016,30585658500016,O,,NN,,,,true,1,,,,RUE,MAQUEBOEUF,47700,CASTELJALOUX,,,47052,,,,,,,,,,,,,,,,,,,1990-06-30,F,,,,,64.25,NAP,N,0.086865,44.315264,0.96,street,Rue Maqueboeuf 47700 Casteljaloux,47052_0205,G,RUE MAQUEBOEUF,
305856593,00010,30585659300010,O,,NN,,,,true,1,,,,RUE,DES CORDELIERS,47700,CASTELJALOUX,,,47052,,,,,,,,,,,,,,,,,,,1987-06-01,F,,,,,62.46,NAP,N,0.08555,44.313066,0.95,street,Rue des Cordeliers 47700 Casteljaloux,47052_0085,G,RUE DES CORDELIERS,
306004995,00024,30600499500024,O,1988-01-01,NN,,,2006-11-25T09:20:03,true,3,SNC BERNET FRERES,25,,RUE,MAQUEBOEUF,47700,CASTELJALOUX,,,47052,,,,,,,,,,,,,,,,,,,2004-09-30,F,,,,,74.1J,NAFRev1,N,0.087459,44.315266,0.96,housenumber,25 Rue Maqueboeuf 47700 Casteljaloux,47052_0205_00025,G,25 RUE MAQUEBOEUF,