siren,nic,siret,statutDiffusionEtablissement,dateCreationEtablissement,trancheEffectifsEtablissement,anneeEffectifsEtablissement,activitePrincipaleRegistreMetiersEtablissement,dateDernierTraitementEtablissement,etablissementSiege,nombrePeriodesEtablissement,complementAdresseEtablissement,numeroVoieEtablissement,indiceRepetitionEtablissement,typeVoieEtablissement,libelleVoieEtablissement,codePostalEtablissement,libelleCommuneEtablissement,libelleCommuneEtrangerEtablissement,distributionSpecialeEtablissement,codeCommuneEtablissement,codeCedexEtablissement,libelleCedexEtablissement,codePaysEtrangerEtablissement,libellePaysEtrangerEtablissement,complementAdresse2Etablissement,numeroVoie2Etablissement,indiceRepetition2Etablissement,typeVoie2Etablissement,libelleVoie2Etablissement,codePostal2Etablissement,libelleCommune2Etablissement,libelleCommuneEtranger2Etablissement,distributionSpeciale2Etablissement,codeCommune2Etablissement,codeCedex2Etablissement,libelleCedex2Etablissement,codePaysEtranger2Etablissement,libellePaysEtranger2Etablissement,dateDebut,etatAdministratifEtablissement,enseigne1Etablissement,enseigne2Etablissement,enseigne3Etablissement,denominationUsuelleEtablissement,activitePrincipaleEtablissement,nomenclatureActivitePrincipaleEtablissement,caractereEmployeurEtablissement,longitude,latitude,geo_score,geo_type,geo_adresse,geo_id,geo_ligne,geo_l4,geo_l5
215401860,00014,21540186000014,O,1983-03-01,11,2019,,2021-10-27T08:08:52,true,4,,,,RUE,CHATEAU,54690,EULMONT,,,54186,,,,,,,,,,,,,,,,,,,2008-01-01,A,MAIRIE,,,,84.11Z,NAFRev2,O,6.22607,48.751373,0.87,street,Rue du Château 54690 Eulmont,54186_0100,G,RUE DU CHATEAU,
215401860,00030,21540186000030,O,1983-12-21,11,2019,,2021-10-27T08:08:52,false,4,,2,,RUE,DE L'ECOLE,54690,EULMONT,,,54186,,,,,,,,,,,,,,,,,,,2008-01-01,A,ECOLE PRIMAIRE LES VIGNOTTES,,,,85.20Z,NAFRev2,N,6.22433,48.748413,0.72,housenumber,2 Place de l’École 54690 Eulmont,54186_0382_00002,G,2 PLACE DE L ECOLE,
215401860,00048,21540186000048,O,2000-07-01,NN,,,2008-01-04T18:36:09,false,3,MAIRIE,,,RUE,DU CHATEAU,54690,EULMONT,,,54186,,,,,,,,,,,,,,,,,,,2008-01-01,A,LOTISSEMENT COMMUNAL,,,,42.99Z,NAFRev2,N,6.22607,48.751373,0.96,street,Rue du Château 54690 Eulmont,54186_0100,G,RUE DU CHATEAU,
255400277,00018,25540027700018,O,,NN,,,,true,1,,,,RUE,DU CHATEAU,54690,EULMONT,,,54186,,,,,,,,,,,,,,,,,,,1991-01-09,F,,,,,90.12,NAP,N,6.22607,48.751373,0.96,street,Rue du Château 54690 Eulmont,54186_0100,G,RUE DU CHATEAU,
255402992,00010,25540299200010,O,1991-04-10,NN,,,,false,4,MAIRIE,,,,,54690,EULMONT,,,54186,,,,,,,,,,,,,,,,,,,2001-12-25,F,,,,,75.1C,NAF1993,N,6.22272,48.747327,0.38,street,Allee du Poirier 54690 Eulmont,54186_0221,D,ALLEE DU POIRIER,
265403741,00019,26540374100019,O,1992-01-01,NN,,,2008-01-04T19:00:40,true,3,MAIRIE,,,RUE,DU CHATEAU,54690,EULMONT,,,54186,,,,,,,,,,,,,,,,,,,2008-01-01,A,CCAS,,,,88.99B,NAFRev2,N,6.22607,48.751373,0.96,street,Rue du Château 54690 Eulmont,54186_0100,G,RUE DU CHATEAU,
295404610,00012,29540461000012,O,2003-04-01,,,,2009-10-13T10:37:47,true,3,,,,RUE,DU CHATEAU,54690,EULMONT,,,54186,,,,,,,,,,,,,,,,,,,2008-01-01,A,,,,,42.99Z,NAFRev2,N,6.22607,48.751373,0.96,street,Rue du Château 54690 Eulmont,54186_0100,G,RUE DU CHATEAU,
300549995,00011,30054999500011,O,1964-01-01,NN,,,2014-07-08T00:10:52,false,4,,39,,RUE,DU 19 SEPTEMBRE 1944,54690,EULMONT,,,54186,,,,,,,,,,,,,,,,,,,2009-12-31,F,,,,,43.32A,NAFRev2,N,-1.4162672,46.6551366,0.72,poi.garden,Place du 17 Septembre 1944 (Jardin) La Roche-sur-Yon,https://osm.org/way/303671909,G,,
300549995,00029,30054999500029,O,2010-03-01,,,,2016-02-21T04:25:04,true,3,,39,,RUE,DU CHENE,54690,EULMONT,,,54186,,,,,,,,,,,,,,,,,,,2015-12-31,F,,,,,16.23Z,NAFRev2,N,6.22003,48.748899,0.95,housenumber,39 Rue du Chêne 54690 Eulmont,54186_0120_00039,G,39 RUE DU CHENE,
302272919,00036,30227291900036,O,,NN,,,,true,1,,19,,CHE,DE LA TEILLE,54690,EULMONT,,,54186,,,,,,,,,,,,,,,,,,,1997-12-31,F,,,,,74.2A,NAF1993,O,6.219355,48.74969,0.85,housenumber,19 Chemin de la Teille 54690 Eulmont,54186_0290_00019,G,19 CHEMIN DE LA TEILLE,
303898647,00019,30389864700019,O,1975-01-01,NN,,,2016-01-22T12:01:10,true,5,,51,,RUE,DU CHATEAU,54690,EULMONT,,,54186,,,,,,,,,,,,,,,,,,,2008-01-01,A,,,,,68.20B,NAFRev2,N,6.228308,48.752537,0.96,housenumber,51 Rue du Château 54690 Eulmont,54186_0100_00051,G,51 RUE DU CHATEAU,
303898647,00027,30389864700027,O,1976-04-23,NN,,,2016-01-24T03:48:26,false,5,,3,,RUE,DE LA VIERGE,54690,EULMONT,,,54186,,,,,,,,,,,,,,,,,,,2008-01-01,F,,,,,01.11Z,NAFRev2,N,6.225153,48.751639,0.95,housenumber,3 Rue de la Vierge 54690 Eulmont,54186_0340_00003,G,3 RUE DE LA VIERGE,
303924005,00026,30392400500026,O,2021-01-01,,,,2022-02-05T13:34:28,true,1,,,,,2  RUE DU TERRAIL,54690,EULMONT,,,54186,,,,,,,,,,,,,,,,,,,2021-01-01,A,,,,,86.21Z,NAFRev2,N,6.223424,48.750291,0.52,housenumber,2 Rue du Château 54690 Eulmont,54186_0100_00002,G,2 RUE DU CHATEAU,
304845357,00017,30484535700017,O,1975-01-01,NN,,,,true,1,,21,,RUE,DE LA VIERGE,54690,EULMONT,,,54186,,,,,,,,,,,,,,,,,,,2000-12-31,F,,,,,36.1A,NAF1993,O,6.225713,48.752214,0.95,housenumber,21 Rue de la Vierge 54690 Eulmont,54186_0340_00021,G,21 RUE DE LA VIERGE,
305094237,00230,30509423700230,O,2001-01-01,NN,,,,false,3,,,,,,54690,EULMONT,,,54186,,,,,,,,,,,,,,,,,,,2001-12-31,F,,,,,45.2P,NAF1993,N,,,0,,,,,,
309280899,00068,30928089900068,O,2005-01-01,NN,,,2013-02-25T09:16:33,false,3,,,,LD,BRAQUEMINE,54690,EULMONT,,,54186,,,,,,,,,,,,,,,,,,,2013-01-01,F,,,,,01.43Z,NAFRev2,N,6.233622,48.747105,0.92,street,Chemin de Braquemine 54690 Eulmont,54186_a7rp10,G,CHEMIN DE BRAQUEMINE,
310261623,00048,31026162300048,O,1988-09-01,NN,,,2020-08-25T10:24:33,true,5,,2,,CHE,DE METZ,54690,EULMONT,,,54186,,,,,,,,,,,,,,,,,,,2012-01-01,A,,,,,47.79Z,NAFRev2,N,6.228743,48.753029,0.68,housenumber,2 Rue de Metz 54690 Eulmont,54186_iaxgrx_00002,G,2 RUE DE METZ,
310726070,00017,31072607000017,O,1977-01-01,01,2019,4334ZC,2021-10-27T08:17:19,true,6,,,,CHE,DE LA VOIVRE,54690,EULMONT,,,54186,,,,,,,,,,,,,,,,,,,2015-12-18,A,,,,,43.34Z,NAFRev2,N,6.22084,48.748107,0.62,street,Chemin de Voivre 54690 Eulmont,54186_0360,G,CHEMIN DE VOIVRE,
311514053,00017,31151405300017,O,,NN,,,,true,1,,55,,RUE,DU CHATEAU,54690,EULMONT,,,54186,,,,,,,,,,,,,,,,,,,1987-10-01,F,,,,,64.25,NAP,N,6.228563,48.752854,0.96,housenumber,55 Rue du Château 54690 Eulmont,54186_0100_00055,G,55 RUE DU CHATEAU,
311664635,00027,31166463500027,O,,NN,,,,true,1,,,,,FERME FOSSE,54690,EULMONT,,,54186,,,,,,,,,,,,,,,,,,,,F,,,,,41.02,NAP,N,-0.948524,49.387166,0.88,poi.guest_house,Ferme de la Rouge Fosse (Maison d'hôte) Englesqueville-la-Percée,https://osm.org/way/262826792,G,,
317475986,00020,31747598600020,O,1985-01-01,NN,,,,true,1,,,,CHE,DE LAY SAINT CHRISTOPHE,54690,EULMONT,,,54186,,,,,,,,,,,,,,,,,,,1992-03-28,F,,,,,73.1Z,NAF1993,N,6.218716,48.749274,0.91,street,Chemin de Lay Saint Christophe 54690 Eulmont,54186_0160,G,CHEMIN DE LAY SAINT CHRISTOPHE,
319823274,00018,31982327400018,O,,,,,,true,1,,,,RTE,DE NOMENY,54690,EULMONT,,,54186,,,,,,,,,,,,,,,,,,,1989-11-14,F,,,,,55.72,NAP,N,6.227083,48.747942,0.82,street,Route de Nomeny 54690 Eulmont,54186_0240,G,ROUTE DE NOMENY,
320071111,00027,32007111100027,O,,NN,,,,true,1,,,,CHE,DU VAL,54690,EULMONT,,,54186,,,,,,,,,,,,,,,,,,,1987-09-15,F,,,,,78.02,NAP,N,6.229847,48.754573,0.78,street,Chemin du Val 54690 Eulmont,54186_0300,G,CHEMIN DU VAL,
320906431,00012,32090643100012,O,,,,,,true,1,,42,,RUE,DU 19 SEPTEMBRE 1944,54690,EULMONT,,,54186,,,,,,,,,,,,,,,,,,,1985-12-25,F,,,,,69.23,NAP,N,-1.4162672,46.6551366,0.72,poi.garden,Place du 17 Septembre 1944 (Jardin) La Roche-sur-Yon,https://osm.org/way/303671909,G,,
321989824,00016,32198982400016,O,1981-02-01,NN,,,,true,1,,,,RTE,DE LAY ST CHRISTOPHE,54690,EULMONT,,,54186,,,,,,,,,,,,,,,,,,,2000-01-31,F,,,,,61.2Z,NAF1993,N,6.218716,48.749274,0.73,street,Chemin de Lay Saint Christophe 54690 Eulmont,54186_0160,G,CHEMIN DE LAY SAINT CHRISTOPHE,
323366930,00010,32336693000010,O,,NN,,,,true,1,,7,,RUE,DU 19 SEPTEMBRE 1944,54690,EULMONT,,,54186,,,,,,,,,,,,,,,,,,,1989-12-18,F,,,,,64.49,NAP,N,-1.4162672,46.6551366,0.72,poi.garden,Place du 17 Septembre 1944 (Jardin) La Roche-sur-Yon,https://osm.org/way/303671909,G,,
324058643,00010,32405864300010,O,,,,,,true,1,,70,,RUE,DU CHATEAU,54690,EULMONT,,,54186,,,,,,,,,,,,,,,,,,,1984-12-25,F,,,,,55.73,NAP,N,6.228155,48.752154,0.96,housenumber,70 Rue du Château 54690 Eulmont,54186_0100_00070,G,70 RUE DU CHATEAU,
324910454,00010,32491045400010,O,,NN,,,,true,1,,,,CHE,DES MONTANTS,54690,EULMONT,,,54186,,,,,,,,,,,,,,,,,,,1995-05-15,F,,,,,80.4C,NAF1993,N,6.23379,48.750947,0.84,street,Chemin des Montants 54690 Eulmont,54186_0170,G,CHEMIN DES MONTANTS,
329079578,00020,32907957800020,O,2002-02-01,NN,,,,true,1,,2,,ALL,DES ACACIAS,54690,EULMONT,,,54186,,,,,,,,,,,,,,,,,,,2002-12-19,F,,,,,51.1R,NAF1993,N,6.223339,48.749021,0.84,housenumber,2 Allee des Acacias 54690 Eulmont,54186_0383_00002,G,2 ALLEE DES ACACIAS,
329116776,00017,32911677600017,O,,NN,,,,true,1,,5,,RUE,DE NANCY,54690,EULMONT,,,54186,,,,,,,,,,,,,,,,,,,1995-12-25,F,,,,,70.2A,NAF1993,N,6.223921,48.748668,0.84,street,Rue de Nancy 54690 Eulmont,54186_0200,G,RUE DE NANCY,
330008632,00052,33000863200052,O,2007-12-30,NN,,,2019-10-29T08:32:59,false,3,,3,,CHE,DU VAL,54690,EULMONT,,,54186,,,,,,,,,,,,,,,,,,,2019-08-31,F,,,,,68.20A,NAFRev2,O,6.229619,48.754183,0.8,housenumber,3 Chemin du Val 54690 Eulmont,54186_0300_00003,G,3 CHEMIN DU VAL,
331572859,00022,33157285900022,O,2013-01-01,,,4334ZC,2016-07-18T09:17:30,false,2,,692,,CHE,DES MONTANTS,54690,EULMONT,,,54186,,,,,,,,,,,,,,,,,,,2016-05-01,F,,,,,43.34Z,NAFRev2,N,6.233631,48.750039,0.87,housenumber,692 Chemin des Montants 54690 Eulmont,54186_0170_00692,G,692 CHEMIN DES MONTANTS,
331572859,00030,33157285900030,O,2016-05-01,,,,2021-07-21T16:35:13,true,2,,46,,RTE,DE NOMENY,54690,EULMONT,,,54186,,,,,,,,,,,,,,,,,,,2020-12-31,F,,,,,43.34Z,NAFRev2,N,6.222223,48.745944,0.85,housenumber,46 Route de Nomeny 54690 Eulmont,54186_0240_00046,G,46 ROUTE DE NOMENY,
332243203,00012,33224320300012,O,,NN,,,,true,1,,2,,CHE,DU VAL,54690,EULMONT,,,54186,,,,,,,,,,,,,,,,,,,,F,,,,,69.23,NAP,N,6.229517,48.753532,0.8,housenumber,2 Chemin du Val 54690 Eulmont,54186_0300_00002,G,2 CHEMIN DU VAL,
332915610,00015,33291561000015,O,1985-06-26,NN,,,,true,1,,46,,RUE,DU CHENE,54690,EULMONT,,,54186,,,,,,,,,,,,,,,,,,,2001-03-31,F,,,,,45.4D,NAF1993,N,6.220339,48.74903,0.95,housenumber,46 Rue du Chêne 54690 Eulmont,54186_0120_00046,G,46 RUE DU CHENE,
333519684,00018,33351968400018,O,,,,,,true,1,,13,,RUE,DE NANCY,54690,EULMONT,,,54186,,,,,,,,,,,,,,,,,,,1988-01-26,F,,,,,58.01,NAP,N,6.223921,48.748668,0.79,street,Rue de Nancy 54690 Eulmont,54186_0200,G,RUE DE NANCY,
343564639,00015,34356463900015,O,1988-01-10,NN,,,2008-11-08T00:18:01,false,4,,29,,RUE,DU CHATEAU,54690,EULMONT,,,54186,,,,,,,,,,,,,,,,,,,1996-12-25,F,,,,,25.2C,NAF1993,O,6.226986,48.751648,0.96,housenumber,29 Rue du Château 54690 Eulmont,54186_0100_00029,G,29 RUE DU CHATEAU,
343564639,00023,34356463900023,O,1996-01-01,12,2019,,2021-10-27T08:36:10,true,6,,840,,CHE,DES MONTANTS,54690,EULMONT,,,54186,,,,,,,,,,,,,,,,,,,2020-09-25,A,A. S. P.,,,ADVANCED SYSTEMS OF PROTECTION,22.29B,NAFRev2,O,6.233519,48.7489,0.87,housenumber,840 Chemin des Montants 54690 Eulmont,54186_0170_00840,G,840 CHEMIN DES MONTANTS,
343774030,00021,34377403000021,O,1989-09-01,NN,,,,false,4,,9,,RUE,DU CHATEAU,54690,EULMONT,,,54186,,,,,,,,,,,,,,,,,,,2001-07-18,F,,,,,85.1C,NAF1993,O,6.224013,48.750571,0.96,housenumber,9 Rue du Château 54690 Eulmont,54186_0100_00009,G,9 RUE DU CHATEAU,
343774030,00039,34377403000039,O,2001-07-18,NN,,,2019-01-07T08:40:59,true,4,,16,,RUE,DU CHATEAU,54690,EULMONT,,,54186,,,,,,,,,,,,,,,,,,,2018-11-06,A,,,,,86.21Z,NAFRev2,N,6.224392,48.750535,0.96,housenumber,16 Rue du Château 54690 Eulmont,54186_0100_00016,G,16 RUE DU CHATEAU,
344005814,00050,34400581400050,O,2011-04-20,,,,2013-01-11T04:27:35,true,2,,36,,RUE,DU CHATEAU,54690,EULMONT,,,54186,,,,,,,,,,,,,,,,,,,2012-01-01,F,,,,,46.19B,NAFRev2,N,6.22625,48.751325,0.96,housenumber,36 Rue du Château 54690 Eulmont,54186_0100_00036,G,36 RUE DU CHATEAU,
348740119,00063,34874011900063,O,2008-10-06,,,,2021-02-23T11:01:42,true,1,,66,,RUE,DU CHATEAU,54690,EULMONT,,,54186,,,,,,,,,,,,,,,,,,,2008-10-06,A,,,,,73.12Z,NAFRev2,N,6.227834,48.752066,0.96,housenumber,66 Rue du Château 54690 Eulmont,54186_0100_00066,G,66 RUE DU CHATEAU,
349173195,00018,34917319500018,O,,NN,,,,true,1,,,,RTE,DE NOMENY,54690,EULMONT,,,54186,,,,,,,,,,,,,,,,,,,1992-12-31,F,,,,,01.2J,NAF1993,N,6.227083,48.747942,0.82,street,Route de Nomeny 54690 Eulmont,54186_0240,G,ROUTE DE NOMENY,
349180588,00015,34918058800015,O,1988-09-01,,,,,false,3,,,,,FERME DE LA FOSSE,54690,EULMONT,,,54186,,,,,,,,,,,,,,,,,,,1997-09-12,F,,,,,01.2C,NAF1993,N,3.9709222,47.8564722,0.89,poi.guest_house,Ferme de la Fosse Dionne (Maison d'hôte) Tonnerre,https://osm.org/way/70592952,G,,
349280974,00016,34928097400016,O,1989-01-01,NN,,,2008-01-04T23:02:08,true,3,,15,B,RTE,DE NOMENY,54690,EULMONT,,,54186,,,,,,,,,,,,,,,,,,,2008-01-01,A,,,,,68.20A,NAFRev2,N,6.227083,48.747942,0.65,street,Route de Nomeny 54690 Eulmont,54186_0240,G,ROUTE DE NOMENY,
350324927,00028,35032492700028,O,1996-01-01,NN,,8292ZZ,2019-06-24T13:04:38,true,4,,840,,CHE,DES MONTANTS,54690,EULMONT,,,54186,,,,,,,,,,,,,,,,,,,2017-03-30,F,,,,,47.52A,NAFRev2,O,6.233519,48.7489,0.87,housenumber,840 Chemin des Montants 54690 Eulmont,54186_0170_00840,G,840 CHEMIN DES MONTANTS,
350611778,00027,35061177800027,O,1992-03-09,NN,,,2008-11-08T00:26:29,false,4,,681,,RTE,DE NOMENY,54690,EULMONT,,,54186,,,,,,,,,,,,,,,,,,,1997-05-01,F,,,,,33.1B,NAF1993,O,6.229272,48.74816,0.86,housenumber,681 Route de Nomeny 54690 Eulmont,54186_0240_00681,G,681 ROUTE DE NOMENY,
351794326,00014,35179432600014,O,1989-07-01,01,2019,,2021-10-27T08:02:23,true,7,,,,,,54690,EULMONT,,,54186,,,,,,,,,,,,,,,,,,,2012-08-13,A,,,,,94.99Z,NAFRev2,O,,,0,,,,,,
353762941,00014,35376294100014,O,1989-05-19,NN,,,2006-11-25T11:17:41,false,4,,365,,CHE,DES MONTANTS,54690,EULMONT,,,54186,,,,,,,,,,,,,,,,,,,2000-07-01,F,,,,,72.2Z,NAF1993,N,6.233727,48.752786,0.87,housenumber,365 Chemin des Montants 54690 Eulmont,54186_0170_00365,G,365 CHEMIN DES MONTANTS,
353872393,00023,35387239300023,O,1900-01-01,,,,2018-05-18T10:48:25,false,3,,710,,RTE,DE NOMEXY,54690,EULMONT,,,54186,,,,,,,,,,,,,,,,,,,1991-12-25,F,,,,,55.60,NAP,N,6.229855,48.748048,0.71,housenumber,710 Route de Nomeny 54690 Eulmont,54186_0240_00710,G,710 ROUTE DE NOMENY,
379544679,00028,37954467900028,O,1990-10-01,NN,,,2014-07-08T01:03:13,false,4,,7,,RUE,DE NOMENY,54690,EULMONT,,,54186,,,,,,,,,,,,,,,,,,,2011-01-18,F,,,,,43.22A,NAFRev2,N,6.229771,48.748423,0.84,street,Rue de Nomeny 54690 Eulmont,54186_0220,G,RUE DE NOMENY,
379996598,00015,37999659800015,O,1990-11-19,NN,,,2008-11-08T00:36:50,true,3,,5,,RUE,DE LA VIERGE,54690,EULMONT,,,54186,,,,,,,,,,,,,,,,,,,2006-07-20,F,,,,,50.2Z,NAFRev1,N,6.22542,48.751791,0.95,housenumber,5 Rue de la Vierge 54690 Eulmont,54186_0340_00005,G,5 RUE DE LA VIERGE,
380072710,00011,38007271000011,O,1990-04-08,NN,,,2010-12-08T11:21:42,true,3,,103,,RUE,DE NANCY,54690,EULMONT,,,54186,,,,,,,,,,,,,,,,,,,2008-01-01,A,,,,,01.49Z,NAFRev2,N,6.223849,48.749393,0.95,housenumber,103 Rue de Nancy 54690 Eulmont,54186_0200_00103,G,103 RUE DE NANCY,
383136827,00045,38313682700045,O,2000-07-03,NN,,,,false,4,,365,,CHE,DES MONTANTS,54690,EULMONT,,,54186,,,,,,,,,,,,,,,,,,,2001-03-12,F,,,,,85.1E,NAF1993,N,6.233727,48.752786,0.87,housenumber,365 Chemin des Montants 54690 Eulmont,54186_0170_00365,G,365 CHEMIN DES MONTANTS,
384865580,00011,38486558000011,O,1991-04-15,NN,,,2006-10-28T01:09:31,true,3,,94,,CHE,DE LAY,54690,EULMONT,,,54186,,,,,,,,,,,,,,,,,,,2004-12-31,F,,,,,73.1Z,NAFRev1,N,6.218277,48.749203,0.86,housenumber,94 Chemin de Lay Saint Christophe 54690 Eulmont,54186_0160_00094,G,94 CHEM DE LAY SAINT CHRISTOPHE,
384908745,00019,38490874500019,O,1992-02-25,NN,,,2008-01-04T22:46:44,true,3,,100,,ALL,DES PLANTES,54690,EULMONT,,,54186,,,,,,,,,,,,,,,,,,,2008-01-01,A,,,,,94.99Z,NAFRev2,N,6.23458,48.749858,0.86,housenumber,100 Allée des Plantes 54690 Eulmont,54186_0281_00100,G,100 ALLEE DES PLANTES,
390214369,00014,39021436900014,O,1992-12-07,NN,,,,false,4,,225,,ALL,DES VIEUX JARDINS,54690,EULMONT,,,54186,,,,,,,,,,,,,,,,,,,1998-01-29,F,,,,,92.4Z,NAF1993,N,6.224914,48.748755,0.88,housenumber,225 Allée des Vieux Jardins 54690 Eulmont,54186_0140_00225,G,225 ALLEE DES VIEUX JARDINS,
390300796,00054,39030079600054,O,2004-12-08,NN,,,2008-01-04T23:38:11,false,3,,1,,RUE,DU CHENE,54690,EULMONT,,,54186,,,,,,,,,,,,,,,,,,,2008-01-01,A,,,,,68.20B,NAFRev2,N,6.222959,48.749969,0.95,housenumber,1 Rue du Chêne 54690 Eulmont,54186_0120_00001,G,1 RUE DU CHENE,
390341980,00022,39034198000022,O,2016-09-01,,,,2021-02-23T11:16:16,true,1,,562,,RTE,DE NOMENY,54690,EULMONT,,,54186,,,,,,,,,,,,,,,,,,,2016-09-01,A,,,,,68.20A,NAFRev2,N,6.227963,48.748008,0.86,housenumber,562 Route de Nomeny 54690 Eulmont,54186_0240_00562,G,562 ROUTE DE NOMENY,
390592186,00014,39059218600014,O,1993-01-11,NN,,,2008-11-08T00:52:49,false,4,,681,,RTE,DE NOMENY,54690,EULMONT,,,54186,,,,,,,,,,,,,,,,,,,1997-05-01,F,,,,,33.1B,NAF1993,O,6.229272,48.74816,0.86,housenumber,681 Route de Nomeny 54690 Eulmont,54186_0240_00681,G,681 ROUTE DE NOMENY,
392010146,00018,39201014600018,O,1991-01-01,NN,,,2012-07-28T12:28:38,true,4,,,,,,54690,EULMONT,,,54186,,,,,,,,,,,,,,,,,,,2008-12-25,F,,,,,01.11Z,NAFRev2,N,,,0,,,,,,
392131678,00022,39213167800022,O,1997-04-01,,,,2008-01-05T00:01:29,true,3,,21,B,RUE,DE LA VIERGE,54690,EULMONT,,,54186,,,,,,,,,,,,,,,,,,,2008-01-01,A,,,,,93.12Z,NAFRev2,N,6.225737,48.752452,0.86,housenumber,21bis Rue de la Vierge 54690 Eulmont,54186_0340_00021_bis,G,21BIS RUE DE LA VIERGE,
393034194,00067,39303419400067,O,2002-02-05,NN,,,2009-06-27T07:14:56,false,4,,353,,CHE,DE VOIVRE,54690,EULMONT,,,54186,,,,,,,,,,,,,,,,,,,2008-01-01,F,,,,,63.11Z,NAFRev2,O,6.218923,48.747838,0.85,housenumber,353 Chemin de Voivre 54690 Eulmont,54186_0360_00353,G,353 CHEMIN DE VOIVRE,
394139729,00054,39413972900054,O,2016-09-01,,,,2016-11-16T14:00:37,true,1,DOMAINE DU PRE HARBOIS,,,ALL,DES VERGERS,54690,EULMONT,,,54186,,,,,,,,,,,,,,,,,,,2016-09-01,A,,,,,86.90F,NAFRev2,N,6.231602,48.748971,0.84,street,Allée des Vergers 54690 Eulmont,54186_0330,G,ALLEE DES VERGERS,
398336115,00017,39833611500017,O,1993-01-01,NN,,,,false,4,,94,,CHE,DE LAY,54690,EULMONT,,,54186,,,,,,,,,,,,,,,,,,,1998-01-01,F,,,,,74.8K,NAF1993,N,6.218277,48.749203,0.86,housenumber,94 Chemin de Lay Saint Christophe 54690 Eulmont,54186_0160_00094,G,94 CHEM DE LAY SAINT CHRISTOPHE,
398832584,00021,39883258400021,O,2017-03-14,,,,2021-02-23T11:22:37,true,1,,127,,ALL,DES PLANTES,54690,EULMONT,,,54186,,,,,,,,,,,,,,,,,,,2017-03-14,A,,,,,41.10D,NAFRev2,N,6.234546,48.750083,0.86,housenumber,127 Allée des Plantes 54690 Eulmont,54186_0281_00127,G,127 ALLEE DES PLANTES,
401044847,00010,40104484700010,O,1995-05-02,NN,,,2018-02-14T08:13:56,true,3,,840,,CHE,DES MONTANTS,54690,EULMONT,,,54186,,,,,,,,,,,,,,,,,,,2008-01-01,A,,,,,68.20A,NAFRev2,N,6.233519,48.7489,0.87,housenumber,840 Chemin des Montants 54690 Eulmont,54186_0170_00840,G,840 CHEMIN DES MONTANTS,
401964127,00013,40196412700013,O,1995-08-01,NN,,,2013-10-22T14:58:35,false,4,,317,,CHE,DE VOIVRE,54690,EULMONT,,,54186,,,,,,,,,,,,,,,,,,,1998-08-31,F,,,,,72.4Z,NAF1993,N,6.219311,48.747919,0.85,housenumber,317 Chemin de Voivre 54690 Eulmont,54186_0360_00317,G,317 CHEMIN DE VOIVRE,
403904667,00025,40390466700025,O,1999-05-01,01,2019,,2021-10-27T08:30:10,true,4,,18,,ALL,DES VIEUX JARDINS,54690,EULMONT,,,54186,,,,,,,,,,,,,,,,,,,2013-12-31,A,,,,,81.30Z,NAFRev2,O,6.224597,48.750409,0.88,housenumber,18 Allée des Vieux Jardins 54690 Eulmont,54186_0140_00018,G,18 ALLEE DES VIEUX JARDINS,
404673436,00014,40467343600014,O,1996-04-03,NN,,,2006-11-25T15:08:49,true,3,,48,B,RUE,DU CHENE,54690,EULMONT,,,54186,,,,,,,,,,,,,,,,,,,2006-03-31,F,,,,,70.1F,NAFRev1,N,6.219749,48.749133,0.85,housenumber,48bis Rue du Chêne 54690 Eulmont,54186_0120_00048_bis,G,48BIS RUE DU CHENE,
408781524,00025,40878152400025,O,1999-11-24,NN,,,2008-01-05T20:23:49,true,3,M.SERGE MARCHAL,378,,CHE,DE LA VOIVRE,54690,EULMONT,,,54186,,,,,,,,,,,,,,,,,,,2008-01-01,A,,,,,68.20B,NAFRev2,N,6.218504,48.747858,0.68,housenumber,378 Chemin de Voivre 54690 Eulmont,54186_0360_00378,G,378 CHEMIN DE VOIVRE,
409078003,00012,40907800300012,O,,NN,,,,true,1,,3,,RUE,DE LA VIERGE,54690,EULMONT,,,54186,,,,,,,,,,,,,,,,,,,1997-12-31,F,,,,,01.1F,NAF1993,N,6.225153,48.751639,0.95,housenumber,3 Rue de la Vierge 54690 Eulmont,54186_0340_00003,G,3 RUE DE LA VIERGE,
413511445,00012,41351144500012,O,1997-08-01,NN,,,2008-01-04T22:34:26,true,4,,840,,CHE,DES MONTANTS,54690,EULMONT,,,54186,,,,,,,,,,,,,,,,,,,2008-01-01,A,,,,,78.30Z,NAFRev2,N,6.233519,48.7489,0.87,housenumber,840 Chemin des Montants 54690 Eulmont,54186_0170_00840,G,840 CHEMIN DES MONTANTS,
414057315,00023,41405731500023,O,2017-03-14,,,,2021-02-23T11:36:25,true,1,,127,,ALL,DES PLANTES,54690,EULMONT,,,54186,,,,,,,,,,,,,,,,,,,2017-03-14,A,,,,,68.20B,NAFRev2,N,6.234546,48.750083,0.86,housenumber,127 Allée des Plantes 54690 Eulmont,54186_0281_00127,G,127 ALLEE DES PLANTES,
414492488,00054,41449248800054,O,2010-09-01,,,,2021-10-09T20:07:52,false,2,,353,,CHE,DE VOIVRE,54690,EULMONT,,,54186,,,,,,,,,,,,,,,,,,,2016-12-31,F,,,,,86.21Z,NAFRev2,N,6.218923,48.747838,0.85,housenumber,353 Chemin de Voivre 54690 Eulmont,54186_0360_00353,G,353 CHEMIN DE VOIVRE,
417648227,00011,41764822700011,O,1998-01-01,NN,,,2008-01-04T23:08:22,true,3,,35,,RUE,DU 19 SEPTEMBRE 1944,54690,EULMONT,,,54186,,,,,,,,,,,,,,,,,,,2008-01-01,A,,,,,02.20Z,NAFRev2,N,-1.4162672,46.6551366,0.72,poi.garden,Place du 17 Septembre 1944 (Jardin) La Roche-sur-Yon,https://osm.org/way/303671909,G,,
418718425,00022,41871842500022,O,2001-09-01,,,,,true,1,,80,,ALL,DES VIEUX JARDINS,54690,EULMONT,,,54186,,,,,,,,,,,,,,,,,,,2001-12-31,F,,,,,45.2J,NAF1993,N,6.224897,48.749882,0.88,housenumber,80 Allée des Vieux Jardins 54690 Eulmont,54186_0140_00080,G,80 ALLEE DES VIEUX JARDINS,
418718532,00025,41871853200025,O,2001-09-01,NN,,,,true,1,,80,,ALL,DES VIEUX JARDINS,54690,EULMONT,,,54186,,,,,,,,,,,,,,,,,,,2001-12-10,F,,,,,45.2J,NAF1993,O,6.224897,48.749882,0.88,housenumber,80 Allée des Vieux Jardins 54690 Eulmont,54186_0140_00080,G,80 ALLEE DES VIEUX JARDINS,
419938840,00016,41993884000016,O,1998-04-01,NN,,,,false,4,,205,,CHE,DES MONTANTS,54690,EULMONT,,,54186,,,,,,,,,,,,,,,,,,,2002-01-01,F,,,,,85.1G,NAF1993,N,6.231737,48.753083,0.87,housenumber,205 Chemin des Montants 54690 Eulmont,54186_0170_00205,G,205 CHEMIN DES MONTANTS,
420017774,00019,42001777400019,O,1998-09-02,NN,,,2012-01-26T04:55:15,true,4,,166,,ALL,DES PLANTES,54690,EULMONT,,,54186,,,,,,,,,,,,,,,,,,,2009-06-30,A,,,,,47.81Z,NAFRev2,N,6.233828,48.749535,0.86,housenumber,166 Allée des Plantes 54690 Eulmont,54186_0281_00166,G,166 ALLEE DES PLANTES,
422832469,00015,42283246900015,O,1999-05-03,NN,,,,false,4,,156,,CHE,,54690,EULMONT,,,54186,,,,,,,,,,,,,,,,,,,2001-01-02,F,,,,,72.1Z,NAF1993,O,6.221383,48.74819,0.81,housenumber,156 Chemin de Voivre 54690 Eulmont,54186_0360_00156,G,156 CHEMIN DE VOIVRE,
422832469,00023,42283246900023,O,2001-01-02,,,,2008-04-26T14:50:18,false,3,,840,,CHE,DES MONTANTS,54690,EULMONT,,,54186,,,,,,,,,,,,,,,,,,,2006-08-01,F,,,,,72.1Z,NAFRev1,O,6.233519,48.7489,0.87,housenumber,840 Chemin des Montants 54690 Eulmont,54186_0170_00840,G,840 CHEMIN DES MONTANTS,
422861989,00024,42286198900024,O,2001-02-19,NN,,,2008-11-08T01:42:38,false,3,,46,,RUE,DU CHENE,54690,EULMONT,,,54186,,,,,,,,,,,,,,,,,,,2007-06-30,F,,,,,92.7C,NAFRev1,N,6.220339,48.74903,0.95,housenumber,46 Rue du Chêne 54690 Eulmont,54186_0120_00046,G,46 RUE DU CHENE,
423120716,00026,42312071600026,O,2001-01-02,NN,,,2006-11-25T16:27:14,true,3,ALTACOM,840,,CHE,DES MONTANTS,54690,EULMONT,,BP 8,54186,,,,,,,,,,,,,,,,,,,2004-10-17,F,,,,,74.1J,NAFRev1,N,6.233519,48.7489,0.87,housenumber,840 Chemin des Montants 54690 Eulmont,54186_0170_00840,G,840 CHEMIN DES MONTANTS,