siren,nic,siret,statutDiffusionEtablissement,dateCreationEtablissement,trancheEffectifsEtablissement,anneeEffectifsEtablissement,activitePrincipaleRegistreMetiersEtablissement,dateDernierTraitementEtablissement,etablissementSiege,nombrePeriodesEtablissement,complementAdresseEtablissement,numeroVoieEtablissement,indiceRepetitionEtablissement,typeVoieEtablissement,libelleVoieEtablissement,codePostalEtablissement,libelleCommuneEtablissement,libelleCommuneEtrangerEtablissement,distributionSpecialeEtablissement,codeCommuneEtablissement,codeCedexEtablissement,libelleCedexEtablissement,codePaysEtrangerEtablissement,libellePaysEtrangerEtablissement,complementAdresse2Etablissement,numeroVoie2Etablissement,indiceRepetition2Etablissement,typeVoie2Etablissement,libelleVoie2Etablissement,codePostal2Etablissement,libelleCommune2Etablissement,libelleCommuneEtranger2Etablissement,distributionSpeciale2Etablissement,codeCommune2Etablissement,codeCedex2Etablissement,libelleCedex2Etablissement,codePaysEtranger2Etablissement,libellePaysEtranger2Etablissement,dateDebut,etatAdministratifEtablissement,enseigne1Etablissement,enseigne2Etablissement,enseigne3Etablissement,denominationUsuelleEtablissement,activitePrincipaleEtablissement,nomenclatureActivitePrincipaleEtablissement,caractereEmployeurEtablissement,longitude,latitude,geo_score,geo_type,geo_adresse,geo_id,geo_ligne,geo_l4,geo_l5
216703207,00011,21670320700011,O,1983-03-01,02,2019,,2021-10-27T08:09:56,true,4,,15,,RUE,DE L'EGLISE,67220,NEUVE-EGLISE,,,67320,,,,,,,,,,,,,,,,,,,2008-01-01,A,MAIRIE,,,,84.11Z,NAFRev2,O,7.31356,48.330442,0.95,housenumber,15 Rue de l’Eglise 67220 Neuve-Église,67320_0027_00015,G,15 RUE DE L EGLISE,
216703207,00029,21670320700029,O,1983-12-21,02,2019,,2021-10-27T08:09:56,false,3,,15,,RUE,DE L'EGLISE,67220,NEUVE-EGLISE,,,67320,,,,,,,,,,,,,,,,,,,2008-01-01,A,ECOLE PRIMAIRE ETABLISSEMENT CATHOLIQUE,,,,85.20Z,NAFRev2,N,7.31356,48.330442,0.95,housenumber,15 Rue de l’Eglise 67220 Neuve-Église,67320_0027_00015,G,15 RUE DE L EGLISE,
216703207,00037,21670320700037,O,1999-12-25,NN,,,2019-11-14T14:00:53,false,2,MAIRIE,15,,RUE,DE L'EGLISE,67220,NEUVE-EGLISE,,,67320,,,,,,,,,,,,,,,,,,,2008-01-01,A,SERVICE D'EAU,,,,36.00Z,NAFRev2,N,7.31356,48.330442,0.95,housenumber,15 Rue de l’Eglise 67220 Neuve-Église,67320_0027_00015,G,15 RUE DE L EGLISE,
266704022,00018,26670402200018,O,1995-12-25,NN,,,2019-11-14T14:00:53,true,4,MAIRIE,15,,RUE,DE L'EGLISE,67220,NEUVE-EGLISE,,,67320,,,,,,,,,,,,,,,,,,,2017-08-01,F,CCAS,,,,88.99B,NAFRev2,N,7.31356,48.330442,0.95,housenumber,15 Rue de l’Eglise 67220 Neuve-Église,67320_0027_00015,G,15 RUE DE L EGLISE,
296704273,00014,29670427300014,O,1985-03-06,NN,,,2019-11-14T14:00:53,true,3,MAIRIE,15,,RUE,DE L'EGLISE,67220,NEUVE-EGLISE,,,67320,,,,,,,,,,,,,,,,,,,2008-01-01,A,,,,,42.99Z,NAFRev2,N,7.31356,48.330442,0.95,housenumber,15 Rue de l’Eglise 67220 Neuve-Église,67320_0027_00015,G,15 RUE DE L EGLISE,
304762149,00025,30476214900025,O,1900-01-01,NN,,,2019-11-14T14:00:53,true,3,,5,,RUE,DE LA CHAPELLE,67220,NEUVE-EGLISE,,,67320,,,,,,,,,,,,,,,,,,,2004-09-30,F,,,,,52.6E,NAFRev1,N,7.313597,48.326997,0.95,housenumber,5 Rue de la Chapelle 67220 Neuve-Église,67320_0024_00005,G,5 RUE DE LA CHAPELLE,
309265122,00015,30926512200015,O,,NN,,,2019-11-14T14:00:53,true,1,,1,,RUE,DU FRANKENBOURG,67220,NEUVE-EGLISE,,,67320,,,,,,,,,,,,,,,,,,,1990-09-30,F,,,,,49.05,NAP,N,7.315272,48.326436,0.94,housenumber,1 Rue du Frankenbourg 67220 Neuve-Église,67320_0031_00001,G,1 RUE DU FRANKENBOURG,
309633162,00032,30963316200032,O,1982-07-01,NN,,,2019-11-14T14:00:53,false,4,ZONE INDUSTRIELLE,,,RUE,DU CLIMONT,67220,NEUVE-EGLISE,,,67320,,,,,,,,,,,,,,,,,,,2002-01-18,F,,,,,51.6N,NAF1993,N,7.316706,48.337465,0.94,street,Rue du Climont 67220 Neuve-Église,67320_0025,G,RUE DU CLIMONT,
316961275,00047,31696127500047,O,2017-01-04,,,,2021-02-23T10:42:05,true,1,,13,,RUE,DE LA CHAPELLE,67220,NEUVE-EGLISE,,,67320,,,,,,,,,,,,,,,,,,,2017-01-04,A,,,,,70.22Z,NAFRev2,N,7.313422,48.325253,0.95,housenumber,13 Rue de la Chapelle 67220 Neuve-Église,67320_0024_00013,G,13 RUE DE LA CHAPELLE,
317933620,00021,31793362000021,O,1985-10-01,NN,,,2019-11-14T14:00:53,true,3,,,,RUE,DU CLIMONT,67220,NEUVE-EGLISE,,,67320,,,,,,,,,,,,,,,,,,,2006-08-31,F,,,,,70.2C,NAFRev1,N,7.316706,48.337465,0.94,street,Rue du Climont 67220 Neuve-Église,67320_0025,G,RUE DU CLIMONT,
318164423,00028,31816442300028,O,1993-04-01,NN,,,2019-11-14T14:00:53,false,7,ZONE INDUSTRIELLE DE VILLE,,,RUE,DE L ALTENBERG,67220,NEUVE-EGLISE,,,67320,,,,,,,,,,,,,,,,,,,2008-03-31,F,,,,,26.51B,NAFRev2,O,7.30978,48.328945,0.94,street,Rue de l’Altenberg 67220 Neuve-Église,67320_0010,G,RUE DE L ALTENBERG,
318164423,00044,31816442300044,O,2018-05-01,,,,2020-09-04T09:30:12,false,2,,1,B,RUE,JEAN LOUIS GUIOT,67220,NEUVE-EGLISE,,,67320,,,,,,,,,,,,,,,,,,,2020-02-29,A,,,,ESA USINE 2,26.51B,NAFRev2,O,7.31678,48.335989,0.84,street,Rue Jean Louis Guiot 67220 Neuve-Église,67320_0011,G,RUE JEAN LOUIS GUIOT,
318164423,00051,31816442300051,O,2020-03-01,,,,2021-08-01T21:35:38,true,1,,10,,,RTE DE VILLE,67220,NEUVE-EGLISE,,,67320,,,,,,,,,,,,,,,,,,,2020-03-01,A,,,,,26.51B,NAFRev2,O,7.31255,48.336284,0.73,street,Rue de Ville 67220 Neuve-Église,67320_0038,G,RUE DE VILLE,
322597931,00011,32259793100011,O,1981-10-01,NN,,,2019-11-14T14:00:53,true,3,,1,,RUE,ST NICOLAS,67220,NEUVE-EGLISE,,,67320,,,,,,,,,,,,,,,,,,,2008-01-01,A,,,,,47.89Z,NAFRev2,N,7.316168,48.327583,0.84,housenumber,1 Rue Saint Nicolas 67220 Neuve-Église,67320_0042_00001,G,1 RUE SAINT NICOLAS,
323368068,00041,32336806800041,O,2004-10-01,NN,,,2019-11-14T14:00:53,true,4,,7,,RUE,DE L EGLISE,67220,NEUVE-EGLISE,,,67320,,,,,,,,,,,,,,,,,,,2011-10-20,F,,,,,90.03A,NAFRev2,N,7.313685,48.330552,0.95,housenumber,7 Rue de l’Eglise 67220 Neuve-Église,67320_0027_00007,G,7 RUE DE L EGLISE,
324425776,00014,32442577600014,O,,,,,2019-11-14T14:00:53,true,1,,8,,RUE,DU 28 NOVEMBRE,67220,NEUVE-EGLISE,,,67320,,,,,,,,,,,,,,,,,,,1987-07-31,F,,,,,64.49,NAP,N,7.308764,48.329218,0.94,housenumber,8 Rue du 28 Novembre 67220 Neuve-Église,67320_0040_00008,G,8 RUE DU 28 NOVEMBRE,
328364419,00015,32836441900015,O,1983-11-01,NN,,,2019-11-14T14:00:53,true,7,,1,,RUE,DE SAINT MAURICE,67220,NEUVE-EGLISE,,,67320,,,,,,,,,,,,,,,,,,,2015-05-31,F,,,,,68.20B,NAFRev2,N,7.313865,48.329269,0.95,housenumber,1 Rue de Saint Maurice 67220 Neuve-Église,67320_0035_00001,G,1 RUE DE SAINT MAURICE,
330227216,00018,33022721600018,O,1984-07-08,,,,2019-11-14T14:00:53,true,4,,,,,LA BOOS,67220,NEUVE-EGLISE,,,67320,,,,,,,,,,,,,,,,,,,2008-01-01,A,,,,,01.42Z,NAFRev2,N,7.31082,48.330076,0.35,street,Rue de la Vieille Forge 67220 Neuve-Église,67320_0041,G,RUE DE LA VIEILLE FORGE,
332897768,00013,33289776800013,O,1985-04-06,NN,,,2019-11-14T14:00:53,true,4,,15,A,RUE,DE LA CHAPELLE,67220,NEUVE-EGLISE,,,67320,,,,,,,,,,,,,,,,,,,2018-06-30,F,,,,,66.22Z,NAFRev2,N,7.313247,48.32509,0.95,housenumber,15a Rue de la Chapelle 67220 Neuve-Église,67320_0024_00015_a,G,15A RUE DE LA CHAPELLE,
334256989,00032,33425698900032,O,2006-05-02,01,2019,,2021-10-27T08:30:26,true,2,,1,,RUE,DE L UNGERSBERG,67220,NEUVE-EGLISE,,,67320,,,,,,,,,,,,,,,,,,,2008-01-01,A,,,,,47.72A,NAFRev2,O,7.316007,48.338426,0.94,housenumber,1 Rue de l’Ungersberg 67220 Neuve-Église,67320_0045_00001,G,1 RUE DE L UNGERSBERG,
339419582,00020,33941958200020,O,1992-03-16,NN,,,2019-11-14T14:00:53,true,5,ZONE INDUSTRIELLE,,,RUE,DU CLIMONT,67220,NEUVE-EGLISE,,,67320,,,,,,,,,,,,,,,,,,,2009-09-22,F,,,,,22.29A,NAFRev2,O,7.316706,48.337465,0.94,street,Rue du Climont 67220 Neuve-Église,67320_0025,G,RUE DU CLIMONT,
339505364,00010,33950536400010,O,1986-10-18,NN,,,2019-11-14T14:00:53,true,5,,7,,IMP,DE LA CHATAIGNERAIE,67220,NEUVE-EGLISE,,,67320,,,,,,,,,,,,,,,,,,,2006-10-31,F,,,,,45.4A,NAFRev1,N,7.318586,48.326037,0.87,housenumber,7 Impasse de la Chataigneraie 67220 Neuve-Église,67320_0023_00007,G,7 IMPASSE DE LA CHATAIGNERAIE,
339571648,00015,33957164800015,O,1986-12-08,03,2019,4120AZ,2021-10-27T08:32:53,true,4,,3,,RUE,DE SAINT MAURICE,67220,NEUVE-EGLISE,,,67320,,,,,,,,,,,,,,,,,,,2008-01-01,A,,,,,43.99C,NAFRev2,O,7.314129,48.328933,0.95,housenumber,3 Rue de Saint Maurice 67220 Neuve-Église,67320_0035_00003,G,3 RUE DE SAINT MAURICE,
340274760,00024,34027476000024,O,1993-08-01,NN,,,2019-11-14T14:00:53,false,7,ZONE INDUSTRIELLE,6,,RUE,DU CLIMONT,67220,NEUVE-EGLISE,,,67320,,,,,,,,,,,,,,,,,,,2008-01-01,F,,,,,46.52Z,NAFRev2,O,7.316057,48.337302,0.94,housenumber,6 Rue du Climont 67220 Neuve-Église,67320_0025_00006,G,6 RUE DU CLIMONT,
340927474,00023,34092747400023,O,1988-03-01,12,2019,,2021-10-27T08:33:58,true,4,ZONE INDUSTRIELLE DE VILLE,5,,RUE,DU CLIMONT,67220,NEUVE-EGLISE,,,67320,,,,,,,,,,,,,,,,,,,2008-01-01,A,,,,,46.74A,NAFRev2,O,7.316329,48.337452,0.94,housenumber,5 Rue du Climont 67220 Neuve-Église,67320_0025_00005,G,5 RUE DU CLIMONT,
342683000,00034,34268300000034,O,2006-09-01,NN,,,2019-11-14T14:00:53,false,3,,,,RUE,JEAN LOUIS GUIOT,67220,NEUVE-EGLISE,,,67320,,,,,,,,,,,,,,,,,,,2013-05-03,F,,,,,20.42Z,NAFRev2,O,7.31678,48.335989,0.95,street,Rue Jean Louis Guiot 67220 Neuve-Église,67320_0011,G,RUE JEAN LOUIS GUIOT,
344128566,00017,34412856600017,O,,NN,,,2019-11-14T14:00:53,true,1,,10,,RUE,SAINT NICOLAS,67220,NEUVE-EGLISE,,,67320,,,,,,,,,,,,,,,,,,,1988-05-30,F,,,,,51.20,NAP,N,7.317299,48.326952,0.95,housenumber,10 Rue Saint Nicolas 67220 Neuve-Église,67320_0042_00010,G,10 RUE SAINT NICOLAS,
351077227,00012,35107722700012,O,1989-02-02,,,,2019-11-14T14:00:53,false,4,,,,RUE,DE L ALTENBERG,67220,NEUVE-EGLISE,,,67320,,,,,,,,,,,,,,,,,,,1993-12-25,F,,,,,74.1J,NAF1993,N,7.30978,48.328945,0.94,street,Rue de l’Altenberg 67220 Neuve-Église,67320_0010,G,RUE DE L ALTENBERG,
351077227,00038,35107722700038,O,2020-03-01,,,,2021-06-06T20:11:34,true,1,,10,,,RTE DE VILLE,67220,NEUVE-EGLISE,,,67320,,,,,,,,,,,,,,,,,,,2020-03-01,A,,,,,70.10Z,NAFRev2,O,7.31255,48.336284,0.73,street,Rue de Ville 67220 Neuve-Église,67320_0038,G,RUE DE VILLE,
351078951,00016,35107895100016,O,1989-04-24,,,,2019-11-14T14:00:53,false,3,,,,RUE,DE L ALTENBERG,67220,NEUVE-EGLISE,,,67320,,,,,,,,,,,,,,,,,,,2000-06-26,F,,,,,70.2C,NAF1993,N,7.30978,48.328945,0.94,street,Rue de l’Altenberg 67220 Neuve-Église,67320_0010,G,RUE DE L ALTENBERG,
377499926,00022,37749992600022,O,2002-08-01,NN,,,2019-11-14T14:00:53,true,4,,,,RUE,JEAN LOUIS GUIOT,67220,NEUVE-EGLISE,,,67320,,,,,,,,,,,,,,,,,,,2010-03-31,F,,,,,68.20B,NAFRev2,N,7.31678,48.335989,0.95,street,Rue Jean Louis Guiot 67220 Neuve-Église,67320_0011,G,RUE JEAN LOUIS GUIOT,
380113605,00014,38011360500014,O,,NN,,,2019-11-14T14:00:53,true,1,,,,RTE,DE L UNGERSBERG,67220,NEUVE-EGLISE,,,67320,,,,,,,,,,,,,,,,,,,1992-12-25,F,,,,,74.1J,NAF1993,N,7.315789,48.338483,0.8,street,Rue de l’Ungersberg 67220 Neuve-Église,67320_0045,G,RUE DE L UNGERSBERG,
388874877,00011,38887487700011,O,1992-09-01,NN,,4520AB,2019-11-14T14:00:53,true,6,ZA,,,RUE,DU CLIMONT,67220,NEUVE-EGLISE,,,67320,,,,,,,,,,,,,,,,,,,2019-07-15,F,,,,,45.11Z,NAFRev2,N,7.316706,48.337465,0.94,street,Rue du Climont 67220 Neuve-Église,67320_0025,G,RUE DU CLIMONT,
390308898,00019,39030889800019,O,,NN,,,2019-11-14T14:00:53,true,1,,,,RUE,DU CLIMONT,67220,NEUVE-EGLISE,,,67320,,,,,,,,,,,,,,,,,,,1995-11-10,F,,,,,70.2C,NAF1993,N,7.316706,48.337465,0.94,street,Rue du Climont 67220 Neuve-Église,67320_0025,G,RUE DU CLIMONT,
390738573,00018,39073857300018,O,1993-03-01,03,2019,,2021-10-27T08:18:30,true,3,ZI DU CLIMONT,,,RUE,ZI RUE DU CLIMONT,67220,NEUVE-EGLISE,,,67320,,,,,,,,,,,,,,,,,,,2008-01-01,A,,,,,64.20Z,NAFRev2,O,,,0,,,,,,
391726361,00010,39172636100010,O,1993-06-24,,,,2019-11-14T14:00:53,false,3,,,,RUE,DE L UNGERSBERG,67220,NEUVE-EGLISE,,,67320,,,,,,,,,,,,,,,,,,,1993-12-25,F,,,,,35.3B,NAF1993,N,7.315789,48.338483,0.94,street,Rue de l’Ungersberg 67220 Neuve-Église,67320_0045,G,RUE DE L UNGERSBERG,
393199351,00049,39319935100049,O,2013-04-01,,,,2019-11-14T14:00:53,false,2,,5,,,ZI DE HAECHY,67220,NEUVE-EGLISE,,,67320,,,,,,,,,,,,,,,,,,,2014-08-10,F,,,,,86.90E,NAFRev2,N,,,0,,,,,,
393516646,00048,39351664600048,O,2020-01-01,,,8121ZZ,2021-01-27T08:35:23,true,2,,14,,RUE,DE DIEFFENBACH,67220,NEUVE-EGLISE,,,67320,,,,,,,,,,,,,,,,,,,2020-11-16,F,,,,CM MULTISERVICES,81.21Z,NAFRev2,N,7.313425,48.327971,0.95,housenumber,14 Rue de Dieffenbach 67220 Neuve-Église,67320_0026_00014,G,14 RUE DE DIEFFENBACH,
394103899,00024,39410389900024,O,1995-03-01,NN,,2562BZ,2019-11-14T14:00:53,false,5,ZONE INDUSTRIELLE,,,RUE,DU CLIMONT,67220,NEUVE-EGLISE,,,67320,,,,,,,,,,,,,,,,,,,2014-11-13,F,,,,,25.62B,NAFRev2,O,7.316706,48.337465,0.94,street,Rue du Climont 67220 Neuve-Église,67320_0025,G,RUE DU CLIMONT,
394847024,00012,39484702400012,O,1984-01-01,NN,,,2019-11-14T14:00:53,true,4,,10,,RUE,DU VIEIL ETANG,67220,NEUVE-EGLISE,,,67320,,,,,,,,,,,,,,,,,,,2018-12-31,F,,,,,01.43Z,NAFRev2,N,7.312299,48.32858,0.95,housenumber,10 Rue du Vieil Etang 67220 Neuve-Église,67320_0039_00010,G,10 RUE DU VIEIL ETANG,
394847081,00012,39484708100012,O,1900-01-01,,,,2019-11-14T14:00:53,false,3,,118,,,HIRTZELBACH,67220,NEUVE-EGLISE,,,67320,,,,,,,,,,,,,,,,,,,1995-12-31,F,,,,,01.3Z,NAF1993,N,7.313884,48.327541,0.33,street,Rue de Dieffenbach 67220 Neuve-Église,67320_0026,G,RUE DE DIEFFENBACH,
394847081,00020,39484708100020,O,1995-12-31,NN,,,2019-11-14T14:00:53,true,3,,3,,RUE,DES FONTAINES,67220,NEUVE-EGLISE,,,67320,,,,,,,,,,,,,,,,,,,2005-12-15,F,,,,,70.2A,NAFRev1,N,7.322823,48.32129,0.95,interpolation,3 Rue des Fontaines 67220 Neuve-Église,,G,1 RUE DES FONTAINES,
394847404,00016,39484740400016,O,1968-01-01,NN,,,2019-11-14T14:00:53,true,5,HIRTZELBACH,6,,RUE,DES FONTAINES,67220,NEUVE-EGLISE,,,67320,,,,,,,,,,,,,,,,,,,2008-01-01,A,,,,,68.20B,NAFRev2,N,7.322805,48.32143,0.95,housenumber,6 Rue des Fontaines 67220 Neuve-Église,67320_0028_00006,G,6 RUE DES FONTAINES,
395049489,00010,39504948900010,O,,NN,,,2019-11-14T14:00:53,true,1,,7,,RUE,BEAUREGARD,67220,NEUVE-EGLISE,,,67320,,,,,,,,,,,,,,,,,,,1994-06-30,F,,,,,60.2E,NAF1993,N,7.30785,48.329698,0.94,housenumber,7 Rue Beauregard 67220 Neuve-Église,67320_0020_00007,G,7 RUE BEAUREGARD,
395402324,00028,39540232400028,O,2006-01-02,NN,,4211ZB,2019-11-14T14:00:53,true,3,,,,RUE,JEAN-LOUIS GUIOT,67220,NEUVE-EGLISE,,,67320,,,,,,,,,,,,,,,,,,,2012-12-31,F,,,,,43.99C,NAFRev2,O,7.31678,48.335989,0.95,street,Rue Jean Louis Guiot 67220 Neuve-Église,67320_0011,G,RUE JEAN LOUIS GUIOT,
398421172,00014,39842117200014,O,1994-10-01,NN,,,2019-11-14T14:00:53,true,6,,13,,RUE,DU VIEIL ETANG,67220,NEUVE-EGLISE,,,67320,,,,,,,,,,,,,,,,,,,2010-12-31,F,,,,,01.11Z,NAFRev2,N,7.311628,48.328278,0.95,housenumber,13 Rue du Vieil Etang 67220 Neuve-Église,67320_0039_00013,G,13 RUE DU VIEIL ETANG,
399053586,00026,39905358600026,O,1996-03-01,NN,,,2019-11-14T14:00:53,true,1,,,,LD,LA BOSSE,67220,NEUVE-EGLISE,,,67320,,,,,,,,,,,,,,,,,,,1997-12-17,F,,,,,92.7C,NAF1993,N,7.318137,48.326369,0.51,street,Impasse de la Chataigneraie 67220 Neuve-Église,67320_0023,G,IMPASSE DE LA CHATAIGNERAIE,
399953512,00015,39995351200015,O,,NN,,,2019-11-14T14:00:53,true,1,,9,,,CARREFOUR ABBE STACKLER,67220,NEUVE-EGLISE,,,67320,,,,,,,,,,,,,,,,,,,1995-06-15,F,,,,,45.4C,NAF1993,N,7.313075,48.329374,0.95,housenumber,9 Carrefour Abbe Stackler 67220 Neuve-Église,67320_mcgcbd_00009,G,9 CARREFOUR ABBE STACKLER,
400454153,00018,40045415300018,O,1995-04-01,NN,,,2019-11-14T14:00:53,true,5,,2,,RUE,DE LA VIEILLE FORGE,67220,NEUVE-EGLISE,,,67320,,,,,,,,,,,,,,,,,,,2004-12-24,F,,,,,45.4J,NAFRev1,N,7.31183,48.329832,0.95,housenumber,2 Rue de la Vieille Forge 67220 Neuve-Église,67320_0041_00002,G,2 RUE DE LA VIEILLE FORGE,
400531646,00018,40053164600018,O,1995-03-01,NN,,,2019-11-14T14:00:53,true,4,ZONE INDUSTRIELLE,,,RUE,DU CLIMONT,67220,NEUVE-EGLISE,,,67320,,,,,,,,,,,,,,,,,,,2014-12-31,F,,,,,68.20B,NAFRev2,N,7.316706,48.337465,0.94,street,Rue du Climont 67220 Neuve-Église,67320_0025,G,RUE DU CLIMONT,
400600276,00028,40060027600028,O,1998-04-13,NN,,,2019-11-14T14:00:53,true,7,,5,,RTE,DE TRIEMBACH-AU-VAL,67220,NEUVE-EGLISE,,,67320,,,,,,,,,,,,,,,,,,,2017-07-25,F,,,,,70.10Z,NAFRev2,N,7.314825,48.332453,0.62,housenumber,5 Rue de Triembach 67220 Neuve-Église,67320_0037_00005,G,5 RUE DE TRIEMBACH,
401109434,00019,40110943400019,O,1995-05-15,11,2019,,2021-10-27T08:27:27,true,4,ZAC,,,RUE,DE L UNGERSBERG,67220,NEUVE-EGLISE,,,67320,,,,,,,,,,,,,,,,,,,2008-01-01,A,,,,,22.29B,NAFRev2,O,7.315789,48.338483,0.94,street,Rue de l’Ungersberg 67220 Neuve-Église,67320_0045,G,RUE DE L UNGERSBERG,
401489521,00013,40148952100013,O,,NN,,,2019-11-14T14:00:53,true,1,,6,,RUE,BEAU REGARD,67220,NEUVE-EGLISE,,,67320,,,,,,,,,,,,,,,,,,,1996-12-31,F,,,,,51.5E,NAF1993,N,7.316672,48.326663,0.39,housenumber,6 Impasse Beau Site 67220 Neuve-Église,67320_0021_00006,G,6 IMPASSE BEAU SITE,
401625702,00014,40162570200014,O,1994-01-01,NN,,,2019-11-14T14:00:53,true,3,BREITENAU,4,,RUE,DES VIEILLES VIGNES,67220,NEUVE-EGLISE,,,67320,,,,,,,,,,,,,,,,,,,2008-01-01,A,,,,,90.03B,NAFRev2,N,7.29407,48.326542,0.94,housenumber,4 Rue des Vieilles Vignes 67220 Neuve-Église,67320_0049_00004,G,4 RUE DES VIEILLES VIGNES,
403655061,00022,40365506100022,O,2000-08-15,NN,,,2019-11-14T14:00:53,true,4,ZONE INDUSTRIELLE,,,RUE,DE L'ALTENBERG,67220,NEUVE-EGLISE,,,67320,,,,,,,,,,,,,,,,,,,2006-03-21,F,,,,,74.8D,NAFRev1,O,7.30978,48.328945,0.94,street,Rue de l’Altenberg 67220 Neuve-Église,67320_0010,G,RUE DE L ALTENBERG,
404223844,00014,40422384400014,O,1996-02-12,NN,,,2019-11-14T14:00:53,false,4,,,,RUE,DE L'UNGERSBERG,67220,NEUVE-EGLISE,,,67320,,,,,,,,,,,,,,,,,,,2000-12-31,F,,,,,45.2A,NAF1993,O,7.315789,48.338483,0.94,street,Rue de l’Ungersberg 67220 Neuve-Église,67320_0045,G,RUE DE L UNGERSBERG,
408139616,00010,40813961600010,O,1996-05-22,NN,,,2019-11-14T14:00:53,true,4,Z I DU L UNGERSBERG,,,,,67220,NEUVE-EGLISE,,,67320,,,,,,,,,,,,,,,,,,,1999-09-07,F,,,,,51.5A,NAF1993,O,,,0,,,,,,
408863413,00014,40886341300014,O,1964-04-01,NN,,,2019-11-14T14:00:53,true,3,,2,,RUE,DE L EGLISE,67220,NEUVE-EGLISE,,,67320,,,,,,,,,,,,,,,,,,,2008-01-01,A,,,,,63.91Z,NAFRev2,N,7.313439,48.33014,0.95,housenumber,2 Rue de l’Eglise 67220 Neuve-Église,67320_0027_00002,G,2 RUE DE L EGLISE,
409171899,00019,40917189900019,O,1996-09-18,NN,,,2019-11-14T14:00:53,false,4,ZAC DE VILLE,,,RUE,DU CLIMONT,67220,NEUVE-EGLISE,,,67320,,,,,,,,,,,,,,,,,,,1998-05-28,F,,,,,74.1J,NAF1993,N,7.316706,48.337465,0.94,street,Rue du Climont 67220 Neuve-Église,67320_0025,G,RUE DU CLIMONT,
409746484,00016,40974648400016,O,1994-04-01,01,2019,,2021-10-27T08:33:13,true,4,HIRTZELBACH,10,,RUE,DES FONTAINES,67220,NEUVE-EGLISE,,,67320,,,,,,,,,,,,,,,,,,,2012-12-31,A,,,,,01.42Z,NAFRev2,O,7.323159,48.321868,0.95,housenumber,10 Rue des Fontaines 67220 Neuve-Église,67320_0028_00010,G,10 RUE DES FONTAINES,
411009699,00017,41100969900017,O,1997-01-02,NN,,,2019-11-14T14:00:53,true,3,,6,,RUE,DU CLIMONT,67220,NEUVE-EGLISE,,,67320,,,,,,,,,,,,,,,,,,,2008-01-01,A,,,,,68.20B,NAFRev2,N,7.316057,48.337302,0.94,housenumber,6 Rue du Climont 67220 Neuve-Église,67320_0025_00006,G,6 RUE DU CLIMONT,
411412497,00017,41141249700017,O,1997-02-01,NN,,,2019-11-14T14:00:53,true,3,,,,RUE,DU CLIMONT,67220,NEUVE-EGLISE,,,67320,,,,,,,,,,,,,,,,,,,2008-01-01,A,,,,,68.20B,NAFRev2,N,7.316706,48.337465,0.94,street,Rue du Climont 67220 Neuve-Église,67320_0025,G,RUE DU CLIMONT,
411589278,00018,41158927800018,O,1997-04-02,03,2019,3312ZA,2021-10-27T08:35:05,true,6,VILLE,1,,RUE,DE SAINT MAURICE,67220,NEUVE-EGLISE,,,67320,,,,,,,,,,,,,,,,,,,2013-12-31,A,SARL SCHILLINGER,,,,01.61Z,NAFRev2,O,7.313865,48.329269,0.95,housenumber,1 Rue de Saint Maurice 67220 Neuve-Église,67320_0035_00001,G,1 RUE DE SAINT MAURICE,
414788802,00034,41478880200034,O,2002-02-24,NN,,,2019-11-14T14:00:53,false,4,ZONE INDUSTRIELLE,,,RUE,D'ALTENBERG,67220,NEUVE-EGLISE,,,67320,,,,,,,,,,,,,,,,,,,2014-07-11,F,,,,,85.51Z,NAFRev2,N,7.30978,48.328945,0.83,street,Rue de l’Altenberg 67220 Neuve-Église,67320_0010,G,RUE DE L ALTENBERG,
417793981,00024,41779398100024,O,2000-07-03,11,2019,4332AA,2021-10-27T08:39:19,true,4,,12,,RUE,DU CLIMONT,67220,NEUVE-EGLISE,,,67320,,,,,,,,,,,,,,,,,,,2008-01-01,A,,,,,43.32A,NAFRev2,O,7.317931,48.337633,0.94,housenumber,12 Rue du Climont 67220 Neuve-Église,67320_0025_00012,G,12 RUE DU CLIMONT,
417807450,00024,41780745000024,O,2002-03-01,01,2019,3312ZA,2021-10-27T08:39:20,false,4,,,,RUE,DU CLIMONT,67220,NEUVE-EGLISE,,,67320,,,,,,,,,,,,,,,,,,,2008-01-01,A,,,,,46.61Z,NAFRev2,O,7.316706,48.337465,0.94,street,Rue du Climont 67220 Neuve-Église,67320_0025,G,RUE DU CLIMONT,
418677738,00050,41867773800050,O,2004-09-01,,,,2019-11-14T14:00:53,true,9,,4,,RUE,DE LA VIEILLE FORGE,67220,NEUVE-EGLISE,,,67320,,,,,,,,,,,,,,,,,,,2019-02-22,F,,,,,71.12B,NAFRev2,N,7.311654,48.329938,0.95,housenumber,4 Rue de la Vieille Forge 67220 Neuve-Église,67320_0041_00004,G,4 RUE DE LA VIEILLE FORGE,
419853999,00011,41985399900011,O,1998-07-15,NN,,,2019-11-14T14:00:53,true,4,,2,B,RUE,PRINCIPALE HIRTZELBACH,67220,NEUVE-EGLISE,,,67320,,,,,,,,,,,,,,,,,,,2009-03-24,F,,,,,49.41B,NAFRev2,O,7.325166,48.321185,0.55,street,Rue Principale 67220 Neuve-Église,67320_0034,G,RUE PRINCIPALE,
420006231,00021,42000623100021,O,2008-01-01,,,,2021-02-23T11:41:00,true,1,,17,,RUE,SAINT NICOLAS,67220,NEUVE-EGLISE,,,67320,,,,,,,,,,,,,,,,,,,2008-01-01,A,,,,,68.20B,NAFRev2,N,7.317164,48.325941,0.95,housenumber,17 Rue Saint Nicolas 67220 Neuve-Église,67320_0042_00017,G,17 RUE SAINT NICOLAS,
420786709,00022,42078670900022,O,2009-02-14,,,,2021-02-23T11:41:56,true,1,HIRTZELBACH,2,B,RUE,PRINCIPALE,67220,NEUVE-EGLISE,,,67320,,,,,,,,,,,,,,,,,,,2009-02-14,A,PREST'ANNICK,,,,70.22Z,NAFRev2,N,7.325166,48.321185,0.81,street,Rue Principale 67220 Neuve-Église,67320_0034,G,RUE PRINCIPALE,
422463091,00013,42246309100013,O,1999-03-22,NN,,,2019-11-14T14:00:53,true,4,,1,,IMP,DU BEAU SITE,67220,NEUVE-EGLISE,,,67320,,,,,,,,,,,,,,,,,,,2008-01-01,A,,,,,46.90Z,NAFRev2,N,7.316357,48.327,0.7,housenumber,1 Impasse Beau Site 67220 Neuve-Église,67320_0021_00001,G,1 IMPASSE BEAU SITE,
422943696,00019,42294369600019,O,1999-03-15,NN,,3312ZA,2019-11-14T14:00:53,true,6,Z.A,,,RUE,DU CLIMONT,67220,NEUVE-EGLISE,,,67320,,,,,,,,,,,,,,,,,,,2016-10-15,F,,,,,46.61Z,NAFRev2,N,7.316706,48.337465,0.94,street,Rue du Climont 67220 Neuve-Église,67320_0025,G,RUE DU CLIMONT,
424453165,00013,42445316500013,O,1999-06-01,NN,,,2019-11-14T14:00:53,false,3,,10,,RUE,SAINT MAURICE,67220,NEUVE-EGLISE,,,67320,,,,,,,,,,,,,,,,,,,2005-12-14,F,,,,,74.1G,NAFRev1,N,7.315435,48.328806,0.94,housenumber,10 Rue de Saint Maurice 67220 Neuve-Église,67320_0035_00010,G,10 RUE DE SAINT MAURICE,
424453165,00039,42445316500039,O,2012-06-26,,,,2019-11-14T14:00:53,true,1,,9,,,RUE DE SAINT MAURICE,67220,NEUVE-EGLISE,,,67320,,,,,,,,,,,,,,,,,,,2012-06-26,A,,,,,70.22Z,NAFRev2,N,7.315038,48.328965,0.95,housenumber,9 Rue de Saint Maurice 67220 Neuve-Église,67320_0035_00009,G,9 RUE DE SAINT MAURICE,
424865079,00018,42486507900018,O,1999-09-03,NN,,,2019-11-14T14:00:53,true,1,,6,,IMP,DE LA CHATAIGNERAIE,67220,NEUVE-EGLISE,,,67320,,,,,,,,,,,,,,,,,,,2000-01-01,F,,,,,74.8A,NAF1993,N,7.318531,48.326098,0.87,housenumber,6 Impasse de la Chataigneraie 67220 Neuve-Église,67320_0023_00006,G,6 IMPASSE DE LA CHATAIGNERAIE,
428015572,00012,42801557200012,O,1984-01-01,NN,,,2019-11-14T14:00:53,true,3,,23,,RTE,DE DIEFFENBACH,67220,NEUVE-EGLISE,,,67320,,,,,,,,,,,,,,,,,,,2004-09-30,F,,,,,70.2A,NAFRev1,N,7.314328,48.327113,0.82,interpolation,23 Rue de Dieffenbach 67220 Neuve-Église,,G,21 RUE DE DIEFFENBACH,
428216659,00022,42821665900022,O,2003-05-13,21,2019,4722ZA,2021-10-27T08:07:33,true,4,ZAC DU CANTON DE VILLE,,,RUE,DE L'UNGERSBERG,67220,NEUVE-EGLISE,,,67320,,,,,,,,,,,,,,,,,,,2008-01-01,A,,,,,47.11D,NAFRev2,O,7.315789,48.338483,0.94,street,Rue de l’Ungersberg 67220 Neuve-Église,67320_0045,G,RUE DE L UNGERSBERG,
429690720,00017,42969072000017,O,2000-01-01,NN,,,2019-11-14T14:00:53,true,4,,,,RUE,DE L'UNGERSBERG,67220,NEUVE-EGLISE,,,67320,,,,,,,,,,,,,,,,,,,2003-03-31,F,,,,,63.4C,NAFRev1,O,7.315789,48.338483,0.94,street,Rue de l’Ungersberg 67220 Neuve-Église,67320_0045,G,RUE DE L UNGERSBERG,