siren,nic,siret,statutDiffusionEtablissement,dateCreationEtablissement,trancheEffectifsEtablissement,anneeEffectifsEtablissement,activitePrincipaleRegistreMetiersEtablissement,dateDernierTraitementEtablissement,etablissementSiege,nombrePeriodesEtablissement,complementAdresseEtablissement,numeroVoieEtablissement,indiceRepetitionEtablissement,typeVoieEtablissement,libelleVoieEtablissement,codePostalEtablissement,libelleCommuneEtablissement,libelleCommuneEtrangerEtablissement,distributionSpecialeEtablissement,codeCommuneEtablissement,codeCedexEtablissement,libelleCedexEtablissement,codePaysEtrangerEtablissement,libellePaysEtrangerEtablissement,complementAdresse2Etablissement,numeroVoie2Etablissement,indiceRepetition2Etablissement,typeVoie2Etablissement,libelleVoie2Etablissement,codePostal2Etablissement,libelleCommune2Etablissement,libelleCommuneEtranger2Etablissement,distributionSpeciale2Etablissement,codeCommune2Etablissement,codeCedex2Etablissement,libelleCedex2Etablissement,codePaysEtranger2Etablissement,libellePaysEtranger2Etablissement,dateDebut,etatAdministratifEtablissement,enseigne1Etablissement,enseigne2Etablissement,enseigne3Etablissement,denominationUsuelleEtablissement,activitePrincipaleEtablissement,nomenclatureActivitePrincipaleEtablissement,caractereEmployeurEtablissement,longitude,latitude,geo_score,geo_type,geo_adresse,geo_id,geo_ligne,geo_l4,geo_l5
025772203,00011,02577220300011,O,,,,,2019-11-14T14:01:00,true,1,,,,,,79410,SAINT-GELAIS,,,79249,,,,,,,,,,,,,,,,,,,1987-10-31,F,,,,,01.80,NAP,N,,,0,,,,,,
025772286,00016,02577228600016,O,,,,9999ZZ,2019-11-14T14:01:00,true,1,,,,,,79410,SAINT-GELAIS,,,79249,,,,,,,,,,,,,,,,,,,1989-12-14,F,,,,,38.40,NAP,N,,,0,,,,,,
025772500,00010,02577250000010,O,1957-01-01,NN,,,2019-11-14T14:01:00,true,1,,,,,,79410,SAINT-GELAIS,,,79249,,,,,,,,,,,,,,,,,,,1989-02-18,F,,,,,70.2C,NAF1993,N,,,0,,,,,,
025873118,00019,02587311800019,O,,,,,2019-11-14T14:01:00,true,1,,,,,,79410,SAINT-GELAIS,,,79249,,,,,,,,,,,,,,,,,,,1984-12-25,F,,,,,57.02,NAP,N,,,0,,,,,,
026080317,00014,02608031700014,O,,,,,2019-11-14T14:01:00,true,1,,,,,,79410,SAINT-GELAIS,,,79249,,,,,,,,,,,,,,,,,,,1984-12-25,F,,,,,39.08,NAP,N,,,0,,,,,,
026270546,00018,02627054600018,O,,,,,2019-11-14T14:01:00,true,1,,,,LD,MOULIN CHALUSSON,79410,SAINT-GELAIS,,,79249,,,,,,,,,,,,,,,,,,,1984-12-25,F,,,,,39.08,NAP,N,-0.378328,46.375103,0.41,street,Impasse du Moulin de Rhé 79410 Saint-Gelais,79249_0188,G,IMPASSE DU MOULIN DE RHE,
026871681,00016,02687168100016,O,,NN,,,2019-11-14T14:01:00,true,1,,,,,,79410,SAINT-GELAIS,,,79249,,,,,,,,,,,,,,,,,,,,F,,,,,01.80,NAP,N,,,0,,,,,,
026970913,00013,02697091300013,O,1969-01-01,NN,,,2019-11-14T14:01:00,true,4,,,,RTE,D'ECHIRE,79410,SAINT-GELAIS,,,79249,,,,,,,,,,,,,,,,,,,1993-12-25,F,,,,,70.2C,NAF1993,N,-0.394473,46.39692,0.38,street,Route de Suire 79410 Saint-Gelais,79249_0305,G,ROUTE DE SUIRE,
026980060,00037,02698006000037,O,,,,,2019-11-14T14:01:00,true,1,,,,,LES CARREAUX,79410,SAINT-GELAIS,,,79249,,,,,,,,,,,,,,,,,,,1988-09-26,F,,,,,58.06,NAP,N,-0.415662,46.356178,0.79,street,Zone Artisanale des Carreaux 79410 Saint-Gelais,79249_njrom0,G,ZONE ARTISANALE DES CARREAUX,
027171610,00010,02717161000010,O,,,,,2019-11-14T14:01:00,true,1,,,,,,79410,SAINT-GELAIS,,,79249,,,,,,,,,,,,,,,,,,,1984-12-25,F,,,,,57.02,NAP,N,,,0,,,,,,
027280387,00013,02728038700013,O,1972-01-01,NN,,,2019-11-14T14:01:00,false,4,,119,,,RD DES COMBES,79410,SAINT-GELAIS,,,79249,,,,,,,,,,,,,,,,,,,2003-03-01,F,,,,,45.3E,NAFRev1,O,-0.389333,46.375515,0.79,housenumber,119 Rue des Combes 79410 Saint-Gelais,79249_0064_00119,G,119 RUE DES COMBES,
067201244,00042,06720124400042,O,2020-01-20,,,,2020-03-16T08:32:32,false,1,ZA LE LUC,,,RUE,DES CHENES LES CARREAUX,79410,SAINT-GELAIS,,,79249,,,,,,,,,,,,,,,,,,,2020-01-20,A,,,,,77.31Z,NAFRev2,O,-0.397272,46.37869,0.6,street,Rue des Chênes 79410 Saint-Gelais,79249_0057,G,RUE DES CHENES,
086180809,00112,08618080900112,O,1993-03-18,NN,,,2019-11-14T14:01:00,false,3,,,,,ZI LES CARREAUX,79410,SAINT-GELAIS,,,79249,,,,,,,,,,,,,,,,,,,1996-12-25,F,,,,,60.2L,NAF1993,O,-0.415662,46.356178,0.66,street,Zone Artisanale des Carreaux 79410 Saint-Gelais,79249_njrom0,G,ZONE ARTISANALE DES CARREAUX,
217902493,00014,21790249300014,O,1983-03-01,11,2019,,2021-10-27T08:10:47,true,4,,320,,RUE,HERPENS,79410,SAINT-GELAIS,,,79249,,,,,,,,,,,,,,,,,,,2008-01-01,A,MAIRIE,,,,84.11Z,NAFRev2,O,-0.388487,46.381564,0.89,housenumber,320 Rue des Herpens 79410 Saint-Gelais,79249_0123_00320,G,320 RUE DES HERPENS,
217902493,00022,21790249300022,O,1983-12-21,NN,,,2019-11-14T14:01:00,false,4,,16,,RUE,HARPENS,79410,SAINT-GELAIS,,,79249,,,,,,,,,,,,,,,,,,,2001-09-01,F,ECOLE MATERNELLE PUBLIQUE,,,,80.1Z,NAF1993,N,-0.388538,46.381747,0.52,street,Rue des Herpens 79410 Saint-Gelais,79249_0123,G,RUE DES HERPENS,
217902493,00030,21790249300030,O,1983-12-21,11,2019,,2021-10-27T08:10:47,false,3,,,,RUE,DES HERPENS,79410,SAINT-GELAIS,,,79249,,,,,,,,,,,,,,,,,,,2008-01-01,A,ECOLE PRIMAIRE PUBLIQUE,,,,85.20Z,NAFRev2,N,-0.388538,46.381747,0.96,street,Rue des Herpens 79410 Saint-Gelais,79249_0123,G,RUE DES HERPENS,
217902493,00048,21790249300048,O,1997-12-01,NN,,,2019-11-14T14:01:00,false,3,MAIRIE,320,,RUE,HERPENS,79410,SAINT-GELAIS,,,79249,,,,,,,,,,,,,,,,,,,2004-05-07,F,LOTISSEMENT COMMUNAL,,,,70.1C,NAFRev1,N,-0.388487,46.381564,0.89,housenumber,320 Rue des Herpens 79410 Saint-Gelais,79249_0123_00320,G,320 RUE DES HERPENS,
217902493,00055,21790249300055,O,1997-12-01,NN,,,2019-11-14T14:01:00,false,3,MAIRIE,320,,RUE,HERPENS,79410,SAINT-GELAIS,,,79249,,,,,,,,,,,,,,,,,,,2008-01-01,A,SERVICE ASSAINISSEMENT,,,,37.00Z,NAFRev2,N,-0.388487,46.381564,0.89,housenumber,320 Rue des Herpens 79410 Saint-Gelais,79249_0123_00320,G,320 RUE DES HERPENS,
217902493,00063,21790249300063,O,1997-12-01,NN,,,2019-11-14T14:01:00,false,3,MAIRIE,320,,RUE,HERPENS,79410,SAINT-GELAIS,,,79249,,,,,,,,,,,,,,,,,,,2005-02-01,F,ZONE ARTISANALE,,,,70.2C,NAFRev1,N,-0.388487,46.381564,0.89,housenumber,320 Rue des Herpens 79410 Saint-Gelais,79249_0123_00320,G,320 RUE DES HERPENS,
217902493,00071,21790249300071,O,2005-03-25,,,,2019-11-14T14:01:00,false,2,MAIRIE,320,,RUE,HERPENS,79410,SAINT-GELAIS,,,79249,,,,,,,,,,,,,,,,,,,2008-01-01,A,COMMERCES COMMUNAUX ATELIERS RELAIS,,,,42.99Z,NAFRev2,N,-0.388487,46.381564,0.89,housenumber,320 Rue des Herpens 79410 Saint-Gelais,79249_0123_00320,G,320 RUE DES HERPENS,
217902493,00089,21790249300089,O,2013-03-01,,,,2021-02-23T10:33:26,false,1,MAIRIE,320,,RUE,HERPENS,79410,SAINT-GELAIS,,,79249,,,,,,,,,,,,,,,,,,,2013-03-01,A,ENERGIE RENOUVELABLE,,,,35.11Z,NAFRev2,N,-0.388487,46.381564,0.89,housenumber,320 Rue des Herpens 79410 Saint-Gelais,79249_0123_00320,G,320 RUE DES HERPENS,
257901108,00015,25790110800015,O,,NN,,,2019-11-14T14:01:00,true,1,,,,,,79410,SAINT-GELAIS,,,79249,,,,,,,,,,,,,,,,,,,1991-04-16,F,,,,,08.01,NAP,N,,,0,,,,,,
267904043,00010,26790404300010,O,1995-12-25,NN,,,2019-11-14T14:01:00,true,2,MAIRIE,320,,RUE,HERPENS,79410,SAINT-GELAIS,,,79249,,,,,,,,,,,,,,,,,,,2008-01-01,A,CCAS,,,,88.99B,NAFRev2,N,-0.388487,46.381564,0.89,housenumber,320 Rue des Herpens 79410 Saint-Gelais,79249_0123_00320,G,320 RUE DES HERPENS,
267981397,00016,26798139700016,O,1997-12-01,,,,2019-11-14T14:01:00,true,3,MAIRIE,320,,RUE,HERPENS,79410,SAINT-GELAIS,,,79249,,,,,,,,,,,,,,,,,,,2004-05-07,F,,,,,85.3K,NAFRev1,N,-0.388487,46.381564,0.89,housenumber,320 Rue des Herpens 79410 Saint-Gelais,79249_0123_00320,G,320 RUE DES HERPENS,
297900938,00012,29790093800012,O,,NN,,,2019-11-14T14:01:00,true,1,,,,,MAIRIE,79410,SAINT-GELAIS,,,79249,,,,,,,,,,,,,,,,,,,1991-03-28,F,,,,,90.12,NAP,N,-0.388029,46.390782,0.65,locality,La Metairie de Suire 79410 Saint-Gelais,79249_B088,G,LA METAIRIE DE SUIRE,
297902066,00010,29790206600010,O,1999-01-01,NN,,,2019-11-14T14:01:00,true,3,MAIRIE,320,,RUE,HERPENS,79410,SAINT-GELAIS,,,79249,,,,,,,,,,,,,,,,,,,2008-01-01,A,,,,,42.99Z,NAFRev2,N,-0.388487,46.381564,0.89,housenumber,320 Rue des Herpens 79410 Saint-Gelais,79249_0123_00320,G,320 RUE DES HERPENS,
301239059,00019,30123905900019,O,,,,,2019-11-14T14:01:00,true,1,,,,,,79410,SAINT-GELAIS,,,79249,,,,,,,,,,,,,,,,,,,1984-12-25,F,,,,,,,N,,,0,,,,,,
301619532,00015,30161953200015,O,1975-01-01,12,2019,4331ZB,2022-02-14T10:15:48,true,7,ZA,,,,LES GRANDS RAVARDS,79410,SAINT-GELAIS,,,79249,,,,,,,,,,,,,,,,,,,2021-09-21,A,,,,NP AGENCEMENT,43.33Z,NAFRev2,N,-0.397606,46.383056,0.49,street,Rue des Grands Fiefs 79410 Saint-Gelais,79249_0116,G,RUE DES GRANDS FIEFS,
302016464,00026,30201646400026,O,,,,,2019-11-14T14:01:00,true,1,,,,,POLLIGNY,79410,SAINT-GELAIS,,,79249,,,,,,,,,,,,,,,,,,,1984-12-25,F,,,,,62.43,NAP,N,-0.406384,46.370232,0.93,street,Rue de Polligny 79410 Saint-Gelais,79249_0228,G,RUE DE POLLIGNY,
303902076,00015,30390207600015,O,,NN,,9999ZZ,2019-11-14T14:01:00,true,1,,,,,,79410,SAINT-GELAIS,,,79249,,,,,,,,,,,,,,,,,,,1987-12-31,F,,,,,65.03,NAP,N,,,0,,,,,,
304597586,00011,30459758600011,O,,,,,2019-11-14T14:01:00,true,1,,,,,,79410,SAINT-GELAIS,,,79249,,,,,,,,,,,,,,,,,,,1984-12-25,F,,,,,67.01,NAP,N,,,0,,,,,,
308137579,00014,30813757900014,O,,NN,,,2019-11-14T14:01:00,true,1,,,,,,79410,SAINT-GELAIS,,,79249,,,,,,,,,,,,,,,,,,,1987-12-25,F,,,,,64.25,NAP,N,,,0,,,,,,
310450820,00025,31045082000025,O,,,,,2019-11-14T14:01:00,true,1,,,,,BOURG,79410,SAINT-GELAIS,,,79249,,,,,,,,,,,,,,,,,,,1984-12-25,F,,,,,55.73,NAP,N,-0.393212,46.383404,0.76,street,Rue du Bourgneuf 79410 Saint-Gelais,79249_0034,G,RUE DU BOURGNEUF,
311404974,00066,31140497400066,O,1990-06-01,NN,,,2019-11-14T14:01:00,false,3,,,,RTE,DE NIORT,79410,SAINT-GELAIS,,,79249,,,,,,,,,,,,,,,,,,,1994-12-25,F,,,,,74.4A,NAF1993,O,-0.406356,46.368204,0.81,street,Route de Niort 79410 Saint-Gelais,79249_0195,G,ROUTE DE NIORT,
311568950,00027,31156895000027,O,1982-06-01,NN,,,2019-11-14T14:01:00,true,1,,,,,ZI LES CARREAUX,79410,SAINT-GELAIS,,,79249,,,,,,,,,,,,,,,,,,,2000-02-29,F,,,,,63.1E,NAF1993,O,-0.415662,46.356178,0.66,street,Zone Artisanale des Carreaux 79410 Saint-Gelais,79249_njrom0,G,ZONE ARTISANALE DES CARREAUX,
313305278,00019,31330527800019,O,,,,,2019-11-14T14:01:00,true,1,,,,,,79410,SAINT-GELAIS,,,79249,,,,,,,,,,,,,,,,,,,1985-12-25,F,,,,,01.07,NAP,N,,,0,,,,,,
315437756,00044,31543775600044,O,2020-03-01,,,,2020-02-24T11:54:34,true,1,,121,,RUE,DU PRE MADAME,79410,SAINT-GELAIS,,,79249,,,,,,,,,,,,,,,,,,,2020-03-01,A,,,,,47.82Z,NAFRev2,N,-0.388498,46.383491,0.95,housenumber,121 Rue du Pré Madame 79410 Saint-Gelais,79249_0231_00121,G,121 RUE DU PRE MADAME,
315557058,00015,31555705800015,O,,,,,2019-11-14T14:01:00,true,1,,,,,BOURBIAS,79410,SAINT-GELAIS,,,79249,,,,,,,,,,,,,,,,,,,1985-12-25,F,,,,,78.02,NAP,N,-0.387847,46.377967,0.93,street,Rue de Bourbias 79410 Saint-Gelais,79249_0030,G,RUE DE BOURBIAS,
316232586,00065,31623258600065,O,2014-03-01,,,,2019-11-14T14:01:00,true,2,,301,,RUE,DE BOURBIAS,79410,SAINT-GELAIS,,,79249,,,,,,,,,,,,,,,,,,,2018-08-20,F,,,,,47.89Z,NAFRev2,N,-0.388504,46.377099,0.95,housenumber,301 Rue de Bourbias 79410 Saint-Gelais,79249_0030_00301,G,301 RUE DE BOURBIAS,
317524056,00056,31752405600056,O,1999-01-01,NN,,,2019-11-14T14:01:00,true,1,,296,,RUE,DES HERPENS,79410,SAINT-GELAIS,,,79249,,,,,,,,,,,,,,,,,,,2002-12-31,F,,,,,85.1G,NAF1993,N,-0.388586,46.381859,0.96,housenumber,296 Rue des Herpens 79410 Saint-Gelais,79249_0123_00296,G,296 RUE DES HERPENS,
317703171,00023,31770317100023,O,,NN,,,2019-11-14T14:01:00,true,1,,5,,RUE,DE LA PIERIERE,79410,SAINT-GELAIS,,,79249,,,,,,,,,,,,,,,,,,,1992-12-31,F,,,,,70.3A,NAF1993,N,-0.381286,46.378274,0.9,housenumber,5 Rue de la Pierrière 79410 Saint-Gelais,79249_0220_00005,G,5 RUE DE LA PIERRIERE,
317831022,00023,31783102200023,O,2007-04-26,,,,2019-11-14T14:01:00,false,3,LA COMMINE DES ROSES,90,,RUE,FRANCOIS ROUGET,79410,SAINT-GELAIS,,,79249,,,,,,,,,,,,,,,,,,,2016-12-31,F,,,,,68.31Z,NAFRev2,N,-0.385555,46.379523,0.95,housenumber,90 Rue François Rouget 79410 Saint-Gelais,79249_0105_00090,G,90 RUE FRANCOIS ROUGET,
318883584,00019,31888358400019,O,,NN,,,2019-11-14T14:01:00,true,1,,,,,LE COTEAU,79410,SAINT-GELAIS,,,79249,,,,,,,,,,,,,,,,,,,1987-09-30,F,,,,,01.00,NAP,N,-0.363764,46.377521,0.94,street,Le Coteau 79410 Saint-Gelais,79249_070g7d,G,LE COTEAU,
320705965,00012,32070596500012,O,,NN,,,2019-11-14T14:01:00,true,1,,12,,CITE,BEL AIR,79410,SAINT-GELAIS,,,79249,,,,,,,,,,,,,,,,,,,1987-03-01,F,,,,,66.04,NAP,N,-0.410087,46.368666,0.54,street,Rue de Bel-Air 79410 Saint-Gelais,79249_0013,G,RUE DE BEL AIR,
321781239,00017,32178123900017,O,1981-05-14,NN,,4334ZC,2019-11-14T14:01:00,true,4,,20,,LOT,DESMIER,79410,SAINT-GELAIS,,,79249,,,,,,,,,,,,,,,,,,,2005-11-30,F,,,,,45.4J,NAFRev1,O,-0.393709,46.378954,0.41,housenumber,20 Rue des Merisiers 79410 Saint-Gelais,79249_0075_00020,G,20 RUE DES MERISIERS,
321818650,00012,32181865000012,O,,,,9999ZZ,2019-11-14T14:01:00,true,1,,,,,BOURG,79410,SAINT-GELAIS,,,79249,,,,,,,,,,,,,,,,,,,1989-09-13,F,,,,,55.71,NAP,N,-0.393212,46.383404,0.76,street,Rue du Bourgneuf 79410 Saint-Gelais,79249_0034,G,RUE DU BOURGNEUF,
322533712,00012,32253371200012,O,1981-06-27,NN,,,2019-11-14T14:01:00,true,4,,,,,SUIRE,79410,SAINT-GELAIS,,,79249,,,,,,,,,,,,,,,,,,,2010-12-21,F,,,,,68.20B,NAFRev2,N,-0.384643,46.387038,0.92,street,Rue de Suire 79410 Saint-Gelais,79249_0306,G,RUE DE SUIRE,
322792508,00028,32279250800028,O,1982-06-01,NN,,,2019-11-14T14:01:00,false,3,,,,,LES CARREAUX,79410,SAINT-GELAIS,,,79249,,,,,,,,,,,,,,,,,,,2004-06-01,F,SCI FLORENTER,,,,70.1D,NAFRev1,N,-0.415662,46.356178,0.79,street,Zone Artisanale des Carreaux 79410 Saint-Gelais,79249_njrom0,G,ZONE ARTISANALE DES CARREAUX,
324027085,00038,32402708500038,O,,,,9999ZZ,2019-11-14T14:01:00,true,1,,116,,RUE,DE LA CUEILLE,79410,SAINT-GELAIS,,,79249,,,,,,,,,,,,,,,,,,,1992-06-10,F,,,,,15.8D,NAF1993,N,-0.389878,46.384152,0.93,housenumber,116 Rue de la Cueille Saint Jacques 79410 Saint-Gelais,79249_0067_00116,G,116 RUE DE LA CUEILLE ST JACQUES,
324077502,00023,32407750200023,O,,,,,2019-11-14T14:01:00,true,1,,,,LD,LES CARREAUX,79410,SAINT-GELAIS,,,79249,,,,,,,,,,,,,,,,,,,1990-04-26,F,,,,,57.01,NAP,N,-0.415662,46.356178,0.79,street,Zone Artisanale des Carreaux 79410 Saint-Gelais,79249_njrom0,G,ZONE ARTISANALE DES CARREAUX,
325566420,00015,32556642000015,O,,,,,2019-11-14T14:01:00,true,1,,,,RUE,DE LA MAIRIE,79410,SAINT-GELAIS,,,79249,,,,,,,,,,,,,,,,,,,1985-12-25,F,,,,,67.05,NAP,N,-0.37822,46.382345,0.68,street,Rue de la Roulerie 79410 Saint-Gelais,79249_0274,G,RUE DE LA ROULERIE,
326326857,00017,32632685700017,O,1983-01-15,NN,,,2019-11-14T14:01:00,true,3,,,,,,79410,SAINT-GELAIS,,,79249,,,,,,,,,,,,,,,,,,,2006-10-05,F,,,,,85.1G,NAFRev1,N,,,0,,,,,,
326627023,00012,32662702300012,O,1982-01-01,NN,,,2019-11-14T14:01:00,true,3,,,,LD,LE QUERAY,79410,SAINT-GELAIS,,,79249,,,,,,,,,,,,,,,,,,,2008-01-01,A,,,,,68.20B,NAFRev2,N,-0.373027,46.377867,0.74,street,Rue de Queray 79410 Saint-Gelais,79249_0248,G,RUE DE QUERAY,
328096771,00014,32809677100014,O,1984-01-01,NN,,9525ZZ,2019-11-14T14:01:00,true,3,,,,LOT,BUISSON MARTIN,79410,SAINT-GELAIS,,,79249,,,,,,,,,,,,,,,,,,,2005-06-30,F,,,,,52.7F,NAFRev1,N,-0.414357,46.359324,0.75,street,Rue du Buisson Martin 79410 Saint-Gelais,79249_0040,G,RUE DU BUISSON MARTIN,
328966247,00020,32896624700020,O,1986-08-15,NN,,,2019-11-14T14:01:00,false,4,,,,LOT,BUISSON MARTIN,79410,SAINT-GELAIS,,,79249,,,,,,,,,,,,,,,,,,,2000-02-15,F,,,,,70.2C,NAF1993,N,-0.414357,46.359324,0.75,street,Rue du Buisson Martin 79410 Saint-Gelais,79249_0040,G,RUE DU BUISSON MARTIN,
329168124,00025,32916812400025,O,1989-12-15,,,1412ZZ,2019-11-14T14:01:00,true,4,,,,RUE,DES HERPENS,79410,SAINT-GELAIS,,,79249,,,,,,,,,,,,,,,,,,,1997-12-25,F,,,,,00.99,NAP,N,-0.388538,46.381747,0.96,street,Rue des Herpens 79410 Saint-Gelais,79249_0123,G,RUE DES HERPENS,
329640460,00013,32964046000013,O,,,,,2019-11-14T14:01:00,true,1,,,,,,79410,SAINT-GELAIS,,,79249,,,,,,,,,,,,,,,,,,,1985-12-25,F,,,,,60.09,NAP,N,,,0,,,,,,
329702682,00033,32970268200033,O,,,,,2019-11-14T14:01:00,true,1,,,,RUE,DES HERPENS,79410,SAINT-GELAIS,,,79249,,,,,,,,,,,,,,,,,,,1991-07-01,F,,,,,74.1J,NAF1993,N,-0.388538,46.381747,0.96,street,Rue des Herpens 79410 Saint-Gelais,79249_0123,G,RUE DES HERPENS,
329880637,00015,32988063700015,O,1984-04-01,NN,,,2019-11-14T14:01:00,true,5,,,,,BEL AIR,79410,SAINT-GELAIS,,,79249,,,,,,,,,,,,,,,,,,,2009-04-01,A,,,,,68.20B,NAFRev2,N,-0.410087,46.368666,0.93,street,Rue de Bel-Air 79410 Saint-Gelais,79249_0013,G,RUE DE BEL AIR,
330715459,00013,33071545900013,O,1984-10-01,NN,,,2019-11-14T14:01:00,true,4,,,,LD,LA DOUILLETTERIE,79410,SAINT-GELAIS,,,79249,,,,,,,,,,,,,,,,,,,2000-12-31,F,,,,,01.1A,NAF1993,N,-0.39673,46.381734,0.47,street,Rue de la Baillette 79410 Saint-Gelais,79249_0012,G,RUE DE LA BAILLETTE,
330895590,00017,33089559000017,O,,NN,,,2019-11-14T14:01:00,true,1,,,,,,79410,SAINT-GELAIS,,,79249,,,,,,,,,,,,,,,,,,,1986-12-31,F,,,,,67.04,NAP,N,,,0,,,,,,
331152181,00011,33115218100011,O,,,,,2019-11-14T14:01:00,true,1,,,,,ZONE IND LES CARREAUX,79410,SAINT-GELAIS,,,79249,,,,,,,,,,,,,,,,,,,1986-08-06,F,,,,,57.08,NAP,N,-0.415662,46.356178,0.66,street,Zone Artisanale des Carreaux 79410 Saint-Gelais,79249_njrom0,G,ZONE ARTISANALE DES CARREAUX,
331968107,00010,33196810700010,O,,,,,2019-11-14T14:01:00,true,1,,,,LD,LES CARREAUX,79410,SAINT-GELAIS,,,79249,,,,,,,,,,,,,,,,,,,1988-07-26,F,,,,,46.01,NAP,N,-0.415662,46.356178,0.79,street,Zone Artisanale des Carreaux 79410 Saint-Gelais,79249_njrom0,G,ZONE ARTISANALE DES CARREAUX,
332226950,00027,33222695000027,O,1985-09-01,NN,,,2019-11-14T14:01:00,false,4,ZI LES CARREAUX,,,RTE,DE NIORT,79410,SAINT-GELAIS,,,79249,,,,,,,,,,,,,,,,,,,1992-03-01,F,,,,,70.2C,NAF1993,N,-0.406356,46.368204,0.81,street,Route de Niort 79410 Saint-Gelais,79249_0195,G,ROUTE DE NIORT,
332547793,00023,33254779300023,O,2001-09-01,NN,,4322AZ,2019-11-14T14:01:00,true,4,,200,,RUE,BUISSON MARTIN,79410,SAINT-GELAIS,,,79249,,,,,,,,,,,,,,,,,,,2007-09-30,F,,,,,45.3E,NAFRev1,N,-0.413751,46.359882,0.91,housenumber,200 Rue du Buisson Martin 79410 Saint-Gelais,79249_0040_00200,G,200 RUE DU BUISSON MARTIN,
333212686,00021,33321268600021,O,,NN,,,2019-11-14T14:01:00,true,1,,,,RUE,DU PRE MADAME,79410,SAINT-GELAIS,,,79249,,,,,,,,,,,,,,,,,,,1993-10-31,F,,,,,70.1A,NAF1993,N,-0.387038,46.382526,0.95,street,Rue du Pré Madame 79410 Saint-Gelais,79249_0231,G,RUE DU PRE MADAME,
334475639,00012,33447563900012,O,1986-01-01,NN,,4399CZ,2019-11-14T14:01:00,true,6,BEL AIR,480,,RTE,DE NIORT,79410,SAINT-GELAIS,,,79249,,,,,,,,,,,,,,,,,,,2018-10-06,F,,,,,43.99C,NAFRev2,N,-0.407493,46.365832,0.85,housenumber,480 Route de Niort 79410 Saint-Gelais,79249_0195_00480,G,480 ROUTE DE NIORT,
334532496,00075,33453249600075,O,2007-10-01,NN,,,2019-11-14T14:01:00,false,2,ZA LE LUC,6,,IMP,DU LUC,79410,SAINT-GELAIS,,,79249,,,,,,,,,,,,,,,,,,,2010-03-22,F,ABUS LEVAGE FRANCE,,,,46.69B,NAFRev2,O,-0.395441,46.378708,0.52,housenumber,6 Impasse du Fusain 79410 Saint-Gelais,79249_0109_00006,G,6 IMPASSE DU FUSAIN,
334566395,00011,33456639500011,O,1986-01-01,NN,,,2019-11-14T14:01:00,true,3,,,,LD,BRIGON,79410,SAINT-GELAIS,,,79249,,,,,,,,,,,,,,,,,,,2008-01-01,A,,,,,01.11Z,NAFRev2,N,,,0,,,,,,
334683265,00030,33468326500030,O,2005-02-01,,,,2019-11-14T14:01:00,true,3,,251,,RUE,DES HERPENS,79410,SAINT-GELAIS,,,79249,,,,,,,,,,,,,,,,,,,2010-12-12,F,,,,,86.21Z,NAFRev2,N,-0.388872,46.382253,0.96,housenumber,251 Rue des Herpens 79410 Saint-Gelais,79249_0123_00251,G,251 RUE DES HERPENS,
335016523,00029,33501652300029,O,1993-11-19,NN,,,2019-11-14T14:01:00,true,4,,35,,RUE,DE BOURGNEUF,79410,SAINT-GELAIS,,,79249,,,,,,,,,,,,,,,,,,,2008-01-01,A,,,,,68.20B,NAFRev2,N,-0.393212,46.383404,0.69,street,Rue du Bourgneuf 79410 Saint-Gelais,79249_0034,G,RUE DU BOURGNEUF,
335030995,00013,33503099500013,O,1986-01-01,NN,,,2019-11-14T14:01:00,true,3,,,,,QUERAY,79410,SAINT-GELAIS,,,79249,,,,,,,,,,,,,,,,,,,1998-12-25,F,,,,,01.3Z,NAF1993,N,-0.373027,46.377867,0.92,street,Rue de Queray 79410 Saint-Gelais,79249_0248,G,RUE DE QUERAY,
335169041,00035,33516904100035,O,1993-07-24,NN,,4333ZZ,2019-11-14T14:01:00,true,7,,654,,RTE,DE CHERVEUX,79410,SAINT-GELAIS,,,79249,,,,,,,,,,,,,,,,,,,2018-07-25,F,,,,,43.33Z,NAFRev2,O,-0.383495,46.387162,0.82,housenumber,654 Rue de Cherveux 79410 Saint-Gelais,79249_0058_00654,G,654 RUE DE CHERVEUX,
335254041,00015,33525404100015,O,1986-04-15,NN,,4332AA,2019-11-14T14:01:00,false,4,,250,,RUE,DE BUISSON MARTIN,79410,SAINT-GELAIS,,,79249,,,,,,,,,,,,,,,,,,,2013-07-31,F,,,,,43.32A,NAFRev2,N,-0.414143,46.359549,0.85,housenumber,250 Rue du Buisson Martin 79410 Saint-Gelais,79249_0040_00250,G,250 RUE DU BUISSON MARTIN,
335323127,00019,33532312700019,O,1986-04-14,,,4399CZ,2019-11-14T14:01:00,true,4,,351,,RUE,RAOUL GAIGNARD,79410,SAINT-GELAIS,,,79249,,,,,,,,,,,,,,,,,,,1993-12-25,F,,,,,45.2V,NAF1993,N,-0.394293,46.386391,0.95,housenumber,351 Rue Raoul Gaignard 79410 Saint-Gelais,79249_0253_00351,G,351 RUE RAOUL GAIGNARD,
337734313,00048,33773431300048,O,2014-05-15,,,,2021-02-23T10:54:29,true,1,,498,,RUE,DES HERPENS,79410,SAINT-GELAIS,,,79249,,,,,,,,,,,,,,,,,,,2014-05-15,A,,,,,47.89Z,NAFRev2,N,-0.387315,46.380398,0.96,housenumber,498 Rue des Herpens 79410 Saint-Gelais,79249_0123_00498,G,498 RUE DES HERPENS,
337791859,00016,33779185900016,O,1986-03-21,NN,,,2022-02-09T08:33:53,true,7,LE BREUILLAT,,,,LE BREUILLAT,79410,SAINT-GELAIS,,,79249,,,,,,,,,,,,,,,,,,,2022-02-08,F,,,,,56.30Z,NAFRev2,N,-0.395459,46.386201,0.73,street,Rue du Breuillat 79410 Saint-Gelais,79249_0037,G,RUE DU BREUILLAT,
337893895,00041,33789389500041,O,2005-06-07,,,4333ZZ,2019-11-14T14:01:00,true,2,LES JARDINS DU PRIEURE,16,,RUE,DE LA FRUITIERE,79410,SAINT-GELAIS,,,79249,,,,,,,,,,,,,,,,,,,2007-01-26,F,,,,,45.4F,NAFRev1,N,-0.394324,46.382057,0.95,housenumber,16 Rue de la Fruitière 79410 Saint-Gelais,79249_0104_00016,G,16 RUE DE LA FRUITIERE,
338069149,00015,33806914900015,O,1986-03-26,NN,,,2019-11-14T14:01:00,true,3,,,,,,79410,SAINT-GELAIS,,,79249,,,,,,,,,,,,,,,,,,,2008-01-01,A,,,,,41.10D,NAFRev2,N,,,0,,,,,,
338348527,00064,33834852700064,O,1990-09-01,NN,,,2019-11-14T14:01:00,false,4,ZI LES CARREAUX,,,RTE,DE NIORT,79410,SAINT-GELAIS,,,79249,,,,,,,,,,,,,,,,,,,1995-12-25,F,,,,,52.4L,NAF1993,N,-0.406356,46.368204,0.81,street,Route de Niort 79410 Saint-Gelais,79249_0195,G,ROUTE DE NIORT,
339047987,00153,33904798700153,O,2000-02-28,NN,,,2019-11-14T14:01:00,false,3,,,,,ZI LES CARREAUX,79410,SAINT-GELAIS,,,79249,,,,,,,,,,,,,,,,,,,2005-08-23,F,,,,,63.1E,NAFRev1,O,-0.415662,46.356178,0.66,street,Zone Artisanale des Carreaux 79410 Saint-Gelais,79249_njrom0,G,ZONE ARTISANALE DES CARREAUX,
340390095,00016,34039009500016,O,1987-01-19,NN,,,2019-11-14T14:01:00,false,3,,238,,RTE,D HERPENS,79410,SAINT-GELAIS,,,79249,,,,,,,,,,,,,,,,,,,1996-05-31,F,,,,,55.3A,NAF1993,N,-0.389065,46.382341,0.71,housenumber,238 Rue des Herpens 79410 Saint-Gelais,79249_0123_00238,G,238 RUE DES HERPENS,
341478212,00036,34147821200036,O,2020-11-02,,,,2020-11-16T08:48:42,true,1,,34,,,RUE DE CHERVEUX,79410,SAINT-GELAIS,,,79249,,,,,,,,,,,,,,,,,,,2020-11-02,A,,,,,70.22Z,NAFRev2,N,-0.389943,46.384215,0.95,housenumber,34 Rue de Cherveux 79410 Saint-Gelais,79249_0058_00034,G,34 RUE DE CHERVEUX,
342013257,00015,34201325700015,O,1987-01-01,NN,,,2019-11-14T14:01:00,true,5,,,,,LE LUC,79410,SAINT-GELAIS,,,79249,,,,,,,,,,,,,,,,,,,2017-10-24,F,,,,,01.41Z,NAFRev2,N,-0.390441,46.398561,0.51,locality,Le Fief Lusseau 79410 Saint-Gelais,79249_B059,G,LE FIEF LUSSEAU,
342408572,00010,34240857200010,O,1987-07-01,NN,,,2019-11-14T14:01:00,true,4,,,,,BEL AIR,79410,SAINT-GELAIS,,,79249,,,,,,,,,,,,,,,,,,,1994-12-25,F,,,,,01.3Z,NAF1993,N,-0.410087,46.368666,0.93,street,Rue de Bel-Air 79410 Saint-Gelais,79249_0013,G,RUE DE BEL AIR,
342868973,00013,34286897300013,O,1987-10-01,NN,,,2019-11-14T14:01:00,true,4,,,,,LE COTEAU,79410,SAINT-GELAIS,,,79249,,,,,,,,,,,,,,,,,,,1994-12-25,F,,,,,01.2A,NAF1993,N,-0.363764,46.377521,0.94,street,Le Coteau 79410 Saint-Gelais,79249_070g7d,G,LE COTEAU,
342990538,00015,34299053800015,O,1987-10-01,NN,,,2019-11-14T14:01:00,false,4,,,,,,79410,SAINT-GELAIS,,,79249,,,,,,,,,,,,,,,,,,,1998-12-31,F,,,,,01.1A,NAF1993,N,,,0,,,,,,