siren,nic,siret,statutDiffusionEtablissement,dateCreationEtablissement,trancheEffectifsEtablissement,anneeEffectifsEtablissement,activitePrincipaleRegistreMetiersEtablissement,dateDernierTraitementEtablissement,etablissementSiege,nombrePeriodesEtablissement,complementAdresseEtablissement,numeroVoieEtablissement,indiceRepetitionEtablissement,typeVoieEtablissement,libelleVoieEtablissement,codePostalEtablissement,libelleCommuneEtablissement,libelleCommuneEtrangerEtablissement,distributionSpecialeEtablissement,codeCommuneEtablissement,codeCedexEtablissement,libelleCedexEtablissement,codePaysEtrangerEtablissement,libellePaysEtrangerEtablissement,complementAdresse2Etablissement,numeroVoie2Etablissement,indiceRepetition2Etablissement,typeVoie2Etablissement,libelleVoie2Etablissement,codePostal2Etablissement,libelleCommune2Etablissement,libelleCommuneEtranger2Etablissement,distributionSpeciale2Etablissement,codeCommune2Etablissement,codeCedex2Etablissement,libelleCedex2Etablissement,codePaysEtranger2Etablissement,libellePaysEtranger2Etablissement,dateDebut,etatAdministratifEtablissement,enseigne1Etablissement,enseigne2Etablissement,enseigne3Etablissement,denominationUsuelleEtablissement,activitePrincipaleEtablissement,nomenclatureActivitePrincipaleEtablissement,caractereEmployeurEtablissement,longitude,latitude,geo_score,geo_type,geo_adresse,geo_id,geo_ligne,geo_l4,geo_l5
130022767,01241,13002276701241,O,2017-01-01,,,,2020-02-04T11:24:16,false,2,,,,,LE PARACLET,80440,FOUENCAMPS,,BP 30005,80337,,,,,,,,,,,,,,,,,,,2020-01-01,F,AFB CENTRE DE FORMATION DU PARACLET,,,,84.12Z,NAFRev2,N,2.399439,49.819104,0.69,locality,Aulnais du Paraclet 80440 Fouencamps,80337_B001,G,AULNAIS DU PARACLET,
130025919,00817,13002591900817,O,2020-01-01,,,,2019-12-12T20:01:04,false,1,,,,,LE PARACLET,80440,FOUENCAMPS,,BP 30005,80337,,,,,,,,,,,,,,,,,,,2020-01-01,A,OFB CENTRE DE FORMATION DU PARACLET,,,,84.13Z,NAFRev2,N,2.399439,49.819104,0.69,locality,Aulnais du Paraclet 80440 Fouencamps,80337_B001,G,AULNAIS DU PARACLET,
180068017,00094,18006801700094,O,1970-10-15,NN,,,2007-05-19T08:10:33,false,3,,,,,DOMAINE DU PARACLET,80440,FOUENCAMPS,,,80337,,,,,,,,,,,,,,,,,,,2006-03-13,F,CENTRE DU PARACLET,,,,75.1C,NAFRev1,N,2.399439,49.819104,0.56,locality,Aulnais du Paraclet 80440 Fouencamps,80337_B001,G,AULNAIS DU PARACLET,
180068017,01712,18006801701712,O,2006-03-13,NN,,,2019-06-24T13:07:37,false,5,,,,,AULNAIS DU PARACLET,80440,FOUENCAMPS,,BP 30005,80337,,,,,,,,,,,,,,,,,,,2017-01-01,F,CENTRE DE FORMATION,,,,84.12Z,NAFRev2,O,2.399439,49.819104,0.93,locality,Aulnais du Paraclet 80440 Fouencamps,80337_B001,G,AULNAIS DU PARACLET,
218003234,00018,21800323400018,O,1983-03-01,01,2019,,2021-10-27T08:10:50,true,3,,4,,RUE,DE LA NOYE,80440,FOUENCAMPS,,,80337,,,,,,,,,,,,,,,,,,,2008-01-01,A,MAIRIE,,,,84.11Z,NAFRev2,O,2.407084,49.824565,0.95,housenumber,4 Rue de la Noye 80440 Fouencamps,80337_0061_00004,G,4 RUE DE LA NOYE,
218003234,00026,21800323400026,O,1983-12-21,NN,,,2011-04-23T04:17:03,false,4,,4,,RUE,DE LA NOYE,80440,FOUENCAMPS,,,80337,,,,,,,,,,,,,,,,,,,2008-01-01,A,ECOLE MATERNELLE PUBLIQUE,,,,85.10Z,NAFRev2,N,2.407084,49.824565,0.95,housenumber,4 Rue de la Noye 80440 Fouencamps,80337_0061_00004,G,4 RUE DE LA NOYE,
218003234,00034,21800323400034,O,1998-01-01,NN,,,2021-08-03T13:38:20,false,4,MAIRIE,4,,RUE,DE LA NOYE,80440,FOUENCAMPS,,,80337,,,,,,,,,,,,,,,,,,,2021-01-01,F,SERVICE D'EAU,,,,36.00Z,NAFRev2,N,2.407084,49.824565,0.95,housenumber,4 Rue de la Noye 80440 Fouencamps,80337_0061_00004,G,4 RUE DE LA NOYE,
268003894,00014,26800389400014,O,1983-03-01,NN,,,2018-09-13T08:59:01,true,4,MAIRIE,4,,RUE,DE LA NOYE,80440,FOUENCAMPS,,,80337,,,,,,,,,,,,,,,,,,,2018-01-01,F,CCAS,,,,88.99B,NAFRev2,N,2.407084,49.824565,0.95,housenumber,4 Rue de la Noye 80440 Fouencamps,80337_0061_00004,G,4 RUE DE LA NOYE,
268008737,00010,26800873700010,O,1983-03-01,NN,,,2010-06-26T03:16:39,true,3,MAIRIE,4,,RUE,DE LA NOYE,80440,FOUENCAMPS,,,80337,,,,,,,,,,,,,,,,,,,2008-01-01,A,CDE,,,,88.99B,NAFRev2,N,2.407084,49.824565,0.95,housenumber,4 Rue de la Noye 80440 Fouencamps,80337_0061_00004,G,4 RUE DE LA NOYE,
314823154,00013,31482315400013,O,,NN,,,,true,1,,,,,GRANDE RUE,80440,FOUENCAMPS,,,80337,,,,,,,,,,,,,,,,,,,1989-03-31,F,,,,,55.40,NAP,N,2.403926,49.820791,0.92,locality,Grande Rue Gde Rue 80440 Fouencamps,80337_0080,G,GRANDE RUE GDE RUE,
322082645,00019,32208264500019,O,,NN,,,,true,1,,,,RUE,HENNEQUIN,80440,FOUENCAMPS,,,80337,,,,,,,,,,,,,,,,,,,1989-08-16,F,,,,,62.11,NAP,N,2.409138,49.824895,0.94,street,Rue Hennequin 80440 Fouencamps,80337_0020,G,RUE HENNEQUIN,
322757584,00030,32275758400030,O,2001-06-05,NN,,,,true,1,,22,,RUE,AU SAC,80440,FOUENCAMPS,,,80337,,,,,,,,,,,,,,,,,,,2001-12-03,F,,,,,92.7C,NAF1993,N,2.408671,49.827781,0.94,housenumber,22 Rue au Sac 80440 Fouencamps,80337_0100_00022,G,22 RUE AU SAC,
330563941,00013,33056394100013,O,,NN,,,,true,1,,,,RUE,HENNEQUIN,80440,FOUENCAMPS,,,80337,,,,,,,,,,,,,,,,,,,1985-02-28,F,,,,,60.2M,NAF1993,N,2.409138,49.824895,0.94,street,Rue Hennequin 80440 Fouencamps,80337_0020,G,RUE HENNEQUIN,
334223625,00032,33422362500032,O,2005-05-28,,,,2016-08-03T11:40:35,false,3,,4,,RUE,NOEL,80440,FOUENCAMPS,,,80337,,,,,,,,,,,,,,,,,,,2016-06-30,F,,,,,86.21Z,NAFRev2,N,2.407527,49.8229,0.93,housenumber,4 Rue Noël 80440 Fouencamps,80337_0060_00004,G,4 RUE NOEL,
335142154,00020,33514215400020,O,,NN,,,,true,1,,,,PL,DE LA MAIRIE,80440,FOUENCAMPS,,,80337,,,,,,,,,,,,,,,,,,,1990-03-31,F,,,,,55.4B,NAF1993,N,2.406626,49.823179,0.37,street,Rue de la Noye 80440 Fouencamps,80337_0061,G,RUE DE LA NOYE,
337939789,00018,33793978900018,O,1986-05-21,NN,,,,true,3,,3,,RUE,DE L AVRE,80440,FOUENCAMPS,,,80337,,,,,,,,,,,,,,,,,,,2003-12-31,F,,,,,60.2M,NAFRev1,N,2.407719,49.825089,0.94,housenumber,3 Rue de l’Avre 80440 Fouencamps,80337_0001_00003,G,3 RUE DE L AVRE,
350689055,00019,35068905500019,O,,NN,,,,true,1,,14,,RUE,DE LA NOYE,80440,FOUENCAMPS,,,80337,,,,,,,,,,,,,,,,,,,1995-12-25,F,,,,,70.2A,NAF1993,N,2.407028,49.824243,0.95,housenumber,14 Rue de la Noye 80440 Fouencamps,80337_0061_00014,G,14 RUE DE LA NOYE,
353168628,00017,35316862800017,O,1989-12-01,NN,,,2007-01-18T09:27:50,true,3,,,,,,80440,FOUENCAMPS,,,80337,,,,,,,,,,,,,,,,,,,1998-12-25,F,,,,,01.3Z,NAF1993,N,,,0,,,,,,
353527807,00013,35352780700013,O,1990-01-01,NN,,,2008-01-04T23:55:27,true,3,,14,,RUE,DE L AVRE,80440,FOUENCAMPS,,,80337,,,,,,,,,,,,,,,,,,,2008-01-01,A,,,,,01.11Z,NAFRev2,N,2.407262,49.825868,0.94,housenumber,14 Rue de l’Avre 80440 Fouencamps,80337_0001_00014,G,14 RUE DE L AVRE,
387853559,00012,38785355900012,O,1992-07-02,NN,,,2019-12-06T12:49:36,true,4,,1,,RUE,DE LA NOYE,80440,FOUENCAMPS,,,80337,,,,,,,,,,,,,,,,,,,2019-12-31,F,,,,,56.10A,NAFRev2,N,2.40736,49.824554,0.95,housenumber,1 Rue de la Noye 80440 Fouencamps,80337_0061_00001,G,1 RUE DE LA NOYE,
388812802,00014,38881280200014,O,1992-01-01,NN,,,,true,3,,,,,,80440,FOUENCAMPS,,,80337,,,,,,,,,,,,,,,,,,,1998-12-25,F,,,,,70.2C,NAF1993,N,,,0,,,,,,
400936266,00016,40093626600016,O,1994-01-01,NN,,,,true,1,,38,,RUE,DE LA NOYE,80440,FOUENCAMPS,,,80337,,,,,,,,,,,,,,,,,,,1998-12-31,F,,,,,01.1A,NAF1993,N,2.406163,49.822442,0.95,housenumber,38 Rue de la Noye 80440 Fouencamps,80337_0061_00038,G,38 RUE DE LA NOYE,
404064347,00010,40406434700010,O,1982-01-01,00,2019,,2021-10-27T08:30:17,true,3,,6,,RUE,DE L'AVRE,80440,FOUENCAMPS,,,80337,,,,,,,,,,,,,,,,,,,2008-01-01,A,,,,,01.11Z,NAFRev2,N,2.407201,49.825242,0.94,housenumber,6 Rue de l’Avre 80440 Fouencamps,80337_0001_00006,G,6 RUE DE L AVRE,
433452513,00016,43345251300016,O,2000-11-01,NN,,,2008-01-04T19:03:47,true,3,,9,,RUE,HENNEQUIN,80440,FOUENCAMPS,,,80337,,,,,,,,,,,,,,,,,,,2008-01-01,A,,,,,68.20A,NAFRev2,N,2.409318,49.825023,0.94,housenumber,9 Rue Hennequin 80440 Fouencamps,80337_0020_00009,G,9 RUE HENNEQUIN,
434372900,00036,43437290000036,O,2001-02-01,NN,,,2008-01-04T19:26:45,false,3,,9,,RUE,HENNEQUIN,80440,FOUENCAMPS,,,80337,,,,,,,,,,,,,,,,,,,2008-01-01,A,,,,,82.99Z,NAFRev2,N,2.409318,49.825023,0.94,housenumber,9 Rue Hennequin 80440 Fouencamps,80337_0020_00009,G,9 RUE HENNEQUIN,
437691553,00014,43769155300014,O,2001-05-07,NN,,,2011-05-26T11:39:58,true,5,,7,,RUE,HENNEQUIN,80440,FOUENCAMPS,,,80337,,,,,,,,,,,,,,,,,,,2009-12-31,A,,,,,68.20A,NAFRev2,N,2.409138,49.824895,0.94,housenumber,7 Rue Hennequin 80440 Fouencamps,80337_0020_00007,G,7 RUE HENNEQUIN,
444701023,00012,44470102300012,O,2003-02-03,NN,,9602BA,2020-08-25T10:32:34,true,4,,14,,RUE,AU SAC,80440,FOUENCAMPS,,,80337,,,,,,,,,,,,,,,,,,,2008-01-01,A,,,,,96.02B,NAFRev2,O,2.408443,49.827082,0.94,housenumber,14 Rue au Sac 80440 Fouencamps,80337_0100_00014,G,14 RUE AU SAC,
449836865,00021,44983686500021,O,2009-12-01,,,,2021-02-23T13:32:16,true,1,,7,,RUE,HENNEQUIN,80440,FOUENCAMPS,,,80337,,,,,,,,,,,,,,,,,,,2009-12-01,A,,,,,68.20B,NAFRev2,N,2.409138,49.824895,0.94,housenumber,7 Rue Hennequin 80440 Fouencamps,80337_0020_00007,G,7 RUE HENNEQUIN,
452868482,00012,45286848200012,O,2002-02-09,NN,,,2006-11-01T00:38:44,false,3,,18,,RUE,HENNEQUIN,80440,FOUENCAMPS,,,80337,,,,,,,,,,,,,,,,,,,2005-01-24,F,,,,,85.1C,NAFRev1,N,2.40857,49.824383,0.94,housenumber,18 Rue Hennequin 80440 Fouencamps,80337_0020_00018,G,18 RUE HENNEQUIN,
483279022,00014,48327902200014,O,2005-07-12,,,,2006-11-25T20:17:58,true,1,,50,,RUE,DE LA NOYE,80440,FOUENCAMPS,,,80337,,,,,,,,,,,,,,,,,,,2005-07-12,F,,,,,52.6E,NAFRev1,N,2.406626,49.823179,0.95,housenumber,50 Rue de la Noye 80440 Fouencamps,80337_0061_00050,G,50 RUE DE LA NOYE,
489386466,00010,48938646600010,O,2006-04-03,NN,,,2015-08-13T04:04:22,true,3,,25,,RUE,DE L'AVRE,80440,FOUENCAMPS,,,80337,,,,,,,,,,,,,,,,,,,2014-02-01,F,,,,,01.43Z,NAFRev2,N,2.407685,49.827104,0.94,housenumber,25 Rue de l’Avre 80440 Fouencamps,80337_0001_00025,G,25 RUE DE L AVRE,
493908198,00036,49390819800036,O,2010-05-29,,,,2012-11-09T01:45:23,true,2,,16,,RUE,DE L AVRE,80440,FOUENCAMPS,,,80337,,,,,,,,,,,,,,,,,,,2011-07-31,F,,,,,85.59A,NAFRev2,N,2.407266,49.826095,0.94,housenumber,16 Rue de l’Avre 80440 Fouencamps,80337_0001_00016,G,16 RUE DE L AVRE,
500394283,00021,50039428300021,O,2008-05-19,NN,,,2019-10-01T03:38:41,true,4,,18,,RUE,DE LA NOYE,80440,FOUENCAMPS,,,80337,,,,,,,,,,,,,,,,,,,2019-09-27,F,,,,,80.10Z,NAFRev2,N,2.406865,49.823654,0.95,housenumber,18 Rue de la Noye 80440 Fouencamps,80337_0061_00018,G,18 RUE DE LA NOYE,
512839820,00036,51283982000036,O,2022-02-01,,,4932ZA,2022-02-21T19:36:41,true,1,,4,,RUE,NOEL,80440,FOUENCAMPS,,,80337,,,,,,,,,,,,,,,,,,,2022-02-01,A,,,,TAXI RODRIGUES,49.32Z,NAFRev2,N,2.407527,49.8229,0.93,housenumber,4 Rue Noël 80440 Fouencamps,80337_0060_00004,G,4 RUE NOEL,
513697714,00014,51369771400014,O,2005-11-08,,,,2009-07-15T14:39:39,true,1,CHEZ MLE TALLON CAROLINE,4,,RUE,DE LA NOYE,80440,FOUENCAMPS,,,80337,,,,,,,,,,,,,,,,,,,2005-11-08,A,,,,,93.12Z,NAFRev2,N,2.407084,49.824565,0.95,housenumber,4 Rue de la Noye 80440 Fouencamps,80337_0061_00004,G,4 RUE DE LA NOYE,
519297089,00012,51929708900012,O,2010-02-01,,,,2018-05-25T08:56:17,false,2,,14,,RUE,AU SAC,80440,FOUENCAMPS,,,80337,,,,,,,,,,,,,,,,,,,2014-02-08,F,,,,,96.02B,NAFRev2,N,2.408443,49.827082,0.94,housenumber,14 Rue au Sac 80440 Fouencamps,80337_0100_00014,G,14 RUE AU SAC,
522056175,00014,52205617500014,O,2010-04-07,,,,2010-04-27T15:37:31,true,1,,7,,RUE,HENNEQUIN,80440,FOUENCAMPS,,,80337,,,,,,,,,,,,,,,,,,,2010-04-07,A,,,,,68.20A,NAFRev2,N,2.409138,49.824895,0.94,housenumber,7 Rue Hennequin 80440 Fouencamps,80337_0020_00007,G,7 RUE HENNEQUIN,
529557340,00013,52955734000013,O,2010-12-10,,,,2020-10-27T03:55:49,true,1,,5,,RUE,HENNEQUIN,80440,FOUENCAMPS,,,80337,,,,,,,,,,,,,,,,,,,2010-12-10,A,,,,,68.20B,NAFRev2,N,2.408366,49.824555,0.94,housenumber,5 Rue Hennequin 80440 Fouencamps,80337_0020_00005,G,5 RUE HENNEQUIN,
611710930,00011,61171093000011,O,,NN,,,,true,1,,,,PL,DE LA MAIRIE,80440,FOUENCAMPS,,,80337,,,,,,,,,,,,,,,,,,,1987-07-31,F,,,,,67.05,NAP,N,2.406626,49.823179,0.37,street,Rue de la Noye 80440 Fouencamps,80337_0061,G,RUE DE LA NOYE,
662032606,33418,66203260633418,O,2002-03-01,,,,2007-05-22T02:25:49,false,3,,,,,DOMAINE DU PARACLET,80440,FOUENCAMPS,,,80337,,,,,,,,,,,,,,,,,,,2004-12-31,F,EUREST 5489,,,,55.5A,NAFRev1,O,2.399439,49.819104,0.56,locality,Aulnais du Paraclet 80440 Fouencamps,80337_B001,G,AULNAIS DU PARACLET,
753539758,00015,75353975800015,O,2012-09-01,,,,2016-11-29T08:22:29,true,2,,9,,RUE,DE L'AVRE,80440,FOUENCAMPS,,,80337,,,,,,,,,,,,,,,,,,,2015-12-31,F,,,,,58.29C,NAFRev2,N,2.407338,49.825399,0.94,housenumber,9 Rue de l’Avre 80440 Fouencamps,80337_0001_00009,G,9 RUE DE L AVRE,
780596755,00030,78059675500030,O,1988-10-01,NN,,,,true,1,,17,,RUE,DE L'AVRE,80440,FOUENCAMPS,,,80337,,,,,,,,,,,,,,,,,,,1999-12-31,F,,,,,45.4J,NAF1993,O,2.407443,49.826177,0.94,housenumber,17 Rue de l’Avre 80440 Fouencamps,80337_0001_00017,G,17 RUE DE L AVRE,
793336686,00019,79333668600019,O,2013-06-01,,,,2013-05-31T08:59:43,true,1,,5,,,RUE DE LA NOYE,80440,FOUENCAMPS,,,80337,,,,,,,,,,,,,,,,,,,2013-06-01,A,,,,,47.89Z,NAFRev2,N,2.407271,49.824345,0.95,housenumber,5 Rue de la Noye 80440 Fouencamps,80337_0061_00005,G,5 RUE DE LA NOYE,
800229916,00013,80022991600013,O,2014-02-01,,,,2018-04-06T18:00:54,true,1,,25,,RUE,DE L'AVRE,80440,FOUENCAMPS,,,80337,,,,,,,,,,,,,,,,,,,2014-02-01,A,,,,,01.43Z,NAFRev2,N,2.407685,49.827104,0.94,housenumber,25 Rue de l’Avre 80440 Fouencamps,80337_0001_00025,G,25 RUE DE L AVRE,
803632389,00026,80363238900026,O,2018-01-08,,,,2021-02-23T17:19:51,true,3,,10,,RUE,DE LA NOYE,80440,FOUENCAMPS,,,80337,,,,,,,,,,,,,,,,,,,2018-05-15,A,,,,,43.91B,NAFRev2,N,2.407062,49.82438,0.95,housenumber,10 Rue de la Noye 80440 Fouencamps,80337_0061_00010,G,10 RUE DE LA NOYE,
808089536,00011,80808953600011,O,2014-09-27,,,,2014-12-01T09:09:03,true,1,,20,,RUE,DE L'AVRE,80440,FOUENCAMPS,,,80337,,,,,,,,,,,,,,,,,,,2014-09-27,A,,,,,47.99A,NAFRev2,N,2.406446,49.826577,0.94,housenumber,20 Rue de l’Avre 80440 Fouencamps,80337_0001_00020,G,20 RUE DE L AVRE,
808164941,00011,80816494100011,O,2014-11-07,,,,2018-04-10T16:01:49,true,1,,7,,RUE,HENNEQUIN,80440,FOUENCAMPS,,,80337,,,,,,,,,,,,,,,,,,,2014-11-07,A,,,,,68.20B,NAFRev2,N,2.409138,49.824895,0.94,housenumber,7 Rue Hennequin 80440 Fouencamps,80337_0020_00007,G,7 RUE HENNEQUIN,
808512891,00017,80851289100017,O,2014-11-21,,,,2015-11-17T08:24:48,true,2,LA BECHONNE,16,,RUE,DE LA NOYE,80440,FOUENCAMPS,,,80337,,,,,,,,,,,,,,,,,,,2015-11-30,F,,,,,90.03B,NAFRev2,N,2.406903,49.82386,0.95,housenumber,16 Rue de la Noye 80440 Fouencamps,80337_0061_00016,G,16 RUE DE LA NOYE,
809459548,00016,80945954800016,O,2015-03-02,,,9602BA,2020-10-05T09:37:38,false,2,,14,,RUE,AU SAC,80440,FOUENCAMPS,,,80337,,,,,,,,,,,,,,,,,,,2018-05-07,F,EDEN BIEN-ETRE,,,,96.02B,NAFRev2,N,2.408443,49.827082,0.94,housenumber,14 Rue au Sac 80440 Fouencamps,80337_0100_00014,G,14 RUE AU SAC,
814564654,00014,81456465400014,O,2015-12-01,,,1812ZA,2015-11-09T09:16:41,true,1,,21,,RUE,DE LA NOYE,80440,FOUENCAMPS,,,80337,,,,,,,,,,,,,,,,,,,2015-12-01,A,,,,POURQUOI PAS ?,18.12Z,NAFRev2,N,2.406807,49.823242,0.95,housenumber,21 Rue de la Noye 80440 Fouencamps,80337_0061_00021,G,21 RUE DE LA NOYE,
823874888,00022,82387488800022,O,2021-07-01,,,4331ZB,2022-02-05T14:00:25,true,1,,14,,RUE,DE L'AVRE,80440,FOUENCAMPS,,,80337,,,,,,,,,,,,,,,,,,,2021-07-01,A,,,,,43.31Z,NAFRev2,N,2.407262,49.825868,0.94,housenumber,14 Rue de l’Avre 80440 Fouencamps,80337_0001_00014,G,14 RUE DE L AVRE,
832659130,00021,83265913000021,O,2019-09-16,,,,2020-04-10T08:32:15,false,2,,10,,RUE,DE LA NOYE,80440,FOUENCAMPS,,,80337,,,,,,,,,,,,,,,,,,,2020-01-17,F,,,,,86.90D,NAFRev2,N,2.407062,49.82438,0.95,housenumber,10 Rue de la Noye 80440 Fouencamps,80337_0061_00010,G,10 RUE DE LA NOYE,
842493116,00011,84249311600011,O,2018-09-20,,,4322AZ,2018-09-21T08:47:44,true,1,,5,,RUE,DE L'AVRE,80440,FOUENCAMPS,,,80337,,,,,,,,,,,,,,,,,,,2018-09-20,A,,,,,43.22A,NAFRev2,N,2.407322,49.825247,0.94,housenumber,5 Rue de l’Avre 80440 Fouencamps,80337_0001_00005,G,5 RUE DE L AVRE,
882922800,00017,88292280000017,O,2020-04-09,,,,2020-04-17T14:29:04,true,1,,7,,RUE,HENNEQUIN,80440,FOUENCAMPS,,,80337,,,,,,,,,,,,,,,,,,,2020-04-09,A,,,,,68.20B,NAFRev2,N,2.409138,49.824895,0.94,housenumber,7 Rue Hennequin 80440 Fouencamps,80337_0020_00007,G,7 RUE HENNEQUIN,
894268168,00016,89426816800016,O,2021-02-11,,,8121ZZ,2021-02-19T07:42:17,true,1,,25,,RUE,DE LA NOYE,80440,FOUENCAMPS,,,80337,,,,,,,,,,,,,,,,,,,2021-02-11,A,,,,,81.21Z,NAFRev2,N,2.406696,49.823067,0.95,housenumber,25 Rue de la Noye 80440 Fouencamps,80337_0061_00025,G,25 RUE DE LA NOYE,
903049971,00018,90304997100018,O,2021-09-01,,,,2021-09-13T10:00:06,true,1,,16,,RUE,DE LA NOYE,80440,FOUENCAMPS,,,80337,,,,,,,,,,,,,,,,,,,2021-09-01,A,,,,MARIANNE DORLODOT,85.60Z,NAFRev2,N,2.406903,49.82386,0.95,housenumber,16 Rue de la Noye 80440 Fouencamps,80337_0061_00016,G,16 RUE DE LA NOYE,
903420388,00014,90342038800014,O,1998-10-06,,,,2021-09-23T07:38:31,true,1,,7,,RUE,DE LA NOYE,80440,FOUENCAMPS,,,80337,,,,,,,,,,,,,,,,,,,1998-10-06,A,,,,,94.99Z,NAFRev2,N,2.407217,49.824225,0.95,housenumber,7 Rue de la Noye 80440 Fouencamps,80337_0061_00007,G,7 RUE DE LA NOYE,
