siren,nic,siret,statutDiffusionEtablissement,dateCreationEtablissement,trancheEffectifsEtablissement,anneeEffectifsEtablissement,activitePrincipaleRegistreMetiersEtablissement,dateDernierTraitementEtablissement,etablissementSiege,nombrePeriodesEtablissement,complementAdresseEtablissement,numeroVoieEtablissement,indiceRepetitionEtablissement,typeVoieEtablissement,libelleVoieEtablissement,codePostalEtablissement,libelleCommuneEtablissement,libelleCommuneEtrangerEtablissement,distributionSpecialeEtablissement,codeCommuneEtablissement,codeCedexEtablissement,libelleCedexEtablissement,codePaysEtrangerEtablissement,libellePaysEtrangerEtablissement,complementAdresse2Etablissement,numeroVoie2Etablissement,indiceRepetition2Etablissement,typeVoie2Etablissement,libelleVoie2Etablissement,codePostal2Etablissement,libelleCommune2Etablissement,libelleCommuneEtranger2Etablissement,distributionSpeciale2Etablissement,codeCommune2Etablissement,codeCedex2Etablissement,libelleCedex2Etablissement,codePaysEtranger2Etablissement,libellePaysEtranger2Etablissement,dateDebut,etatAdministratifEtablissement,enseigne1Etablissement,enseigne2Etablissement,enseigne3Etablissement,denominationUsuelleEtablissement,activitePrincipaleEtablissement,nomenclatureActivitePrincipaleEtablissement,caractereEmployeurEtablissement,longitude,latitude,geo_score,geo_type,geo_adresse,geo_id,geo_ligne,geo_l4,geo_l5
200096865,00015,20009686500015,O,2021-11-30,,,,2022-03-09T08:35:32,true,1,MAIRIE DE HUMBLIGNY,,,,LE BOURG,18250,HUMBLIGNY,,,18111,,,,,,,,,,,,,,,,,,,2021-11-30,A,,,,,84.11Z,NAFRev2,O,2.660744,47.253922,0.94,street,Le Bourg 18250 Humbligny,18111_qb3gz2,G,LE BOURG,
211801113,00013,21180111300013,O,1983-03-01,02,2019,,2021-10-27T08:07:05,true,4,,,,RTE,D'HENRICHEMONT,18250,HUMBLIGNY,,,18111,,,,,,,,,,,,,,,,,,,2008-01-01,A,MAIRIE,,,,84.11Z,NAFRev2,O,2.2840495,47.2647533,0.8,poi.track,Route Forestière d'Henrichemont (Chemin) Vouzeron,https://osm.org/way/42309741,G,,
211801113,00039,21180111300039,O,2001-12-25,NN,,,,false,3,MAIRIE,,,RTE,D'HENRICHEMONT,18250,HUMBLIGNY,,,18111,,,,,,,,,,,,,,,,,,,2003-12-25,F,SERVICE ORDURES MENAGERES,,,,90.0B,NAFRev1,N,2.2840495,47.2647533,0.8,poi.track,Route Forestière d'Henrichemont (Chemin) Vouzeron,https://osm.org/way/42309741,G,,
251800397,00035,25180039700035,O,2001-11-16,03,2019,,2021-12-28T03:43:17,true,4,MAIRIE,,,RTE,D'HENRICHEMONT,18250,HUMBLIGNY,,,18111,,,,,,,,,,,,,,,,,,,2021-03-25,F,,,,,36.00Z,NAFRev2,O,2.2840495,47.2647533,0.8,poi.track,Route Forestière d'Henrichemont (Chemin) Vouzeron,https://osm.org/way/42309741,G,,
251807582,00027,25180758200027,O,2002-08-13,03,2019,,2021-12-21T03:47:43,true,4,MAIRIE,,,RTE,D'HENRICHEMONT,18250,HUMBLIGNY,,,18111,,,,,,,,,,,,,,,,,,,2021-11-30,F,,,,,84.11Z,NAFRev2,N,2.2840495,47.2647533,0.8,poi.track,Route Forestière d'Henrichemont (Chemin) Vouzeron,https://osm.org/way/42309741,G,,
261803167,00012,26180316700012,O,1995-12-25,NN,,,2010-06-26T03:05:59,true,2,MAIRIE,,,RTE,D'HENRICHEMONT,18250,HUMBLIGNY,,,18111,,,,,,,,,,,,,,,,,,,2008-01-01,A,CCAS,,,,88.99B,NAFRev2,N,2.2840495,47.2647533,0.8,poi.track,Route Forestière d'Henrichemont (Chemin) Vouzeron,https://osm.org/way/42309741,G,,
291800290,00012,29180029000012,O,,NN,,,2006-11-25T09:10:28,true,1,,,,,,18250,HUMBLIGNY,,,18111,,,,,,,,,,,,,,,,,,,1987-12-31,F,,,,,90.12,NAP,N,,,0,,,,,,
305799587,00012,30579958700012,O,1976-01-01,NN,,,2008-11-07T00:21:33,true,4,,,,,LE FAVIOT,18250,HUMBLIGNY,,,18111,,,,,,,,,,,,,,,,,,,2006-12-31,F,,,,,45.2V,NAFRev1,O,2.65975,47.255431,0.65,street,Les Faviots 18250 Humbligny,18111_vssq7d,G,LES FAVIOTS,
306883026,00032,30688302600032,O,1982-12-31,NN,,,,true,1,,,,,FRANCHAUD,18250,HUMBLIGNY,,,18111,,,,,,,,,,,,,,,,,,,2002-11-01,F,,,,,01.1A,NAF1993,N,2.658913,47.257608,0.93,street,Franchaud 18250 Humbligny,18111_88rofj,G,FRANCHAUD,
309078129,00033,30907812900033,O,,NN,,,,true,1,,,,,LES BIONS,18250,HUMBLIGNY,,,18111,,,,,,,,,,,,,,,,,,,1997-08-28,F,,,,,45.3A,NAF1993,N,2.64316,47.263814,0.93,street,Les Bions 18250 Humbligny,18111_0tu32l,G,LES BIONS,
325644326,00010,32564432600010,O,1982-10-01,01,2019,,2021-10-27T08:24:44,true,4,,,,,LA CHAUME,18250,HUMBLIGNY,,,18111,,,,,,,,,,,,,,,,,,,2012-12-31,A,,,,,01.11Z,NAFRev2,O,2.682816,47.259803,0.93,street,La Chaume 18250 Humbligny,18111_y1uzhe,G,LA CHAUME,
326022779,00010,32602277900010,O,,NN,,,,true,1,,,,LD,LES BARONS,18250,HUMBLIGNY,,,18111,,,,,,,,,,,,,,,,,,,,F,,,,,02.20,NAP,N,2.642004,47.270894,0.94,street,Les Barons 18250 Humbligny,18111_kbsjig,G,LES BARONS,
329110928,00010,32911092800010,O,,NN,,,,true,1,,,,LD,LES POTERIES,18250,HUMBLIGNY,,,18111,,,,,,,,,,,,,,,,,,,1991-06-30,F,,,,,01.00,NAP,N,2.633697,47.283015,0.94,street,Les Poteries 18250 Humbligny,18111_hqwxxt,G,LES POTERIES,
330348772,00014,33034877200014,O,1982-05-01,NN,,,,true,1,,,,LD,CHAMPARLAUT,18250,HUMBLIGNY,,,18111,,,,,,,,,,,,,,,,,,,2002-10-05,F,,,,,01.1A,NAF1993,N,2.642507,47.254668,0.84,street,Champarlan d’En Haut 18250 Humbligny,18111_B063,G,CHAMPARLAN D EN HAUT,
330348780,00017,33034878000017,O,1983-01-01,NN,,,,true,1,,,,LD,LA METAIRIE,18250,HUMBLIGNY,,,18111,,,,,,,,,,,,,,,,,,,1997-12-19,F,,,,,01.1A,NAF1993,N,2.686644,47.254402,0.91,street,La Metairie des Vignes 18250 Humbligny,18111_B155,G,LA METAIRIE DES VIGNES,
330348798,00019,33034879800019,O,1983-01-01,NN,,,2006-12-15T00:25:18,false,3,,,,LD,LA MOTTE,18250,HUMBLIGNY,,,18111,,,,,,,,,,,,,,,,,,,1992-12-31,F,,,,,01.1A,NAF1993,N,2.642286,47.255267,0.94,street,La Motte 18250 Humbligny,18111_vq1kcw,G,LA MOTTE,
330354713,00019,33035471300019,O,,NN,,,,true,1,,,,LD,FRANCHAND,18250,HUMBLIGNY,,,18111,,,,,,,,,,,,,,,,,,,1989-07-01,F,,,,,01.00,NAP,N,2.658913,47.257608,0.65,street,Franchaud 18250 Humbligny,18111_88rofj,G,FRANCHAUD,
333317030,00026,33331703000026,O,,NN,,,,true,1,,,,LD,LA METAIRIE DES VIGNES,18250,HUMBLIGNY,,,18111,,,,,,,,,,,,,,,,,,,1996-06-30,F,,,,,52.1B,NAF1993,N,2.686644,47.254402,0.93,street,La Metairie des Vignes 18250 Humbligny,18111_B155,G,LA METAIRIE DES VIGNES,
334833001,00012,33483300100012,O,1986-02-17,NN,,,2018-08-11T04:03:14,true,3,,,,,MAIRIE,18250,HUMBLIGNY,,,18111,,,,,,,,,,,,,,,,,,,2008-01-01,A,,,,,01.61Z,NAFRev2,N,2.686644,47.254402,0.64,street,La Metairie des Vignes 18250 Humbligny,18111_B155,G,LA METAIRIE DES VIGNES,
335342499,00019,33534249900019,O,,NN,,,,true,1,,,,,BEL AIR,18250,HUMBLIGNY,,,18111,,,,,,,,,,,,,,,,,,,1988-01-15,F,,,,,69.12,NAP,N,0.0764865,43.2227045,0.9,poi.park,Parc Bel-Air Tarbes,https://osm.org/way/240265561,G,,
337523757,00017,33752375700017,O,1985-01-01,NN,,,2019-06-04T03:52:27,true,4,,,,,CHAMPARLANT,18250,HUMBLIGNY,,,18111,,,,,,,,,,,,,,,,,,,2018-07-21,F,,,,,01.11Z,NAFRev2,N,2.642507,47.254668,0.77,street,Champarlan d’En Haut 18250 Humbligny,18111_B063,G,CHAMPARLAN D EN HAUT,
337523757,00025,33752375700025,O,2007-01-01,,,,2019-06-04T03:52:27,false,2,,,,,CHAMPARLAN,18250,HUMBLIGNY,,,18111,,,,,,,,,,,,,,,,,,,2018-07-21,F,,,,,02.20Z,NAFRev2,N,2.641415,47.252974,0.92,street,Champarlan d’En Bas 18250 Humbligny,18111_B062,G,CHAMPARLAN D EN BAS,
338858764,00016,33885876400016,O,,NN,,,,true,1,,,,,BLIN,18250,HUMBLIGNY,,,18111,,,,,,,,,,,,,,,,,,,1993-03-01,F,,,,,01.1A,NAF1993,N,2.652977,47.257934,0.93,street,Blin 18250 Humbligny,18111_o3oubw,G,BLIN,
341603926,00039,34160392600039,O,2002-05-02,,,,,true,3,,,,LD,LE CHETIF MOULIN,18250,HUMBLIGNY,,,18111,,,,,,,,,,,,,,,,,,,2002-12-25,F,,,,,92.1B,NAF1993,N,2.631603,47.274073,0.93,street,Le Chetif Moulin 18250 Humbligny,18111_B086,G,LE CHETIF MOULIN,
348634817,00020,34863481700020,O,2011-07-31,,,5610CQ,2021-02-23T11:01:37,true,1,,,,HAM,DE LASS,18250,HUMBLIGNY,,,18111,,,,,,,,,,,,,,,,,,,2011-07-31,A,,,,,56.21Z,NAFRev2,N,2.629089,47.252998,0.92,street,Vge de Lass 18250 Humbligny,18111_B266,G,VGE DE LASS,
349737163,00015,34973716300015,O,1989-01-01,NN,,,,true,1,,,,,CHAMPARLAU,18250,HUMBLIGNY,,,18111,,,,,,,,,,,,,,,,,,,2001-12-01,F,,,,,01.1A,NAF1993,N,2.642507,47.254668,0.75,street,Champarlan d’En Haut 18250 Humbligny,18111_B063,G,CHAMPARLAN D EN HAUT,
350009718,00015,35000971800015,O,1989-01-20,NN,,,2006-10-27T23:35:06,false,3,,,,,CONQUES HAUT,18250,HUMBLIGNY,,,18111,,,,,,,,,,,,,,,,,,,2005-01-01,F,,,,,01.1A,NAFRev1,N,2.628972,47.233685,0.92,street,Conques Haut Village 18250 Humbligny,18111_B101,G,CONQUES HAUT VILLAGE,
350009718,00023,35000971800023,O,2005-01-01,NN,,,2021-02-23T11:02:48,true,3,,,,LD,LE BOURG,18250,HUMBLIGNY,,,18111,,,,,,,,,,,,,,,,,,,2012-12-31,A,,,,,01.11Z,NAFRev2,O,2.660744,47.253922,0.94,street,Le Bourg 18250 Humbligny,18111_qb3gz2,G,LE BOURG,
350071270,00028,35007127000028,O,1996-09-01,NN,,,2008-11-08T00:25:26,false,5,LE CHETIF MOULIN D EN HAUT,,,,LE CHETIF MOULIN D EN HAUT,18250,HUMBLIGNY,,,18111,,,,,,,,,,,,,,,,,,,2006-07-20,F,,,,,93.0L,NAFRev1,N,2.631603,47.274073,0.63,street,Le Chetif Moulin 18250 Humbligny,18111_B086,G,LE CHETIF MOULIN,
350227815,00049,35022781500049,O,2012-12-07,,,,2022-02-16T09:14:57,true,3,,,,,LA BOUTANDERIE,18250,HUMBLIGNY,,,18111,,,,,,,,,,,,,,,,,,,2022-02-12,A,,,,,74.30Z,NAFRev2,N,2.648196,47.267365,0.93,street,La Boutanderie 18250 Humbligny,18111_3og53a,G,LA BOUTANDERIE,
352022479,00013,35202247900013,O,1989-08-01,NN,,,2008-01-04T23:37:44,true,3,,,,,LA MOTTE,18250,HUMBLIGNY,,,18111,,,,,,,,,,,,,,,,,,,2008-01-01,A,,,,,90.03B,NAFRev2,N,2.642286,47.255267,0.94,street,La Motte 18250 Humbligny,18111_vq1kcw,G,LA MOTTE,
352420012,00010,35242001200010,O,1989-07-01,NN,,,2016-02-12T04:07:15,true,4,,,,LD,FRANCHAND,18250,HUMBLIGNY,,,18111,,,,,,,,,,,,,,,,,,,2015-08-31,F,,,,,01.11Z,NAFRev2,N,2.658913,47.257608,0.65,street,Franchaud 18250 Humbligny,18111_88rofj,G,FRANCHAUD,
377889134,00013,37788913400013,O,1990-01-01,NN,,,2009-09-16T09:38:32,true,4,,,,,CONQUES BAS,18250,HUMBLIGNY,,,18111,,,,,,,,,,,,,,,,,,,2009-09-30,F,,,,,01.11Z,NAFRev2,N,2.628713,47.236831,0.92,street,Conques Bas Village 18250 Humbligny,18111_B100,G,CONQUES BAS VILLAGE,
378775050,00024,37877505000024,O,1993-03-01,,,,,false,3,,,,,LES CHOCHERONS,18250,HUMBLIGNY,,,18111,,,,,,,,,,,,,,,,,,,1997-12-25,F,,,,,74.1J,NAF1993,N,2.650746,47.271603,0.93,street,Les Chocherons 18250 Humbligny,18111_ri4srl,G,LES CHOCHERONS,
380043513,00015,38004351300015,O,1977-09-01,NN,,,2021-12-24T03:59:04,true,4,HUMBLIGNY,,,,DOMAINE DE LA ROUTE,18250,HUMBLIGNY,,,18111,,,,,,,,,,,,,,,,,,,2021-11-30,F,,,,,01.11Z,NAFRev2,N,2.672027,47.247043,0.93,street,Domaine de la Route 18250 Humbligny,18111_B114,G,DOMAINE DE LA ROUTE,
381118009,00020,38111800900020,O,2006-08-01,,,9524ZZ,2016-01-20T11:31:43,true,2,,,,LD,LE BOURG,18250,HUMBLIGNY,,,18111,,,,,,,,,,,,,,,,,,,2008-01-01,A,,,,,01.24Z,NAFRev2,N,2.660744,47.253922,0.94,street,Le Bourg 18250 Humbligny,18111_qb3gz2,G,LE BOURG,
381191097,00017,38119109700017,O,1991-01-01,NN,,,2018-09-29T12:09:40,true,3,,,,LD,LA CHAUME,18250,HUMBLIGNY,,,18111,,,,,,,,,,,,,,,,,,,2008-01-01,A,,,,,01.11Z,NAFRev2,N,2.682816,47.259803,0.93,street,La Chaume 18250 Humbligny,18111_y1uzhe,G,LA CHAUME,
382611945,00025,38261194500025,O,1900-01-01,NN,,,2011-04-28T00:48:50,false,3,,,,,LE CHETIF MOULIN D EN HAUT,18250,HUMBLIGNY,,,18111,,,,,,,,,,,,,,,,,,,1996-08-31,F,,,,,15.6A,NAF1993,N,2.631603,47.274073,0.63,street,Le Chetif Moulin 18250 Humbligny,18111_B086,G,LE CHETIF MOULIN,
383565710,00019,38356571000019,O,1991-07-01,NN,,,2017-06-02T10:12:51,true,4,,,,,FERME DES POTERIES,18250,HUMBLIGNY,,,18111,,,,,,,,,,,,,,,,,,,2008-01-01,A,,,,,01.50Z,NAFRev2,N,2.633697,47.283015,0.56,street,Les Poteries 18250 Humbligny,18111_hqwxxt,G,LES POTERIES,
384493631,00012,38449363100012,O,1992-01-01,NN,,,2017-06-02T04:11:36,true,4,,,,,LES BARONS,18250,HUMBLIGNY,,,18111,,,,,,,,,,,,,,,,,,,2017-04-01,F,,,,,01.42Z,NAFRev2,N,2.642004,47.270894,0.94,street,Les Barons 18250 Humbligny,18111_kbsjig,G,LES BARONS,
389177098,00016,38917709800016,O,,,,,,true,1,,,,,DOMAINE DU BOURG,18250,HUMBLIGNY,,,18111,,,,,,,,,,,,,,,,,,,1994-10-30,F,,,,,01.2C,NAF1993,N,2.650807,47.257082,0.5,street,Domaine de Blin 18250 Humbligny,18111_B113,G,DOMAINE DE BLIN,
390061513,00011,39006151300011,O,1993-01-01,NN,,,2008-01-04T23:34:35,true,3,,,,LD,LA MOTTE,18250,HUMBLIGNY,,,18111,,,,,,,,,,,,,,,,,,,2008-01-01,A,,,,,01.11Z,NAFRev2,N,2.642286,47.255267,0.94,street,La Motte 18250 Humbligny,18111_vq1kcw,G,LA MOTTE,
391085891,00011,39108589100011,O,1993-03-01,NN,,,2019-06-24T09:44:51,true,4,,,,,BLIN,18250,HUMBLIGNY,,,18111,,,,,,,,,,,,,,,,,,,2012-12-31,A,,,,,01.11Z,NAFRev2,O,2.652977,47.257934,0.93,street,Blin 18250 Humbligny,18111_o3oubw,G,BLIN,
401027479,00013,40102747900013,O,1995-05-19,NN,,,,true,4,,,,,LA METAIRIE DES VIGNES,18250,HUMBLIGNY,,,18111,,,,,,,,,,,,,,,,,,,2001-11-05,F,,,,,70.2C,NAF1993,N,2.686644,47.254402,0.93,street,La Metairie des Vignes 18250 Humbligny,18111_B155,G,LA METAIRIE DES VIGNES,
402691703,00019,40269170300019,O,1994-01-01,NN,,,,true,1,,,,,CHAMPENLAN,18250,HUMBLIGNY,,,18111,,,,,,,,,,,,,,,,,,,1999-12-31,F,,,,,01.3Z,NAF1993,N,,,0,,,,,,
410879787,00019,41087978700019,O,1996-01-01,NN,,,2008-04-25T00:26:51,false,3,,,,,LES BOUTIQUES,18250,HUMBLIGNY,,,18111,,,,,,,,,,,,,,,,,,,2004-12-31,F,,,,,01.1A,NAFRev1,N,2.665644,47.265868,0.5,street,Les Boullois 18250 Humbligny,18111_pvv53j,G,LES BOULLOIS,
411333123,00015,41133312300015,O,1996-10-15,NN,,,2006-12-15T01:05:40,false,3,,,,,LES BOUTIQUES,18250,HUMBLIGNY,,,18111,,,,,,,,,,,,,,,,,,,2004-09-01,F,,,,,01.2C,NAFRev1,N,2.665644,47.265868,0.5,street,Les Boullois 18250 Humbligny,18111_pvv53j,G,LES BOULLOIS,
413924507,00010,41392450700010,O,1988-12-31,NN,,,2008-01-04T22:40:37,true,3,,,,,LES CHEZEAUX,18250,HUMBLIGNY,,,18111,,,,,,,,,,,,,,,,,,,2008-01-01,A,,,,,01.21Z,NAFRev2,N,2.626333,47.250209,0.93,street,Les Chezeaux 18250 Humbligny,18111_22i0oo,G,LES CHEZEAUX,
420845950,00013,42084595000013,O,1998-11-01,NN,,,2008-01-04T23:58:12,false,3,,,,,LES CHICHARDS,18250,HUMBLIGNY,,,18111,,,,,,,,,,,,,,,,,,,2008-01-01,A,,,,,90.01Z,NAFRev2,N,2.659389,47.275153,0.93,street,Les Chichards 18250 Humbligny,18111_ladzr6,G,LES CHICHARDS,
428637300,00016,42863730000016,O,1996-04-01,NN,,,2017-08-22T10:28:49,true,4,,,,,,18250,HUMBLIGNY,,,18111,,,,,,,,,,,,,,,,,,,2017-06-25,F,,,,,01.21Z,NAFRev2,N,,,0,,,,,,
433704061,00020,43370406100020,O,2001-12-21,NN,,,,true,4,,,,LD,LE CHETIF MOULIN,18250,HUMBLIGNY,,,18111,,,,,,,,,,,,,,,,,,,2002-10-25,F,,,,,92.1B,NAF1993,N,2.631603,47.274073,0.93,street,Le Chetif Moulin 18250 Humbligny,18111_B086,G,LE CHETIF MOULIN,
435113808,00016,43511380800016,O,2001-03-03,NN,,,2009-12-20T05:24:55,true,3,,,,LD,LA METAIRIE DES VIGNES,18250,HUMBLIGNY,,,18111,,,,,,,,,,,,,,,,,,,2008-01-01,A,,,,,68.20B,NAFRev2,N,2.686644,47.254402,0.93,street,La Metairie des Vignes 18250 Humbligny,18111_B155,G,LA METAIRIE DES VIGNES,
438082026,00016,43808202600016,O,2001-07-02,NN,,,2018-02-14T13:42:45,false,4,,,,LD,LA METAIRIE DES VIGNES,18250,HUMBLIGNY,,,18111,,,,,,,,,,,,,,,,,,,2008-12-31,F,,,,,55.20Z,NAFRev2,N,2.686644,47.254402,0.93,street,La Metairie des Vignes 18250 Humbligny,18111_B155,G,LA METAIRIE DES VIGNES,
440558971,00014,44055897100014,O,2001-12-01,NN,,,2014-01-14T03:11:51,true,3,,,,LD,CHAMPARLAN,18250,HUMBLIGNY,,,18111,,,,,,,,,,,,,,,,,,,2008-01-01,A,,,,,01.50Z,NAFRev2,N,2.641415,47.252974,0.92,street,Champarlan d’En Bas 18250 Humbligny,18111_B062,G,CHAMPARLAN D EN BAS,
441220084,00012,44122008400012,O,2001-12-01,NN,,,2008-01-04T21:15:10,true,3,,,,,CHAMPARLAN,18250,HUMBLIGNY,,,18111,,,,,,,,,,,,,,,,,,,2008-01-01,A,,,,,68.20B,NAFRev2,N,2.641415,47.252974,0.92,street,Champarlan d’En Bas 18250 Humbligny,18111_B062,G,CHAMPARLAN D EN BAS,
444639132,00026,44463913200026,O,2002-11-01,NN,,,2008-01-04T22:33:41,true,3,,,,,FRANCHAUD,18250,HUMBLIGNY,,,18111,,,,,,,,,,,,,,,,,,,2008-01-01,A,,,,,01.11Z,NAFRev2,N,2.658913,47.257608,0.93,street,Franchaud 18250 Humbligny,18111_88rofj,G,FRANCHAUD,
444864573,00027,44486457300027,O,2003-05-23,NN,,,2008-11-08T02:21:34,false,3,,,,,LE BOURG,18250,HUMBLIGNY,,,18111,,,,,,,,,,,,,,,,,,,2007-06-01,F,,,,,92.7C,NAFRev1,N,2.660744,47.253922,0.94,street,Le Bourg 18250 Humbligny,18111_qb3gz2,G,LE BOURG,
449939750,00013,44993975000013,O,2003-07-01,NN,,,2013-05-18T02:27:09,true,4,,,,LD,CHAMPARLAN,18250,HUMBLIGNY,,,18111,,,,,,,,,,,,,,,,,,,2011-01-31,F,,,,,01.11Z,NAFRev2,N,2.641415,47.252974,0.92,street,Champarlan d’En Bas 18250 Humbligny,18111_B062,G,CHAMPARLAN D EN BAS,
451072144,00020,45107214400020,O,2021-04-01,,,,2021-12-03T03:51:49,true,2,,,,,CONQUES BAS,18250,HUMBLIGNY,,,18111,,,,,,,,,,,,,,,,,,,2021-11-30,F,,,,,01.13Z,NAFRev2,N,2.628713,47.236831,0.92,street,Conques Bas Village 18250 Humbligny,18111_B100,G,CONQUES BAS VILLAGE,
479306482,00015,47930648200015,O,2004-07-16,NN,,,2014-01-12T04:12:19,true,4,,,,LD,FRANCHAUD,18250,HUMBLIGNY,,,18111,,,,,,,,,,,,,,,,,,,2013-06-29,F,,,,,70.10Z,NAFRev2,N,2.658913,47.257608,0.93,street,Franchaud 18250 Humbligny,18111_88rofj,G,FRANCHAUD,
479346728,00013,47934672800013,O,2004-11-03,NN,,,2011-04-23T13:37:09,true,5,,,,HAM,DE CEVRY,18250,HUMBLIGNY,,,18111,,,,,,,,,,,,,,,,,,,2010-12-21,F,,,,,59.11B,NAFRev2,N,2.653791,47.269485,0.61,street,Lieu Dit Cevry 18250 Humbligny,18111_o0850i,G,LIEU DIT CEVRY,
481455186,00017,48145518600017,O,2005-03-17,,,,2014-01-27T08:03:25,false,2,,,,LD,LES BOUTIQUES,18250,HUMBLIGNY,,,18111,,,,,,,,,,,,,,,,,,,2006-12-31,F,,,,,01.2C,NAFRev1,N,2.665644,47.265868,0.5,street,Les Boullois 18250 Humbligny,18111_pvv53j,G,LES BOULLOIS,
482327194,00015,48232719400015,O,2005-05-02,,,,2011-03-05T13:00:19,true,3,,,,,LE CHETIF MOULIN,18250,HUMBLIGNY,,,18111,,,,,,,,,,,,,,,,,,,2010-12-21,F,,,,,46.90Z,NAFRev2,N,2.631603,47.274073,0.93,street,Le Chetif Moulin 18250 Humbligny,18111_B086,G,LE CHETIF MOULIN,
483420642,00017,48342064200017,O,2005-08-22,,,,2018-12-15T03:41:16,true,3,,,,,LE BOURG,18250,HUMBLIGNY,,,18111,,,,,,,,,,,,,,,,,,,2013-08-01,F,,,,,88.10A,NAFRev2,N,2.660744,47.253922,0.94,street,Le Bourg 18250 Humbligny,18111_qb3gz2,G,LE BOURG,
484684113,00018,48468411300018,O,2004-09-01,NN,,,2011-04-23T14:42:32,true,3,,,,,LA METAIRIE DES VIGNES,18250,HUMBLIGNY,,,18111,,,,,,,,,,,,,,,,,,,2008-01-01,A,,,,,93.29Z,NAFRev2,O,2.686644,47.254402,0.93,street,La Metairie des Vignes 18250 Humbligny,18111_B155,G,LA METAIRIE DES VIGNES,
484750591,00014,48475059100014,O,2005-11-01,,,,2008-01-05T01:40:58,true,2,LES GROSSES BONDES,,,,CHAMPARLAN,18250,HUMBLIGNY,,,18111,,,,,,,,,,,,,,,,,,,2008-01-01,A,,,,,01.49Z,NAFRev2,N,2.641415,47.252974,0.92,street,Champarlan d’En Bas 18250 Humbligny,18111_B062,G,CHAMPARLAN D EN BAS,
489043513,00014,48904351300014,O,2006-03-01,,,,2020-02-22T03:35:22,true,2,,,,,LE CHETIF MOULIN,18250,HUMBLIGNY,,,18111,,,,,,,,,,,,,,,,,,,2008-01-01,A,,,,,68.20B,NAFRev2,N,2.631603,47.274073,0.93,street,Le Chetif Moulin 18250 Humbligny,18111_B086,G,LE CHETIF MOULIN,
489357616,00015,48935761600015,O,2006-03-28,NN,,,2011-04-23T15:14:42,true,5,,,,LD,LE CHETIF MOULIN,18250,HUMBLIGNY,,,18111,,,,,,,,,,,,,,,,,,,2010-12-21,F,,,,,59.11A,NAFRev2,N,2.631603,47.274073,0.93,street,Le Chetif Moulin 18250 Humbligny,18111_B086,G,LE CHETIF MOULIN,
489566414,00020,48956641400020,O,2011-01-07,,,2341ZZ,2015-03-17T01:29:41,true,3,,22,,,CONQUES BAS,18250,HUMBLIGNY,,,18111,,,,,,,,,,,,,,,,,,,2012-12-12,A,LES POTS AIMENT,,,,23.41Z,NAFRev2,N,2.628713,47.236831,0.92,street,Conques Bas Village 18250 Humbligny,18111_B100,G,CONQUES BAS VILLAGE,
501919609,00013,50191960900013,O,2008-04-01,,,,2016-04-10T03:17:02,true,2,,,,,CONQUES BAS,18250,HUMBLIGNY,,,18111,,,,,,,,,,,,,,,,,,,2015-12-31,F,,,,,01.13Z,NAFRev2,N,2.628713,47.236831,0.92,street,Conques Bas Village 18250 Humbligny,18111_B100,G,CONQUES BAS VILLAGE,
504782145,00024,50478214500024,O,2008-05-14,,,,2009-02-04T08:27:18,false,2,,,,,LIEU DIT CHAMPARLAN,18250,HUMBLIGNY,,,18111,,,,,,,,,,,,,,,,,,,2008-12-31,F,,,,,69.20Z,NAFRev2,N,2.641415,47.252974,0.92,street,Champarlan d’En Bas 18250 Humbligny,18111_B062,G,CHAMPARLAN D EN BAS,
504887878,00016,50488787800016,O,2008-03-16,NN,,,2020-03-05T16:02:32,true,3,,,,,CONQUES BAS,18250,HUMBLIGNY,,,18111,,,,,,,,,,,,,,,,,,,2018-12-31,F,,,,,94.99Z,NAFRev2,O,2.628713,47.236831,0.92,street,Conques Bas Village 18250 Humbligny,18111_B100,G,CONQUES BAS VILLAGE,
509133302,00018,50913330200018,O,2008-10-08,,,,2008-11-25T04:51:33,true,1,,,,,CONQUES BAS VILLAGES,18250,HUMBLIGNY,,,18111,,,,,,,,,,,,,,,,,,,2008-10-08,A,,,,,68.20B,NAFRev2,N,2.628713,47.236831,0.89,street,Conques Bas Village 18250 Humbligny,18111_B100,G,CONQUES BAS VILLAGE,
509673224,00010,50967322400010,O,2008-12-20,,,,2010-06-10T03:09:33,true,1,,,,LD,LE CHETIF MOULIN DU BAS,18250,HUMBLIGNY,,,18111,,,,,,,,,,,,,,,,,,,2008-12-20,A,,,,,55.20Z,NAFRev2,N,2.631603,47.274073,0.7,street,Le Chetif Moulin 18250 Humbligny,18111_B086,G,LE CHETIF MOULIN,
510535818,00031,51053581800031,O,2016-09-14,,,,2021-08-10T19:53:14,true,2,,,,RUE,CONQUES BAS,18250,HUMBLIGNY,,,18111,,,,,,,,,,,,,,,,,,,2020-12-31,F,,,,,91.03Z,NAFRev2,N,2.628713,47.236831,0.68,street,Conques Bas Village 18250 Humbligny,18111_B100,G,CONQUES BAS VILLAGE,
511792319,00010,51179231900010,O,2009-04-01,02,2019,,2021-10-27T08:18:20,true,3,,,,LD,LE CHETIF MOULIN DU BAS,18250,HUMBLIGNY,,,18111,,,,,,,,,,,,,,,,,,,2019-04-30,A,,,,,59.11B,NAFRev2,O,2.631603,47.274073,0.7,street,Le Chetif Moulin 18250 Humbligny,18111_B086,G,LE CHETIF MOULIN,
512006966,00018,51200696600018,O,2009-04-01,NN,,,2015-05-14T06:58:57,true,1,,,,,LA METAIRIE DES VIGNES,18250,HUMBLIGNY,,,18111,,,,,,,,,,,,,,,,,,,2009-04-01,A,CENTRE EQUESTRE M.D.V.,,,,85.51Z,NAFRev2,N,2.686644,47.254402,0.93,street,La Metairie des Vignes 18250 Humbligny,18111_B155,G,LA METAIRIE DES VIGNES,
513740563,00038,51374056300038,O,2017-05-22,,,,2021-02-23T15:24:31,true,1,,,,LD,CHAMPARLAN D'EN HAUT,18250,HUMBLIGNY,,,18111,,,,,,,,,,,,,,,,,,,2017-05-22,A,,,,,82.30Z,NAFRev2,N,2.642507,47.254668,0.94,street,Champarlan d’En Haut 18250 Humbligny,18111_B063,G,CHAMPARLAN D EN HAUT,
515166759,00016,51516675900016,O,2009-09-28,,,,2019-02-28T03:37:35,true,1,,,,,LES BARONS,18250,HUMBLIGNY,,,18111,,,,,,,,,,,,,,,,,,,2009-09-28,A,,,,,68.20B,NAFRev2,N,2.642004,47.270894,0.94,street,Les Barons 18250 Humbligny,18111_kbsjig,G,LES BARONS,
521538140,00026,52153814000026,O,2012-12-01,,,,2015-03-03T07:30:09,false,2,,,,,LA MOTTE,18250,HUMBLIGNY,,,18111,,,,,,,,,,,,,,,,,,,2015-02-01,F,,,,,01.49Z,NAFRev2,N,2.642286,47.255267,0.94,street,La Motte 18250 Humbligny,18111_vq1kcw,G,LA MOTTE,
521711614,00011,52171161400011,O,2010-04-19,,,,2013-09-17T03:57:52,true,2,,,,,LE BOURG,18250,HUMBLIGNY,,,18111,,,,,,,,,,,,,,,,,,,2013-09-12,F,,,,,43.31Z,NAFRev2,N,2.660744,47.253922,0.94,street,Le Bourg 18250 Humbligny,18111_qb3gz2,G,LE BOURG,
524869708,00023,52486970800023,O,2014-04-01,,,,2015-11-16T10:11:54,false,2,,,,,CONQUES-BAS,18250,HUMBLIGNY,,,18111,,,,,,,,,,,,,,,,,,,2015-10-31,F,,,,MULTISERVICE MAISON,81.21Z,NAFRev2,N,2.628713,47.236831,0.92,street,Conques Bas Village 18250 Humbligny,18111_B100,G,CONQUES BAS VILLAGE,
524869708,00031,52486970800031,O,2015-01-01,,,,2020-09-16T03:54:58,false,2,,,,LD,CONQUES BAS,18250,HUMBLIGNY,,,18111,,,,,,,,,,,,,,,,,,,2015-12-31,F,,,,,01.13Z,NAFRev2,N,2.628713,47.236831,0.92,street,Conques Bas Village 18250 Humbligny,18111_B100,G,CONQUES BAS VILLAGE,
528270598,00022,52827059800022,O,2017-12-26,,,,2021-02-23T15:44:51,true,1,,,,,LES BOUTIQUES,18250,HUMBLIGNY,,,18111,,,,,,,,,,,,,,,,,,,2017-12-26,A,,,,,68.20B,NAFRev2,N,2.665644,47.265868,0.5,street,Les Boullois 18250 Humbligny,18111_pvv53j,G,LES BOULLOIS,
528469455,00018,52846945500018,O,2010-11-24,,,,2011-03-29T19:57:35,true,2,,,,,LIEUDIT LES ANES,18250,HUMBLIGNY,,,18111,,,,,,,,,,,,,,,,,,,2011-02-28,F,MACONNERIE - PEINTURE,,,,43.99C,NAFRev2,N,2.691722,47.26199,0.93,street,Les Anes 18250 Humbligny,18111_vggtb9,G,LES ANES,
529095895,00015,52909589500015,O,2011-01-01,,,,2012-11-10T02:47:26,true,1,,,,,LES BARONS,18250,HUMBLIGNY,,,18111,,,,,,,,,,,,,,,,,,,2011-01-01,A,,,,,86.90F,NAFRev2,N,2.642004,47.270894,0.94,street,Les Barons 18250 Humbligny,18111_kbsjig,G,LES BARONS,
530055284,00018,53005528400018,O,2011-02-01,NN,,,2020-01-21T04:14:15,true,2,,,,,CHAMPARLAN,18250,HUMBLIGNY,,,18111,,,,,,,,,,,,,,,,,,,2020-01-01,A,DOMAINE DE CHAMPARLAN,,,DOMAINE DE CHAMPARLAN,01.21Z,NAFRev2,N,2.641415,47.252974,0.92,street,Champarlan d’En Bas 18250 Humbligny,18111_B062,G,CHAMPARLAN D EN BAS,