siren,nic,siret,statutDiffusionEtablissement,dateCreationEtablissement,trancheEffectifsEtablissement,anneeEffectifsEtablissement,activitePrincipaleRegistreMetiersEtablissement,dateDernierTraitementEtablissement,etablissementSiege,nombrePeriodesEtablissement,complementAdresseEtablissement,numeroVoieEtablissement,indiceRepetitionEtablissement,typeVoieEtablissement,libelleVoieEtablissement,codePostalEtablissement,libelleCommuneEtablissement,libelleCommuneEtrangerEtablissement,distributionSpecialeEtablissement,codeCommuneEtablissement,codeCedexEtablissement,libelleCedexEtablissement,codePaysEtrangerEtablissement,libellePaysEtrangerEtablissement,complementAdresse2Etablissement,numeroVoie2Etablissement,indiceRepetition2Etablissement,typeVoie2Etablissement,libelleVoie2Etablissement,codePostal2Etablissement,libelleCommune2Etablissement,libelleCommuneEtranger2Etablissement,distributionSpeciale2Etablissement,codeCommune2Etablissement,codeCedex2Etablissement,libelleCedex2Etablissement,codePaysEtranger2Etablissement,libellePaysEtranger2Etablissement,dateDebut,etatAdministratifEtablissement,enseigne1Etablissement,enseigne2Etablissement,enseigne3Etablissement,denominationUsuelleEtablissement,activitePrincipaleEtablissement,nomenclatureActivitePrincipaleEtablissement,caractereEmployeurEtablissement,longitude,latitude,geo_score,geo_type,geo_adresse,geo_id,geo_ligne,geo_l4,geo_l5
212501738,00018,21250173800018,O,1983-03-01,01,2019,,2021-10-27T08:07:25,true,4,,1,,PL,DE L'EGLISE,25380,COUR-SAINT-MAURICE,,,25173,,,,,,,,,,,,,,,,,,,2013-05-26,A,MAIRIE,,,,84.11Z,NAFRev2,O,6.701729,47.256384,0.82,housenumber,1 Place de l’Eglise 25380 Cour-Saint-Maurice,25173_0025_00001,G,1 PLACE DE L EGLISE,
212501738,00026,21250173800026,O,1983-12-21,00,2019,,2021-10-27T08:07:25,false,3,,4,,,GRANDE RUE,25380,COUR-SAINT-MAURICE,,,25173,,,,,,,,,,,,,,,,,,,2008-01-01,A,ECOLE PRIMAIRE PUBLIQUE,,,,85.20Z,NAFRev2,N,6.700883,47.256064,0.94,housenumber,4 Grande Rue 25380 Cour-Saint-Maurice,25173_y6qyco_00004,G,4 GRANDE RUE,
212501738,00034,21250173800034,O,1996-12-01,NN,,,2019-11-14T14:00:26,false,4,MAIRIE,1,,PL,DE L'EGLISE,25380,COUR-SAINT-MAURICE,,,25173,,,,,,,,,,,,,,,,,,,2010-12-25,A,SERVICE D'EAU,,,,36.00Z,NAFRev2,N,6.701729,47.256384,0.82,housenumber,1 Place de l’Eglise 25380 Cour-Saint-Maurice,25173_0025_00001,G,1 PLACE DE L EGLISE,
212501738,00042,21250173800042,O,1996-12-01,NN,,,2019-11-14T14:00:26,false,4,MAIRIE,1,,PL,DE L'EGLISE,25380,COUR-SAINT-MAURICE,,,25173,,,,,,,,,,,,,,,,,,,2010-12-25,A,SERVICE D'ASSAINISSEMENT,,,,37.00Z,NAFRev2,N,6.701729,47.256384,0.82,housenumber,1 Place de l’Eglise 25380 Cour-Saint-Maurice,25173_0025_00001,G,1 PLACE DE L EGLISE,
212501738,00059,21250173800059,O,2002-01-01,,,,2019-11-14T14:00:26,false,4,MAIRIE,1,,PL,DE L'EGLISE,25380,COUR-SAINT-MAURICE,,,25173,,,,,,,,,,,,,,,,,,,2010-12-25,A,LOTISSEMENT DE BOICHOUTEY,,,,42.99Z,NAFRev2,N,6.701729,47.256384,0.82,housenumber,1 Place de l’Eglise 25380 Cour-Saint-Maurice,25173_0025_00001,G,1 PLACE DE L EGLISE,
252501739,00012,25250173900012,O,1983-03-01,01,2019,,2021-10-27T08:12:03,true,5,MAIRIE,1,,PL,DE L'EGLISE,25380,COUR-SAINT-MAURICE,,,25173,,,,,,,,,,,,,,,,,,,2013-05-26,A,,,,,84.13Z,NAFRev2,O,6.701729,47.256384,0.82,housenumber,1 Place de l’Eglise 25380 Cour-Saint-Maurice,25173_0025_00001,G,1 PLACE DE L EGLISE,
262501737,00015,26250173700015,O,1983-03-01,NN,,,2019-11-14T14:00:26,true,4,MAIRIE,1,,PL,DE L'EGLISE,25380,COUR-SAINT-MAURICE,,,25173,,,,,,,,,,,,,,,,,,,2010-12-25,A,,,,,88.99B,NAFRev2,N,6.701729,47.256384,0.82,housenumber,1 Place de l’Eglise 25380 Cour-Saint-Maurice,25173_0025_00001,G,1 PLACE DE L EGLISE,
262502941,00012,26250294100012,O,1986-01-01,NN,,,2019-11-14T14:00:26,true,4,MAIRIE,1,,PL,DE L'EGLISE,25380,COUR-SAINT-MAURICE,,,25173,,,,,,,,,,,,,,,,,,,2010-12-25,A,,,,,88.99B,NAFRev2,N,6.701729,47.256384,0.82,housenumber,1 Place de l’Eglise 25380 Cour-Saint-Maurice,25173_0025_00001,G,1 PLACE DE L EGLISE,
302796412,00013,30279641200013,O,,,,,2019-11-14T14:00:26,true,1,,,,,MOUGRAVERAT,25380,COUR-SAINT-MAURICE,,,25173,,,,,,,,,,,,,,,,,,,1985-12-25,F,,,,,81.21,NAP,N,,,0,,,,,,
305880437,00010,30588043700010,O,,,,,2019-11-14T14:00:26,true,1,,,,,,25380,COUR-SAINT-MAURICE,,,25173,,,,,,,,,,,,,,,,,,,1985-12-25,F,,,,,67.01,NAP,N,,,0,,,,,,
306219510,00014,30621951000014,O,,,,,2019-11-14T14:00:26,true,1,,,,,LE PONT NEUF,25380,COUR-SAINT-MAURICE,,,25173,,,,,,,,,,,,,,,,,,,1984-12-25,F,,,,,,,N,6.723691,47.261829,0.93,street,Le Pont Neuf 25380 Cour-Saint-Maurice,25173_A001,G,LE PONT NEUF,
307017913,00012,30701791300012,O,,,,,2019-11-14T14:00:26,true,1,,,,,LE PONT NEUF,25380,COUR-SAINT-MAURICE,,,25173,,,,,,,,,,,,,,,,,,,1984-12-25,F,,,,,67.01,NAP,N,6.723691,47.261829,0.93,street,Le Pont Neuf 25380 Cour-Saint-Maurice,25173_A001,G,LE PONT NEUF,
313467409,00014,31346740900014,O,1963-01-01,NN,,,2019-11-14T14:00:26,true,4,,,,,,25380,COUR-SAINT-MAURICE,,,25173,,,,,,,,,,,,,,,,,,,1993-12-25,F,,,,,50.2Z,NAF1993,N,,,0,,,,,,
316349802,00025,31634980200025,O,,NN,,,2019-11-14T14:00:26,true,1,,,,,MOULIN DU BAS,25380,COUR-SAINT-MAURICE,,,25173,,,,,,,,,,,,,,,,,,,1988-12-25,F,,,,,55.71,NAP,N,6.713439,47.254802,0.93,street,Le Moulin du Bas 25380 Cour-Saint-Maurice,25173_pwrm9z,G,LE MOULIN DU BAS,
319775409,00018,31977540900018,O,1975-03-28,NN,,,2021-03-05T08:52:28,true,4,,,,,,25380,COUR-SAINT-MAURICE,,,25173,,,,,,,,,,,,,,,,,,,2020-12-23,F,,,,,68.20B,NAFRev2,N,,,0,,,,,,
320988546,00018,32098854600018,O,,,,,2019-11-14T14:00:26,true,1,,,,,,25380,COUR-SAINT-MAURICE,,,25173,,,,,,,,,,,,,,,,,,,1984-12-25,F,,,,,64.48,NAP,N,,,0,,,,,,
320988926,00020,32098892600020,O,2017-05-06,,,,2021-02-23T10:44:51,true,1,,2,,,GRANDE RUE,25380,COUR-SAINT-MAURICE,,,25173,,,,,,,,,,,,,,,,,,,2017-05-06,A,,,,,68.20B,NAFRev2,N,6.700719,47.256014,0.94,housenumber,2 Grande Rue 25380 Cour-Saint-Maurice,25173_y6qyco_00002,G,2 GRANDE RUE,
322239674,00011,32223967400011,O,1981-07-06,NN,,3109AZ,2021-02-23T10:45:51,true,5,,,,RUE,DE LA CHAISERIE,25380,COUR-SAINT-MAURICE,,,25173,,,,,,,,,,,,,,,,,,,2019-09-24,A,,,,,31.09B,NAFRev2,N,6.706465,47.261764,0.94,street,Rue de la Chaiserie 25380 Cour-Saint-Maurice,25173_0014,G,RUE DE LA CHAISERIE,
329646152,00051,32964615200051,O,2013-09-01,,,,2019-11-14T14:00:26,true,2,,,,,L'AIGRE COTE,25380,COUR-SAINT-MAURICE,,,25173,,,,,,,,,,,,,,,,,,,2014-01-01,F,L'AIGRE COTE,,,,01.47Z,NAFRev2,N,6.718529,47.263474,0.93,street,L’Aigre Côte 25380 Cour-Saint-Maurice,25173_B001,G,L AIGRE COTE,
329706451,00039,32970645100039,O,2006-06-20,,,,2019-11-14T14:00:26,false,3,,5,,RUE,DE COUR,25380,COUR-SAINT-MAURICE,,,25173,,,,,,,,,,,,,,,,,,,2010-01-18,F,DOMI ENTREPREND,,,,43.99C,NAFRev2,N,6.705827,47.259746,0.94,housenumber,5 Rue de Cour 25380 Cour-Saint-Maurice,25173_0017_00005,G,5 RUE DE COUR,
330436056,00015,33043605600015,O,1900-01-01,,,,2019-11-14T14:00:26,false,3,,,,LD,PONT NEUF,25380,COUR-SAINT-MAURICE,,,25173,,,,,,,,,,,,,,,,,,,1991-12-25,F,,,,,67.01,NAP,N,6.723691,47.261829,0.92,street,Le Pont Neuf 25380 Cour-Saint-Maurice,25173_A001,G,LE PONT NEUF,
331115923,00046,33111592300046,O,2002-08-01,NN,,,2019-11-14T14:00:26,true,4,,,,LD,AUX ESSARDS CHARDOT,25380,COUR-SAINT-MAURICE,,,25173,,,,,,,,,,,,,,,,,,,2006-05-17,F,,,,,55.3A,NAFRev1,O,,,0,,,,,,
337539324,00018,33753932400018,O,1986-04-14,NN,,,2019-11-14T14:00:26,true,1,,,,,,25380,COUR-SAINT-MAURICE,,,25173,,,,,,,,,,,,,,,,,,,2002-01-31,F,,,,,36.1G,NAF1993,N,,,0,,,,,,
338378615,00029,33837861500029,O,1997-01-02,,,,2019-11-14T14:00:26,true,1,,,,LD,LE PONT NEUF,25380,COUR-SAINT-MAURICE,,,25173,,,,,,,,,,,,,,,,,,,1998-12-02,F,,,,,55.3A,NAF1993,N,6.723691,47.261829,0.93,street,Le Pont Neuf 25380 Cour-Saint-Maurice,25173_A001,G,LE PONT NEUF,
343830717,00017,34383071700017,O,1988-01-12,NN,,,2019-11-14T14:00:26,false,4,,,,,,25380,COUR-SAINT-MAURICE,,,25173,,,,,,,,,,,,,,,,,,,2000-04-01,F,,,,,01.1A,NAF1993,N,,,0,,,,,,
343830717,00025,34383071700025,O,2000-04-01,NN,,,2019-11-14T14:00:26,true,4,,7,,RUE,COUR,25380,COUR-SAINT-MAURICE,,,25173,,,,,,,,,,,,,,,,,,,2008-01-01,A,,,,,01.41Z,NAFRev2,N,6.703911,47.261246,0.93,housenumber,7 Rue de Cour 25380 Cour-Saint-Maurice,25173_0017_00007,G,7 RUE DE COUR,
356000430,01078,35600043001078,O,1991-01-01,NN,,,2019-11-14T14:00:26,false,3,,,,RTE,DE MAICHE,25380,COUR-SAINT-MAURICE,,,25173,,,,,,,,,,,,,,,,,,,2004-12-01,F,BUREAU DE PROXIMITE COUR SAINT MAURICE,,,,64.1A,NAFRev1,N,6.698884,47.256069,0.42,street,Route de Vaucluse 25380 Cour-Saint-Maurice,25173_0059,G,ROUTE DE VAUCLUSE,
379429798,00026,37942979800026,O,2006-05-17,NN,,,2019-11-14T14:00:26,true,6,LE PONT NEUF,,,,,25380,COUR-SAINT-MAURICE,,,25173,,,,,,,,,,,,,,,,,,,2015-10-27,A,,,,,56.10A,NAFRev2,N,6.723691,47.261829,0.93,street,Le Pont Neuf 25380 Cour-Saint-Maurice,25173_A001,D,LE PONT NEUF,
379933278,00010,37993327800010,O,,NN,,,2019-11-14T14:00:26,true,1,,,,RUE,DE LA CHAISERIE,25380,COUR-SAINT-MAURICE,,,25173,,,,,,,,,,,,,,,,,,,1991-08-31,F,,,,,02.20,NAP,N,6.706465,47.261764,0.94,street,Rue de la Chaiserie 25380 Cour-Saint-Maurice,25173_0014,G,RUE DE LA CHAISERIE,
379933385,00013,37993338500013,O,1990-11-12,NN,,,2019-11-14T14:00:26,false,5,,,,RUE,DE LA CHAISERIE,25380,COUR-SAINT-MAURICE,,,25173,,,,,,,,,,,,,,,,,,,2008-01-01,F,,,,,81.30Z,NAFRev2,N,6.706465,47.261764,0.94,street,Rue de la Chaiserie 25380 Cour-Saint-Maurice,25173_0014,G,RUE DE LA CHAISERIE,
379933385,00021,37993338500021,O,2009-01-15,02,2019,4339ZZ,2021-10-27T08:07:48,true,2,,34,,,GRANDE RUE,25380,COUR-SAINT-MAURICE,,,25173,,,,,,,,,,,,,,,,,,,2015-01-01,A,,,,,43.39Z,NAFRev2,O,6.709951,47.260054,0.94,housenumber,34 Grande Rue 25380 Cour-Saint-Maurice,25173_y6qyco_00034,G,34 GRANDE RUE,
379933484,00014,37993348400014,O,,NN,,,2019-11-14T14:00:26,true,1,,,,RUE,DE LA CHAISERIE,25380,COUR-SAINT-MAURICE,,,25173,,,,,,,,,,,,,,,,,,,1991-08-31,F,,,,,02.20,NAP,N,6.706465,47.261764,0.94,street,Rue de la Chaiserie 25380 Cour-Saint-Maurice,25173_0014,G,RUE DE LA CHAISERIE,
382522241,00019,38252224100019,O,1991-02-27,NN,,,2019-11-14T14:00:26,false,4,,,,,,25380,COUR-SAINT-MAURICE,,,25173,,,,,,,,,,,,,,,,,,,2018-03-19,F,,,,,68.20B,NAFRev2,N,,,0,,,,,,
382522241,00027,38252224100027,O,2018-03-19,,,,2019-11-14T14:00:26,true,1,,34,,,GRAND RUE,25380,COUR-SAINT-MAURICE,,,25173,,,,,,,,,,,,,,,,,,,2018-03-19,A,,,,,68.32A,NAFRev2,N,6.709951,47.260054,0.8,housenumber,34 Grande Rue 25380 Cour-Saint-Maurice,25173_y6qyco_00034,G,34 GRANDE RUE,
382716991,00015,38271699100015,O,1991-07-01,NN,,,2019-11-14T14:00:26,true,4,,,,PL,DE L EGLISE,25380,COUR-SAINT-MAURICE,,,25173,,,,,,,,,,,,,,,,,,,2003-04-02,F,,,,,36.1E,NAFRev1,O,6.701722,47.256519,0.81,street,Place de l’Eglise 25380 Cour-Saint-Maurice,25173_0025,G,PLACE DE L EGLISE,
382766327,00011,38276632700011,O,,,,,2019-11-14T14:00:26,true,1,,,,,LE PONT NEUF,25380,COUR-SAINT-MAURICE,,,25173,,,,,,,,,,,,,,,,,,,1994-02-01,F,,,,,55.3A,NAF1993,N,6.723691,47.261829,0.93,street,Le Pont Neuf 25380 Cour-Saint-Maurice,25173_A001,G,LE PONT NEUF,
389673393,00010,38967339300010,O,1993-01-01,NN,,,2019-11-14T14:00:26,true,3,,,,,,25380,COUR-SAINT-MAURICE,,,25173,,,,,,,,,,,,,,,,,,,2008-01-01,A,,,,,68.20A,NAFRev2,N,,,0,,,,,,
390219251,00019,39021925100019,O,1981-01-01,NN,,,2019-11-14T14:00:26,true,3,,,,,,25380,COUR-SAINT-MAURICE,,,25173,,,,,,,,,,,,,,,,,,,2005-12-01,F,,,,,01.2A,NAFRev1,N,,,0,,,,,,
390669091,00014,39066909100014,O,1993-01-01,NN,,,2019-11-14T14:00:26,false,4,,,,,COUR SAINT MAURICE,25380,COUR-SAINT-MAURICE,,,25173,,,,,,,,,,,,,,,,,,,2001-01-29,F,,,,,15.1F,NAF1993,O,6.703713,47.261238,0.93,street,Rue de Cour 25380 Cour-Saint-Maurice,25173_0017,G,RUE DE COUR,
394401400,00012,39440140000012,O,1993-01-01,NN,,,2019-11-14T14:00:26,true,1,,,,LD,MONGEANS,25380,COUR-SAINT-MAURICE,,,25173,,,,,,,,,,,,,,,,,,,1999-10-17,F,,,,,02.0B,NAF1993,N,,,0,,,,,,
397917238,00016,39791723800016,O,1994-07-01,NN,,,2019-11-14T14:00:26,true,3,,,,LD,LE PONT NEUF,25380,COUR-SAINT-MAURICE,,,25173,,,,,,,,,,,,,,,,,,,1996-05-29,F,,,,,55.3A,NAF1993,O,6.723691,47.261829,0.93,street,Le Pont Neuf 25380 Cour-Saint-Maurice,25173_A001,G,LE PONT NEUF,
402434708,00010,40243470800010,O,,NN,,,2019-11-14T14:00:26,true,1,,,,,,25380,COUR-SAINT-MAURICE,,,25173,,,,,,,,,,,,,,,,,,,1997-08-31,F,,,,,55.3A,NAF1993,O,,,0,,,,,,
404670366,00016,40467036600016,O,1990-01-01,NN,,,2019-11-14T14:00:26,true,4,,,,RUE,DE LA CHAISERIE,25380,COUR-SAINT-MAURICE,,,25173,,,,,,,,,,,,,,,,,,,2014-03-31,F,,,,,90.03A,NAFRev2,N,6.706465,47.261764,0.94,street,Rue de la Chaiserie 25380 Cour-Saint-Maurice,25173_0014,G,RUE DE LA CHAISERIE,
404967549,00019,40496754900019,O,1996-04-01,01,2019,,2021-10-27T08:31:00,true,3,,32,,,GRANDE RUE,25380,COUR-SAINT-MAURICE,,,25173,,,,,,,,,,,,,,,,,,,2008-01-01,A,,,,,02.20Z,NAFRev2,N,6.708676,47.259498,0.94,housenumber,32 Grande Rue 25380 Cour-Saint-Maurice,25173_y6qyco_00032,G,32 GRANDE RUE,
409020427,00012,40902042700012,O,1980-01-01,NN,,,2019-11-14T14:00:26,true,4,,,,,,25380,COUR-SAINT-MAURICE,,,25173,,,,,,,,,,,,,,,,,,,2002-12-31,F,,,,,01.1F,NAF1993,N,,,0,,,,,,
410361919,00013,41036191900013,O,1997-01-01,,,,2019-11-14T14:00:26,true,1,,,,RUE,DE L'ECLUSE,25380,COUR-SAINT-MAURICE,,,25173,,,,,,,,,,,,,,,,,,,1998-04-01,F,,,,,55.3A,NAF1993,N,6.706465,47.261764,0.49,street,Rue de la Chaiserie 25380 Cour-Saint-Maurice,25173_0014,G,RUE DE LA CHAISERIE,
410875108,00020,41087510800020,O,2006-03-01,NN,,,2019-11-14T14:00:26,false,3,,,,,CHEMIN DE VAUCLUSE,25380,COUR-SAINT-MAURICE,,,25173,,,,,,,,,,,,,,,,,,,2010-01-01,F,,,,,43.34Z,NAFRev2,O,6.698884,47.256069,0.6,street,Route de Vaucluse 25380 Cour-Saint-Maurice,25173_0059,G,ROUTE DE VAUCLUSE,
411880636,00021,41188063600021,O,2005-03-25,,,,2021-02-23T11:34:11,true,3,,12,,RUE,COUR,25380,COUR-SAINT-MAURICE,,,25173,,,,,,,,,,,,,,,,,,,2011-03-21,A,,,,,68.20B,NAFRev2,N,6.703046,47.261584,0.93,housenumber,12 Rue de Cour 25380 Cour-Saint-Maurice,25173_0017_00012,G,12 RUE DE COUR,
413993429,00013,41399342900013,O,1997-09-16,,,,2019-11-14T14:00:26,true,1,,,,,,25380,COUR-SAINT-MAURICE,,,25173,,,,,,,,,,,,,,,,,,,2000-12-29,F,,,,,55.3A,NAF1993,N,,,0,,,,,,
414114983,00011,41411498300011,O,1997-07-28,NN,,,2019-11-14T14:00:26,true,4,,,,,,25380,COUR-SAINT-MAURICE,,,25173,,,,,,,,,,,,,,,,,,,2003-04-02,F,,,,,74.1J,NAFRev1,N,,,0,,,,,,
419088851,00011,41908885100011,O,1998-05-15,NN,,,2019-11-14T14:00:26,true,3,LD LE MOULIN DU BAS,,,,,25380,COUR-SAINT-MAURICE,,,25173,,,,,,,,,,,,,,,,,,,2008-01-01,A,,,,,68.20B,NAFRev2,N,6.713439,47.254802,0.81,street,Le Moulin du Bas 25380 Cour-Saint-Maurice,25173_pwrm9z,D,LE MOULIN DU BAS,
422118315,00015,42211831500015,O,1999-04-02,NN,,,2019-11-14T14:00:26,true,1,,,,,LE PONT NEUF,25380,COUR-SAINT-MAURICE,,,25173,,,,,,,,,,,,,,,,,,,2002-06-30,F,,,,,55.3A,NAF1993,O,6.723691,47.261829,0.93,street,Le Pont Neuf 25380 Cour-Saint-Maurice,25173_A001,G,LE PONT NEUF,
434595872,00012,43459587200012,O,2001-01-01,NN,,,2019-11-14T14:00:26,true,1,,,,,,25380,COUR-SAINT-MAURICE,,,25173,,,,,,,,,,,,,,,,,,,2002-12-31,F,,,,,55.3A,NAF1993,O,,,0,,,,,,
435385273,00014,43538527300014,O,2001-03-20,NN,,,2019-11-14T14:00:26,true,3,M. SANDOZ DOMINIQUE,,,,,25380,COUR-SAINT-MAURICE,,,25173,,,,,,,,,,,,,,,,,,,2008-01-01,A,,,,,68.20B,NAFRev2,N,,,0,,,,,,
440427235,00039,44042723500039,O,2016-02-15,,,,2019-11-14T14:00:26,false,1,,,,,LE RELAIS DU PONT NEUF,25380,COUR-SAINT-MAURICE,,,25173,,,,,,,,,,,,,,,,,,,2016-02-15,A,LE RELAIS DU PONT NEUF,,,LE RELAIS DU PONT NEUF,56.10A,NAFRev2,N,6.723691,47.261829,0.54,street,Le Pont Neuf 25380 Cour-Saint-Maurice,25173_A001,G,LE PONT NEUF,
448374744,00010,44837474400010,O,2003-03-01,NN,,,2019-11-14T14:00:26,true,3,,,,,,25380,COUR-SAINT-MAURICE,,,25173,,,,,,,,,,,,,,,,,,,2005-12-07,F,,,,,60.2L,NAFRev1,N,,,0,,,,,,
448428219,00019,44842821900019,O,2003-06-01,NN,,,2019-11-14T14:00:26,true,3,EURL TRANSPORT REMY,,,,,25380,COUR-SAINT-MAURICE,,,25173,,,,,,,,,,,,,,,,,,,2005-12-07,F,,,,,74.1J,NAFRev1,N,,,0,,,,,,
478679962,00017,47867996200017,O,2004-08-14,NN,,,2019-11-14T14:00:26,true,4,,,,,FERME PONT BATTENANS,25380,COUR-SAINT-MAURICE,,,25173,,,,,,,,,,,,,,,,,,,2013-04-10,F,,,,,68.20B,NAFRev2,N,,,0,,,,,,
487582967,00013,48758296700013,O,2005-12-01,,,,2019-11-14T14:00:26,false,3,CHEZ M. DANIEL ANGIOLINI,11,,RUE,DE LA CHAISERIE,25380,COUR-SAINT-MAURICE,,,25173,,,,,,,,,,,,,,,,,,,2018-03-19,F,,,,,68.20B,NAFRev2,N,6.707202,47.261707,0.94,housenumber,11 Rue de la Chaiserie 25380 Cour-Saint-Maurice,25173_0014_00011,G,11 RUE DE LA CHAISERIE,
487582967,00021,48758296700021,O,2018-03-19,,,,2021-02-23T13:51:34,true,1,,34,,,GRANDE RUE,25380,COUR-SAINT-MAURICE,,,25173,,,,,,,,,,,,,,,,,,,2018-03-19,A,,,,,68.20B,NAFRev2,N,6.709951,47.260054,0.94,housenumber,34 Grande Rue 25380 Cour-Saint-Maurice,25173_y6qyco_00034,G,34 GRANDE RUE,
502150303,00019,50215030300019,O,2007-12-05,,,,2019-11-14T14:00:26,true,1,,,,RUE,DE L ECLUSE,25380,COUR-SAINT-MAURICE,,,25173,,,,,,,,,,,,,,,,,,,2007-12-05,A,,,,,68.20B,NAFRev2,N,6.706465,47.261764,0.49,street,Rue de la Chaiserie 25380 Cour-Saint-Maurice,25173_0014,G,RUE DE LA CHAISERIE,
502203110,00015,50220311000015,O,2008-01-01,01,2019,,2021-10-27T08:05:03,true,1,LE MOULIN DU BAS,,,RUE,DE L'ECLUSE,25380,COUR-SAINT-MAURICE,,,25173,,,,,,,,,,,,,,,,,,,2008-01-01,A,LA TRUITE DU MOULIN,,,,56.10A,NAFRev2,O,6.706465,47.261764,0.49,street,Rue de la Chaiserie 25380 Cour-Saint-Maurice,25173_0014,G,RUE DE LA CHAISERIE,
507732477,00017,50773247700017,O,2008-07-17,,,,2019-11-14T14:00:26,false,2,LIEUDIT PONT NEUF,,,,,25380,COUR-SAINT-MAURICE,,,25173,,,,,,,,,,,,,,,,,,,2008-09-15,F,,,,,70.10Z,NAFRev2,N,6.723691,47.261829,0.56,street,Le Pont Neuf 25380 Cour-Saint-Maurice,25173_A001,D,LE PONT NEUF,
512359464,00025,51235946400025,O,2020-07-20,,,,2021-02-23T15:21:42,true,1,,2,,RUE,DE COUR,25380,COUR-SAINT-MAURICE,,,25173,,,,,,,,,,,,,,,,,,,2020-07-20,A,,,,,56.10C,NAFRev2,N,6.706051,47.259272,0.94,housenumber,2 Rue de Cour 25380 Cour-Saint-Maurice,25173_0017_00002,G,2 RUE DE COUR,
518073234,00024,51807323400024,O,2010-09-13,,,,2019-11-14T14:00:26,false,2,,5,,RUE,DU STADE,25380,COUR-SAINT-MAURICE,,,25173,,,,,,,,,,,,,,,,,,,2010-12-30,F,,,,,90.02Z,NAFRev2,N,6.706116,47.257815,0.94,housenumber,5 Rue du Stade 25380 Cour-Saint-Maurice,25173_0055_00005,G,5 RUE DU STADE,
521197350,00015,52119735000015,O,2010-01-07,,,,2019-11-14T14:00:26,true,2,,,,RUE,DE LA CHAISERIE,25380,COUR-SAINT-MAURICE,,,25173,,,,,,,,,,,,,,,,,,,2014-12-31,F,,,,,47.99A,NAFRev2,N,6.706465,47.261764,0.94,street,Rue de la Chaiserie 25380 Cour-Saint-Maurice,25173_0014,G,RUE DE LA CHAISERIE,
521677575,00016,52167757500016,O,2010-02-24,,,9511ZZ,2019-11-14T14:00:26,false,4,,8,,RUE,DU STADE,25380,COUR-SAINT-MAURICE,,,25173,,,,,,,,,,,,,,,,,,,2012-03-19,F,,,,,95.11Z,NAFRev2,N,6.705546,47.257251,0.94,housenumber,8 Rue du Stade 25380 Cour-Saint-Maurice,25173_0055_00008,G,8 RUE DU STADE,
523689438,00019,52368943800019,O,2010-07-10,,,,2019-11-14T14:00:26,true,2,,,,,MOULIN DU BAS,25380,COUR-SAINT-MAURICE,,,25173,,,,,,,,,,,,,,,,,,,2011-08-12,F,,,,,47.89Z,NAFRev2,N,6.713439,47.254802,0.93,street,Le Moulin du Bas 25380 Cour-Saint-Maurice,25173_pwrm9z,G,LE MOULIN DU BAS,
531212942,00019,53121294200019,O,2011-03-21,,,,2019-11-14T14:00:26,true,1,,12,,RUE,DE COUR,25380,COUR-SAINT-MAURICE,,,25173,,,,,,,,,,,,,,,,,,,2011-03-21,A,,,,,01.41Z,NAFRev2,N,6.703046,47.261584,0.94,housenumber,12 Rue de Cour 25380 Cour-Saint-Maurice,25173_0017_00012,G,12 RUE DE COUR,
537311060,00025,53731106000025,O,1998-06-26,NN,,,2019-11-14T14:00:26,true,4,LIEU DIT  MOULIN DU BAS,,,RUE,DE L'ECLUSE,25380,COUR-SAINT-MAURICE,,,25173,,,,,,,,,,,,,,,,,,,2008-01-01,F,,,,,56.10A,NAFRev2,O,6.706465,47.261764,0.49,street,Rue de la Chaiserie 25380 Cour-Saint-Maurice,25173_0014,G,RUE DE LA CHAISERIE,
778305318,00017,77830531800017,O,1900-01-01,NN,,,2019-11-14T14:00:26,true,4,,,,,,25380,COUR-SAINT-MAURICE,,,25173,,,,,,,,,,,,,,,,,,,1995-12-25,F,,,,,01.1A,NAF1993,N,,,0,,,,,,
778305326,00010,77830532600010,O,,,,,2019-11-14T14:00:26,true,1,,,,,,25380,COUR-SAINT-MAURICE,,,25173,,,,,,,,,,,,,,,,,,,1986-09-12,F,,,,,36.10,NAP,N,,,0,,,,,,
778305342,00017,77830534200017,O,1964-01-01,NN,,,2019-11-14T14:00:26,true,1,,,,PL,DE L'EGLISE,25380,COUR-SAINT-MAURICE,,,25173,,,,,,,,,,,,,,,,,,,2002-12-31,F,,,,,70.2C,NAF1993,N,6.701722,47.256519,0.81,street,Place de l’Eglise 25380 Cour-Saint-Maurice,25173_0025,G,PLACE DE L EGLISE,
778305359,00011,77830535900011,O,,NN,,,2019-11-14T14:00:26,true,1,,,,,,25380,COUR-SAINT-MAURICE,,,25173,,,,,,,,,,,,,,,,,,,,F,,,,,49.01,NAP,N,,,0,,,,,,
798409553,00020,79840955300020,O,2014-06-01,,,,2021-02-23T16:26:51,true,1,,12,,,GRANDE RUE,25380,COUR-SAINT-MAURICE,,,25173,,,,,,,,,,,,,,,,,,,2014-06-01,A,,,,,68.20B,NAFRev2,N,6.702993,47.256834,0.94,housenumber,12 Grande Rue 25380 Cour-Saint-Maurice,25173_y6qyco_00012,G,12 GRANDE RUE,
803983592,00012,80398359200012,O,2014-09-01,01,2019,2562BZ,2021-10-27T09:11:18,true,1,,7,,,GRANDE RUE,25380,COUR-SAINT-MAURICE,,,25173,,,,,,,,,,,,,,,,,,,2014-09-01,A,,,,SAS USI-CLAIS,25.62B,NAFRev2,O,6.701827,47.256281,0.94,housenumber,7 Grande Rue 25380 Cour-Saint-Maurice,25173_y6qyco_00007,G,7 GRANDE RUE,
807533690,00010,80753369000010,O,2014-08-08,,,,2019-11-14T14:00:26,true,1,,5,,RUE,DES CHALETS,25380,COUR-SAINT-MAURICE,,,25173,,,,,,,,,,,,,,,,,,,2014-08-08,A,,,,,35.11Z,NAFRev2,N,6.704923,47.256566,0.94,housenumber,5 Rue des Chalets 25380 Cour-Saint-Maurice,25173_0011_00005,G,5 RUE DES CHALETS,
810483586,00014,81048358600014,O,2015-03-20,,,,2019-11-14T14:00:26,false,1,,7,,,GRANDE RUE,25380,COUR-SAINT-MAURICE,,,25173,,,,,,,,,,,,,,,,,,,2015-03-20,A,,,,,68.20A,NAFRev2,N,6.701827,47.256281,0.94,housenumber,7 Grande Rue 25380 Cour-Saint-Maurice,25173_y6qyco_00007,G,7 GRANDE RUE,
810483586,00022,81048358600022,O,2015-09-01,,,8219ZP,2021-02-23T17:27:20,true,1,,7,,,GRANDE RUE,25380,COUR-SAINT-MAURICE,,,25173,,,,,,,,,,,,,,,,,,,2015-09-01,A,,,,TLS COUR,82.19Z,NAFRev2,N,6.701827,47.256281,0.94,housenumber,7 Grande Rue 25380 Cour-Saint-Maurice,25173_y6qyco_00007,G,7 GRANDE RUE,
818657918,00012,81865791800012,O,2016-03-07,NN,,,2019-11-14T14:00:26,true,3,,,,RUE,DE LA CHAISERIE,25380,COUR-SAINT-MAURICE,,,25173,,,,,,,,,,,,,,,,,,,2019-09-03,A,,,,,47.89Z,NAFRev2,N,6.706465,47.261764,0.94,street,Rue de la Chaiserie 25380 Cour-Saint-Maurice,25173_0014,G,RUE DE LA CHAISERIE,
823526660,00019,82352666000019,O,2016-11-01,,,4520BA,2019-11-14T14:00:26,false,2,,15,,RUE,DE COUR,25380,COUR-SAINT-MAURICE,,,25173,,,,,,,,,,,,,,,,,,,2019-08-01,F,,,,,45.20B,NAFRev2,N,6.702293,47.262184,0.94,housenumber,15 Rue de Cour 25380 Cour-Saint-Maurice,25173_0017_00015,G,15 RUE DE COUR,
830862272,00010,83086227200010,O,2017-07-20,,,,2021-07-09T08:53:12,true,2,,15,,RUE,DE LA CHAISERIE,25380,COUR-SAINT-MAURICE,,,25173,,,,,,,,,,,,,,,,,,,2020-12-31,F,,,,,46.19B,NAFRev2,N,6.708193,47.261904,0.94,housenumber,15 Rue de la Chaiserie 25380 Cour-Saint-Maurice,25173_0014_00015,G,15 RUE DE LA CHAISERIE,
838044709,00015,83804470900015,O,2018-03-08,,,,2019-11-14T14:00:26,false,2,,2,,RUE,GRANDE RUE,25380,COUR-SAINT-MAURICE,,,25173,,,,,,,,,,,,,,,,,,,2019-09-03,F,,,,,96.09Z,NAFRev2,N,6.700791,47.255994,0.88,housenumber,2 Rue Grande 25380 Cour-Saint-Maurice,25173_0035_00002,G,2 RUE GRANDE,
844270264,00014,84427026400014,O,2018-11-28,,,,2021-11-03T11:47:29,true,3,,5,,RTE,DE VAUCLUSE,25380,COUR-SAINT-MAURICE,,,25173,,,,,,,,,,,,,,,,,,,2021-11-01,A,,,,,59.20Z,NAFRev2,N,6.699092,47.256056,0.84,housenumber,5 Route de Vaucluse 25380 Cour-Saint-Maurice,25173_0059_00005,G,5 ROUTE DE VAUCLUSE,
847735669,00016,84773566900016,O,2019-01-22,,,,2019-11-14T14:00:26,true,2,,16,,GR,RUE,25380,COUR-SAINT-MAURICE,,,25173,,,,,,,,,,,,,,,,,,,2019-08-31,F,,,,,86.90F,NAFRev2,N,6.703881,47.257536,0.75,housenumber,16 Grande Rue 25380 Cour-Saint-Maurice,25173_y6qyco_00016,G,16 GRANDE RUE,
852399864,00010,85239986400010,O,2019-07-12,,,,2020-11-23T09:58:36,true,2,,11,,,GRANDE RUE ,25380,COUR-SAINT-MAURICE,,,25173,,,,,,,,,,,,,,,,,,,2019-08-02,A,,,,,68.20B,NAFRev2,N,6.702038,47.256348,0.94,housenumber,11 Grande Rue 25380 Cour-Saint-Maurice,25173_y6qyco_00011,G,11 GRANDE RUE,
876041112,00015,87604111200015,O,,,,,2019-11-14T14:00:26,true,1,,,,,,25380,COUR-SAINT-MAURICE,,,25173,,,,,,,,,,,,,,,,,,,1984-12-25,F,,,,,00.97,NAP,N,,,0,,,,,,