siren,nic,siret,statutDiffusionEtablissement,dateCreationEtablissement,trancheEffectifsEtablissement,anneeEffectifsEtablissement,activitePrincipaleRegistreMetiersEtablissement,dateDernierTraitementEtablissement,etablissementSiege,nombrePeriodesEtablissement,complementAdresseEtablissement,numeroVoieEtablissement,indiceRepetitionEtablissement,typeVoieEtablissement,libelleVoieEtablissement,codePostalEtablissement,libelleCommuneEtablissement,libelleCommuneEtrangerEtablissement,distributionSpecialeEtablissement,codeCommuneEtablissement,codeCedexEtablissement,libelleCedexEtablissement,codePaysEtrangerEtablissement,libellePaysEtrangerEtablissement,complementAdresse2Etablissement,numeroVoie2Etablissement,indiceRepetition2Etablissement,typeVoie2Etablissement,libelleVoie2Etablissement,codePostal2Etablissement,libelleCommune2Etablissement,libelleCommuneEtranger2Etablissement,distributionSpeciale2Etablissement,codeCommune2Etablissement,codeCedex2Etablissement,libelleCedex2Etablissement,codePaysEtranger2Etablissement,libellePaysEtranger2Etablissement,dateDebut,etatAdministratifEtablissement,enseigne1Etablissement,enseigne2Etablissement,enseigne3Etablissement,denominationUsuelleEtablissement,activitePrincipaleEtablissement,nomenclatureActivitePrincipaleEtablissement,caractereEmployeurEtablissement,longitude,latitude,geo_score,geo_type,geo_adresse,geo_id,geo_ligne,geo_l4,geo_l5
173006610,00161,17300661000161,O,2003-09-18,NN,,,2010-09-16T10:31:41,false,4,,,,RTE,NIMES,30250,VILLEVIEILLE,,,30352,,,,,,,,,,,,,,,,,,,2009-12-31,F,SUBDIVISION SOMMIERES,,,,84.13Z,NAFRev2,N,4.106046,43.789976,0.75,street,Route de Nîmes 30250 Villevieille,30352_0108,G,ROUTE DE NIMES,
213003528,00014,21300352800014,O,1983-03-01,03,2019,,2021-10-27T08:07:44,true,4,,,,BD,AUBE,30250,VILLEVIEILLE,,,30352,,,,,,,,,,,,,,,,,,,2008-01-01,A,MAIRIE,,,,84.11Z,NAFRev2,O,4.097147,43.788313,0.58,street,Boulevard de l’Aube 30250 Villevieille,30352_0010,G,BOULEVARD DE L AUBE,
213003528,00022,21300352800022,O,1983-12-21,03,2019,,2021-10-27T08:07:44,false,3,,,,CHE,CANTA E RIS,30250,VILLEVIEILLE,,,30352,,,,,,,,,,,,,,,,,,,2008-01-01,A,ECOLE PRIMAIRE PUBLIQUE,,,,85.20Z,NAFRev2,N,4.098576,43.789551,0.83,street,Chemin Canta E Ris 30250 Villevieille,30352_0028,G,CHEMIN CANTA E RIS,
253000376,00017,25300037600017,O,1983-03-01,01,2019,,2021-10-27T08:12:05,true,5,MAIRIE,,,BD,AUBE,30250,VILLEVIEILLE,,,30352,,,,,,,,,,,,,,,,,,,2016-01-31,A,,,,,36.00Z,NAFRev2,O,4.097147,43.788313,0.58,street,Boulevard de l’Aube 30250 Villevieille,30352_0010,G,BOULEVARD DE L AUBE,
253003255,00044,25300325500044,O,2021-05-11,,,,2021-05-19T07:39:13,false,2,,190,,CHE,DE CAMPAGNE,30250,VILLEVIEILLE,,,30352,,,,,,,,,,,,,,,,,,,2021-05-18,F,,,,,37.00Z,NAFRev2,O,4.090197,43.806933,0.41,street,Rue Blanche de Castille 30250 Villevieille,30352_0025,G,RUE BLANCHE DE CASTILLE,
253003255,00051,25300325500051,O,2021-05-18,,,,2021-05-19T07:36:54,true,1,,2,,BD,DE L'AUBE,30250,VILLEVIEILLE,,,30352,,,,,,,,,,,,,,,,,,,2021-05-18,A,,,,,37.00Z,NAFRev2,O,4.097147,43.788313,0.69,street,Boulevard de l’Aube 30250 Villevieille,30352_0010,G,BOULEVARD DE L AUBE,
263001075,00013,26300107500013,O,1986-01-06,,,,2010-06-26T03:07:51,true,3,,,,,MAIRIE,30250,VILLEVIEILLE,,,30352,,,,,,,,,,,,,,,,,,,2008-01-01,A,CCAS,,,,88.99B,NAFRev2,N,4.086944,43.794693,0.65,street,Impasse de la Metairie 30250 Villevieille,30352_0104,G,IMPASSE DE LA METAIRIE,
300271814,00026,30027181400026,O,1900-01-01,NN,,,2011-01-19T04:30:00,true,4,,,,,MAS CARRIER,30250,VILLEVIEILLE,,,30352,,,,,,,,,,,,,,,,,,,2010-12-31,F,,,,,71.11Z,NAFRev2,N,4.101308,43.809451,0.94,locality,Mas Carrier 30250 Villevieille,30352_B078,G,MAS CARRIER,
300274669,00013,30027466900013,O,,NN,,,,true,1,,,,RTE,D ALES,30250,VILLEVIEILLE,,,30352,,,,,,,,,,,,,,,,,,,1989-12-31,F,,,,,55.60,NAP,N,4.086367,43.794716,0.78,street,Route d’Alès 30250 Villevieille,30352_0007,G,ROUTE D ALES,
301108163,00033,30110816300033,O,,NN,,,,true,1,,3,,AV,MAS DE GUIRAUD,30250,VILLEVIEILLE,,,30352,,,,,,,,,,,,,,,,,,,1992-01-31,F,,,,,52.6D,NAF1993,N,4.095378,43.791264,0.76,street,Avenue du Mas de Guiraud 30250 Villevieille,30352_0103,G,AVENUE DU MAS DE GUIRAUD,
301990438,00030,30199043800030,O,1991-01-01,NN,,,2020-11-20T03:36:56,true,4,,,,,,30250,VILLEVIEILLE,,,30352,,,,,,,,,,,,,,,,,,,2020-12-31,F,,,,,01.49Z,NAFRev2,N,,,0,,,,,,
302122346,00018,30212234600018,O,,,,,,true,1,,,,LD,LES PRADELS,30250,VILLEVIEILLE,,,30352,,,,,,,,,,,,,,,,,,,1985-12-25,F,,,,,55.60,NAP,N,4.099948,43.79043,0.78,street,Chemin des Pradels 30250 Villevieille,30352_0159,G,CHEMIN DES PRADELS,
304192990,00014,30419299000014,O,,NN,,,,true,1,,,,,CHATEAU DE PONDRES,30250,VILLEVIEILLE,,,30352,,,,,,,,,,,,,,,,,,,1986-12-25,F,,,,,01.70,NAP,N,4.096279,43.789337,0.42,street,Rue du Château 30250 Villevieille,30352_0033,G,RUE DU CHATEAU,
304276173,00024,30427617300024,O,1985-08-06,,,,,true,4,,,,,CAVE COOPERATIVE,30250,VILLEVIEILLE,,,30352,,,,,,,,,,,,,,,,,,,1992-02-01,F,,,,,15.9G,NAF1993,N,1.0466244,47.3318849,0.98,poi.platform,Cave Coopérative (Plateforme) Civray-de-Touraine,https://osm.org/way/400563516,G,,
305246209,00012,30524620900012,O,,,,,,true,1,,,,RUE,DU VILLAGE,30250,VILLEVIEILLE,,,30352,,,,,,,,,,,,,,,,,,,1984-12-25,F,,,,,64.25,NAP,N,4.096279,43.789337,0.69,street,Rue du Château 30250 Villevieille,30352_0033,G,RUE DU CHATEAU,
305446528,00039,30544652800039,O,1997-09-30,NN,,,,true,1,,5,,RUE,DE LA COUSTOURELLE,30250,VILLEVIEILLE,,,30352,,,,,,,,,,,,,,,,,,,2001-06-21,F,,,,,92.3A,NAF1993,O,4.095323,43.788164,0.95,housenumber,5 Rue de la Coustourelle 30250 Villevieille,30352_0040_00005,G,5 RUE DE LA COUSTOURELLE,
306746454,00025,30674645400025,O,,,,,,true,1,,,,,CAVE COOPERATIVE,30250,VILLEVIEILLE,,,30352,,,,,,,,,,,,,,,,,,,1985-08-06,F,,,,,57.08,NAP,N,1.0466244,47.3318849,0.98,poi.platform,Cave Coopérative (Plateforme) Civray-de-Touraine,https://osm.org/way/400563516,G,,
306970351,00020,30697035100020,O,2003-08-01,NN,,,2012-11-22T05:09:35,true,5,,341,,,VIEILLE ROUTE,30250,VILLEVIEILLE,,,30352,,,,,,,,,,,,,,,,,,,2012-10-04,A,,,,,90.03A,NAFRev2,N,4.093238,43.788589,0.95,housenumber,341 Vieille Route 30250 Villevieille,30352_0193_00341,G,341 VIEILLE ROUTE,
307120220,00065,30712022000065,O,1993-10-01,NN,,,,false,4,,,,RTE,D UZES,30250,VILLEVIEILLE,,,30352,,,,,,,,,,,,,,,,,,,1995-12-25,F,,,,,51.5F,NAF1993,N,4.108118,43.803459,0.78,street,Route d’Uzès 30250 Villevieille,30352_0187,G,ROUTE D UZES,
310521695,00018,31052169500018,O,1900-01-01,NN,,,2006-12-15T00:17:05,false,4,,,,,,30250,VILLEVIEILLE,,,30352,,,,,,,,,,,,,,,,,,,1993-12-25,F,,,,,52.2L,NAF1993,N,,,0,,,,,,
310521695,00026,31052169500026,O,1991-01-01,NN,,,2006-10-27T00:26:26,true,3,,11,,BD,DE L AUBE,30250,VILLEVIEILLE,,,30352,,,,,,,,,,,,,,,,,,,2004-06-30,F,,,,,01.1G,NAFRev1,N,4.096408,43.787966,0.83,housenumber,11 Boulevard de l’Aube 30250 Villevieille,30352_0010_00011,G,11 BOULEVARD DE L AUBE,
311722730,00026,31172273000026,O,,NN,,,,true,1,,,,CHE,STE CATHERINE,30250,VILLEVIEILLE,,,30352,,,,,,,,,,,,,,,,,,,1989-03-15,F,,,,,55.60,NAP,N,4.1027,43.796802,0.79,street,Chemin de Sainte Catherine 30250 Villevieille,30352_0174,G,CHEMIN DE SAINTE CATHERINE,
311741847,00025,31174184700025,O,,NN,,,,true,1,,,,RTE,D ALES,30250,VILLEVIEILLE,,,30352,,,,,,,,,,,,,,,,,,,1989-12-31,F,,,,,55.60,NAP,N,4.086367,43.794716,0.78,street,Route d’Alès 30250 Villevieille,30352_0007,G,ROUTE D ALES,
311889505,00013,31188950500013,O,1900-01-01,NN,,,2017-03-07T04:26:23,true,3,,,,RTE,D UZES,30250,VILLEVIEILLE,,,30352,,,,,,,,,,,,,,,,,,,1995-06-30,F,,,,,51.5F,NAF1993,N,4.108118,43.803459,0.78,street,Route d’Uzès 30250 Villevieille,30352_0187,G,ROUTE D UZES,
312374093,00044,31237409300044,O,1996-10-10,NN,,,,false,4,,216,,AV,DU MAS DE GUIRAUD,30250,VILLEVIEILLE,,,30352,,,,,,,,,,,,,,,,,,,1998-12-31,F,,,,,85.1G,NAF1993,N,4.094073,43.790422,0.88,housenumber,216 Avenue du Mas de Guiraud 30250 Villevieille,30352_0103_00216,G,216 AVENUE DU MAS DE GUIRAUD,
314954645,00011,31495464500011,O,,NN,,,,true,1,,,,RTE,D'ALES,30250,VILLEVIEILLE,,,30352,,,,,,,,,,,,,,,,,,,1989-12-31,F,,,,,55.60,NAP,N,4.086367,43.794716,0.78,street,Route d’Alès 30250 Villevieille,30352_0007,G,ROUTE D ALES,
315523803,00031,31552380300031,O,2009-02-09,,,,2013-07-30T19:54:33,true,2,,5,,ALL,FONTBONNE,30250,VILLEVIEILLE,,,30352,,,,,,,,,,,,,,,,,,,2013-07-31,F,,,,,75.00Z,NAFRev2,N,4.086249,43.793554,0.83,housenumber,5 Allée de Fontbonne 30250 Villevieille,30352_0064_00005,G,5 ALLEE DE FONTBONNE,
315704197,00039,31570419700039,O,1998-01-01,NN,,,2006-11-25T09:37:08,true,3,,36,,CHE,STE CATHERINE,30250,VILLEVIEILLE,,,30352,,,,,,,,,,,,,,,,,,,2005-12-31,F,,,,,85.1H,NAFRev1,N,4.101207,43.795269,0.82,housenumber,36 Chemin de Sainte Catherine 30250 Villevieille,30352_0174_00036,G,36 CHEMIN DE SAINTE CATHERINE,
316311208,00011,31631120800011,O,,,,,,true,1,,,,IMP,DU MOULIN A HUILE,30250,VILLEVIEILLE,,,30352,,,,,,,,,,,,,,,,,,,1984-12-25,F,,,,,62.46,NAP,N,4.096523,43.788492,0.78,street,Rue du Moulin à Huile 30250 Villevieille,30352_0114,G,RUE DU MOULIN A HUILE,
316384577,00029,31638457700029,O,1989-04-25,NN,,,2008-11-07T00:31:57,false,5,,,,IMP,DE LA MIGRANE,30250,VILLEVIEILLE,,,30352,,,,,,,,,,,,,,,,,,,2001-03-01,F,SOPHIE COIFFURE,,,,93.0D,NAF1993,O,4.095935,43.788955,0.84,street,Impasse de la Migrane 30250 Villevieille,30352_0107,G,IMPASSE DE LA MIGRANE,
316384577,00045,31638457700045,O,2001-02-01,NN,,,2008-01-04T20:45:43,true,3,,1,,IMP,DE LA MIGRANE,30250,VILLEVIEILLE,,,30352,,,,,,,,,,,,,,,,,,,2008-01-01,A,,,,,01.21Z,NAFRev2,N,4.095794,43.78906,0.85,housenumber,1 Impasse de la Migrane 30250 Villevieille,30352_0107_00001,G,1 IMPASSE DE LA MIGRANE,
316384577,00052,31638457700052,O,2004-09-15,NN,,,2021-02-23T10:41:46,false,3,,1,,IMP,DE LA MIGRANE,30250,VILLEVIEILLE,,,30352,,,,,,,,,,,,,,,,,,,2008-01-01,A,,,,,68.20A,NAFRev2,N,4.095794,43.78906,0.85,housenumber,1 Impasse de la Migrane 30250 Villevieille,30352_0107_00001,G,1 IMPASSE DE LA MIGRANE,
316891654,00030,31689165400030,O,2016-03-02,,,,2016-04-11T15:59:52,true,1,,6,,RUE,BEAUSITE,30250,VILLEVIEILLE,,,30352,,,,,,,,,,,,,,,,,,,2016-03-02,A,,,,,46.19B,NAFRev2,N,4.094205,43.804652,0.83,housenumber,6 Rue Beau Site 30250 Villevieille,30352_itx0ma_00006,G,6 RUE BEAU SITE,
317327815,00013,31732781500013,O,1979-01-01,NN,,,2009-07-16T04:59:24,true,4,,,,AV,DE LA CALMETTE,30250,VILLEVIEILLE,,,30352,,,,,,,,,,,,,,,,,,,2009-03-05,F,,,,,42.99Z,NAFRev2,N,4.092548,43.793319,0.85,street,Avenue de la Calmette 30250 Villevieille,30352_0026,G,AVENUE DE LA CALMETTE,
317727493,00015,31772749300015,O,1980-01-01,NN,,,,true,1,,,,RUE,DE LA PORTETTE,30250,VILLEVIEILLE,,,30352,,,,,,,,,,,,,,,,,,,2000-12-31,F,,,,,70.2C,NAF1993,O,4.09583,43.788576,0.95,street,Rue de la Portette 30250 Villevieille,30352_0156,G,RUE DE LA PORTETTE,
317800852,00012,31780085200012,O,1980-01-01,NN,,,,false,4,,,,BD,DE L AUBE,30250,VILLEVIEILLE,,,30352,,,,,,,,,,,,,,,,,,,2001-12-07,F,,,,,52.2L,NAF1993,N,4.097147,43.788313,0.8,street,Boulevard de l’Aube 30250 Villevieille,30352_0010,G,BOULEVARD DE L AUBE,
317800852,00020,31780085200020,O,1984-12-31,NN,,,2008-01-04T20:55:37,true,3,,41,,CHE,DE LA ROQUETTE,30250,VILLEVIEILLE,,,30352,,,,,,,,,,,,,,,,,,,2008-01-01,A,,,,,01.21Z,NAFRev2,N,4.099771,43.787197,0.87,housenumber,41 Chemin de la Roquette 30250 Villevieille,30352_0171_00041,G,41 CHEMIN DE LA ROQUETTE,
318197357,00037,31819735700037,O,2010-05-10,,,,2021-02-23T10:42:53,true,1,,60,,CHE,CANTA E RIS,30250,VILLEVIEILLE,,,30352,,,,,,,,,,,,,,,,,,,2010-05-10,A,,,,,47.89Z,NAFRev2,N,4.098686,43.789542,0.85,housenumber,60 Chemin Canta E Ris 30250 Villevieille,30352_0028_00060,G,60 CHEMIN CANTA E RIS,
319297461,00034,31929746100034,O,1982-01-01,NN,,,2008-11-07T00:35:08,true,4,,,,CHE,DE FONT DE L'AUBE,30250,VILLEVIEILLE,,,30352,,,,,,,,,,,,,,,,,,,1996-12-25,F,,,,,50.1Z,NAF1993,O,4.108607,43.800971,0.86,street,Chemin de Font de l’Aube 30250 Villevieille,30352_0066,G,CHEMIN DE FONT DE L AUBE,
319560827,00101,31956082700101,O,2009-01-31,,,,2012-03-09T15:46:39,false,2,,5,,CHE,OISEAUX,30250,VILLEVIEILLE,,,30352,,,,,,,,,,,,,,,,,,,2009-12-31,F,ECLAT DE REVE,,,,47.78C,NAFRev2,N,4.085409,43.79152,0.81,housenumber,5 Chemin des Oiseaux 30250 Villevieille,30352_0119_00005,G,5 CHEMIN DES OISEAUX,
320131576,00037,32013157600037,O,2009-04-20,,,,2017-11-17T08:22:03,true,2,,292,,CHE,DE LA TRUQUE,30250,VILLEVIEILLE,,,30352,,,,,,,,,,,,,,,,,,,2017-11-06,F,,,,,43.32A,NAFRev2,N,4.100434,43.787769,0.87,housenumber,292 Chemin de la Truque 30250 Villevieille,30352_0181_00292,G,292 CHEMIN DE LA TRUQUE,
321328460,00050,32132846000050,O,2012-04-06,NN,,4399DC,2016-11-03T03:30:40,true,4,,516,B,CHE,DES CIGALES,30250,VILLEVIEILLE,,,30352,,,,,,,,,,,,,,,,,,,2016-10-31,F,,,,,43.99D,NAFRev2,N,4.101029,43.797153,0.77,housenumber,516bis Chemin des Cigales 30250 Villevieille,30352_0034_00516_bis,G,516BIS CHEMIN DES CIGALES,
321635716,00020,32163571600020,O,,NN,,,,true,1,,,,CHE,ANTA E RIS,30250,VILLEVIEILLE,,,30352,,,,,,,,,,,,,,,,,,,1995-09-25,F,,,,,45.2B,NAF1993,N,4.098576,43.789551,0.77,street,Chemin Canta E Ris 30250 Villevieille,30352_0028,G,CHEMIN CANTA E RIS,
322772989,00057,32277298900057,O,2004-10-01,,,,2021-02-23T10:46:18,true,2,,1,,RUE,DE LA PORTETTE,30250,VILLEVIEILLE,,,30352,,,,,,,,,,,,,,,,,,,2008-01-01,A,,,,,85.59B,NAFRev2,N,4.095429,43.788814,0.95,housenumber,1 Rue de la Portette 30250 Villevieille,30352_0156_00001,G,1 RUE DE LA PORTETTE,
322826892,00018,32282689200018,O,,,,,,true,1,,,,CHE,STE CATHERINE,30250,VILLEVIEILLE,,,30352,,,,,,,,,,,,,,,,,,,1993-06-30,F,,,,,45.2V,NAF1993,N,4.1027,43.796802,0.79,street,Chemin de Sainte Catherine 30250 Villevieille,30352_0174,G,CHEMIN DE SAINTE CATHERINE,
322852625,00019,32285262500019,O,,,,,,true,1,,,,,MAS DE LA RIVOIRE,30250,VILLEVIEILLE,,,30352,,,,,,,,,,,,,,,,,,,1984-12-25,F,,,,,62.46,NAP,N,4.102288,43.800827,0.94,locality,Mas de la Rivoire 30250 Villevieille,30352_B083,G,MAS DE LA RIVOIRE,
323277095,00010,32327709500010,O,,NN,,,,true,1,,,,RUE,DU CHATEAU,30250,VILLEVIEILLE,,,30352,,,,,,,,,,,,,,,,,,,1987-06-30,F,,,,,01.80,NAP,N,4.096279,43.789337,0.95,street,Rue du Château 30250 Villevieille,30352_0033,G,RUE DU CHATEAU,
323309393,00078,32330939300078,O,2008-06-02,,,,2016-09-02T08:37:53,false,2,DOMAINE DE PONDRES BATTERIE 3,2008,,RTE,D ALES,30250,VILLEVIEILLE,,,30352,,,,,,,,,,,,,,,,,,,2016-06-30,F,,,,,86.90E,NAFRev2,N,4.091837,43.807171,0.84,housenumber,2008 Route d’Alès 30250 Villevieille,30352_0007_02008,G,2008 ROUTE D ALES,
323448704,00029,32344870400029,O,2000-10-07,NN,,,2020-02-19T03:46:48,true,3,PLAN DES 4 CHEMINS,159,,RTE,D'UZES,30250,VILLEVIEILLE,,,30352,,,,,,,,,,,,,,,,,,,2008-01-01,A,,,,,68.20A,NAFRev2,N,4.108292,43.803556,0.83,housenumber,159 Route d’Uzès 30250 Villevieille,30352_0187_00159,G,159 ROUTE D UZES,
323646810,00016,32364681000016,O,1981-10-31,NN,,,2008-01-04T18:48:30,true,3,,,,,,30250,VILLEVIEILLE,,,30352,,,,,,,,,,,,,,,,,,,2006-12-10,F,,,,,70.2B,NAFRev1,N,,,0,,,,,,
323646828,00018,32364682800018,O,1981-10-31,NN,,,2008-04-05T00:23:50,true,3,,,,,PONDRES,30250,VILLEVIEILLE,,,30352,,,,,,,,,,,,,,,,,,,2008-01-01,A,,,,,01.21Z,NAFRev2,N,4.099959,43.793486,0.35,street,Chemin du Pont de la Leque 30250 Villevieille,30352_0148,G,CHEMIN DU PONT DE LA LEQUE,
323683607,00010,32368360700010,O,1982-01-01,NN,,,,true,4,,,,,PLAN DES 4 CHEMINS,30250,VILLEVIEILLE,,,30352,,,,,,,,,,,,,,,,,,,1993-12-25,F,,,,,60.2L,NAF1993,N,,,0,,,,,,
324034453,00039,32403445300039,O,2016-09-01,,,,2021-02-23T10:47:12,true,1,MAS FRANC,,,CHE,DU MOULIN,30250,VILLEVIEILLE,,,30352,,,,,,,,,,,,,,,,,,,2016-09-01,A,,,,,01.21Z,NAFRev2,N,4.082764,43.796043,0.82,street,Chemin du Moulin 30250 Villevieille,30352_0112,G,CHEMIN DU MOULIN,
324255645,00016,32425564500016,O,,NN,,,,true,1,,,,CHE,DE BELLEAU,30250,VILLEVIEILLE,,,30352,,,,,,,,,,,,,,,,,,,,F,,,,,77.09,NAP,N,4.095942,43.78583,0.82,street,Chemin de Belleau 30250 Villevieille,30352_0016,G,CHEMIN DE BELLEAU,
324845049,00018,32484504900018,O,,NN,,,,true,1,,,,RTE,D'ALES,30250,VILLEVIEILLE,,,30352,,,,,,,,,,,,,,,,,,,,F,,,,,58.09,NAP,N,4.086367,43.794716,0.78,street,Route d’Alès 30250 Villevieille,30352_0007,G,ROUTE D ALES,
324952993,00016,32495299300016,O,,NN,,,,true,1,,,,CHE,STE CATHERINE,30250,VILLEVIEILLE,,,30352,,,,,,,,,,,,,,,,,,,1989-12-31,F,,,,,55.60,NAP,N,4.1027,43.796802,0.79,street,Chemin de Sainte Catherine 30250 Villevieille,30352_0174,G,CHEMIN DE SAINTE CATHERINE,
325756278,00017,32575627800017,O,1982-11-04,NN,,,2008-11-07T00:43:03,true,3,,,,CHE,DES PRADELS,30250,VILLEVIEILLE,,,30352,,,,,,,,,,,,,,,,,,,2004-12-31,F,,,,,01.4B,NAFRev1,N,4.099948,43.79043,0.83,street,Chemin des Pradels 30250 Villevieille,30352_0159,G,CHEMIN DES PRADELS,
326055456,00015,32605545600015,O,,NN,,,,true,1,,,,AV,DES CEVENNES,30250,VILLEVIEILLE,,,30352,,,,,,,,,,,,,,,,,,,,F,,,,,77.04,NAP,N,4.090388,43.790146,0.83,street,Avenue des Cevennes 30250 Villevieille,30352_0030,G,AVENUE DES CEVENNES,
326615051,00033,32661505100033,O,1989-02-06,NN,,,2008-11-07T00:44:00,false,4,MAS SABATIER,,,RTE,UZES,30250,VILLEVIEILLE,,,30352,,,,,,,,,,,,,,,,,,,1996-12-25,F,,,,,45.2V,NAF1993,O,4.108118,43.803459,0.63,street,Route d’Uzès 30250 Villevieille,30352_0187,G,ROUTE D UZES,
327391728,00067,32739172800067,O,2011-08-21,,,,2015-07-19T04:07:06,true,4,,625,,CHE,DU MOULIN,30250,VILLEVIEILLE,,,30352,,,,,,,,,,,,,,,,,,,2015-07-17,F,TITOU SERVICES,,,,43.99C,NAFRev2,N,4.079672,43.796472,0.85,housenumber,625 Chemin du Moulin 30250 Villevieille,30352_0112_00625,G,625 CHEMIN DU MOULIN,
327427142,00028,32742714200028,O,1988-01-01,NN,,,2012-05-05T01:54:32,false,5,,111,,RTE,ALES,30250,VILLEVIEILLE,,,30352,,,,,,,,,,,,,,,,,,,2010-03-01,F,,,,,71.12A,NAFRev2,O,4.089387,43.791313,0.74,housenumber,111 Route d’Alès 30250 Villevieille,30352_0007_00111,G,111 ROUTE D ALES,
327471934,00023,32747193400023,O,2010-09-23,,,,2011-10-04T10:42:45,false,2,,2,,CHE,DU LAVOIR,30250,VILLEVIEILLE,,,30352,,,,,,,,,,,,,,,,,,,2011-09-01,F,,,,,47.91A,NAFRev2,N,4.095865,43.795177,0.83,housenumber,2 Chemin du Lavoir 30250 Villevieille,30352_0092_00002,G,2 CHEMIN DU LAVOIR,
327471934,00056,32747193400056,O,2020-12-01,,,,2022-01-14T04:13:38,false,3,,2,,IMP,DU GARDIAN,30250,VILLEVIEILLE,,,30352,,,,,,,,,,,,,,,,,,,2022-01-11,F,,,,,47.82Z,NAFRev2,N,4.098971,43.785829,0.84,housenumber,2 Impasse du Gardian 30250 Villevieille,30352_0069_00002,G,2 IMPASSE DU GARDIAN,
327855334,00022,32785533400022,O,,NN,,,,true,1,,,,CHE,DU PONT DE LA LEQUE,30250,VILLEVIEILLE,,,30352,,,,,,,,,,,,,,,,,,,1988-05-19,F,,,,,54.04,NAP,N,4.099959,43.793486,0.88,street,Chemin du Pont de la Leque 30250 Villevieille,30352_0148,G,CHEMIN DU PONT DE LA LEQUE,
328133814,00025,32813381400025,O,2010-04-01,,,,2021-02-23T10:49:26,true,1,,630,,CHE,DE LA BOURRE,30250,VILLEVIEILLE,,,30352,,,,,,,,,,,,,,,,,,,2010-04-01,A,,,,,43.99C,NAFRev2,N,4.099936,43.804916,0.87,housenumber,630 Chemin de la Bourre 30250 Villevieille,30352_0019_00630,G,630 CHEMIN DE LA BOURRE,
328482641,00011,32848264100011,O,,,,,,true,1,,,,ALL,DE MANTELLE,30250,VILLEVIEILLE,,,30352,,,,,,,,,,,,,,,,,,,1985-12-25,F,,,,,51.11,NAP,N,4.094478,43.78984,0.84,street,Allée de Mantelle 30250 Villevieille,30352_0097,G,ALLEE DE MANTELLE,
329185680,00041,32918568000041,O,1993-01-01,NN,,,2008-06-19T17:30:35,true,7,,,,RTE,D UZES,30250,VILLEVIEILLE,,,30352,,,,,,,,,,,,,,,,,,,2008-01-01,F,,,,,70.10Z,NAFRev2,N,4.108118,43.803459,0.78,street,Route d’Uzès 30250 Villevieille,30352_0187,G,ROUTE D UZES,
329257083,00058,32925708300058,O,1989-11-21,NN,,,,false,3,,,,RUE,DE LA PORTETTE,30250,VILLEVIEILLE,,,30352,,,,,,,,,,,,,,,,,,,1992-06-12,F,,,,,85.1C,NAF1993,N,4.09583,43.788576,0.95,street,Rue de la Portette 30250 Villevieille,30352_0156,G,RUE DE LA PORTETTE,
329257083,00066,32925708300066,O,1992-06-12,NN,,,2006-12-15T00:24:44,false,3,,,,RUE,TRAVERSIERE,30250,VILLEVIEILLE,,,30352,,,,,,,,,,,,,,,,,,,1993-03-31,F,,,,,85.1C,NAF1993,N,4.095322,43.788131,0.95,street,Rue Traversière 30250 Villevieille,30352_0182,G,RUE TRAVERSIERE,
329257083,00090,32925708300090,O,1995-06-01,NN,,,2022-01-21T09:02:03,false,4,,1,,RUE,TRAVERSIERE,30250,VILLEVIEILLE,,,30352,,,,,,,,,,,,,,,,,,,2021-09-22,F,,,,,86.21Z,NAFRev2,N,4.095207,43.788191,0.95,housenumber,1 Rue Traversière 30250 Villevieille,30352_0182_00001,G,1 RUE TRAVERSIERE,
329257083,00108,32925708300108,O,2022-02-01,,,,2022-02-05T13:40:30,true,1,,5,,RUE,DE LA COUSTOURELLE,30250,VILLEVIEILLE,,,30352,,,,,,,,,,,,,,,,,,,2022-02-01,A,,,,,96.09Z,NAFRev2,N,4.095323,43.788164,0.95,housenumber,5 Rue de la Coustourelle 30250 Villevieille,30352_0040_00005,G,5 RUE DE LA COUSTOURELLE,
329717060,00035,32971706000035,O,2001-09-27,NN,,,,true,1,,17,,RUE,DE FLORETTE,30250,VILLEVIEILLE,,,30352,,,,,,,,,,,,,,,,,,,2002-12-31,F,,,,,74.8A,NAF1993,N,4.094845,43.792852,0.95,housenumber,17 Rue de Florette 30250 Villevieille,30352_0063_00017,G,17 RUE DE FLORETTE,
329725006,00012,32972500600012,O,,,,,,true,1,,,,CHE,DU PONT DE LA LECQUE,30250,VILLEVIEILLE,,,30352,,,,,,,,,,,,,,,,,,,1984-12-31,F,,,,,55.60,NAP,N,4.099959,43.793486,0.77,street,Chemin du Pont de la Leque 30250 Villevieille,30352_0148,G,CHEMIN DU PONT DE LA LEQUE,
330493941,00034,33049394100034,O,2018-04-10,,,,2021-02-23T10:50:56,true,1,,139,,CHE,DU PIC SAINT-LOUP,30250,VILLEVIEILLE,,,30352,,,,,,,,,,,,,,,,,,,2018-04-10,A,,,,,46.19B,NAFRev2,N,4.093643,43.78721,0.88,housenumber,139 Chemin du Pic Saint Loup 30250 Villevieille,30352_0137_00139,G,139 CHEMIN DU PIC SAINT LOUP,
331845099,00026,33184509900026,O,2007-04-30,NN,,,2014-07-08T00:36:54,true,3,,236,,CHE,DE LA GORGUETTE,30250,VILLEVIEILLE,,,30352,,,,,,,,,,,,,,,,,,,2011-06-30,F,,,,,96.02A,NAFRev2,O,4.09252,43.79114,0.88,housenumber,236 Chemin de la Gorguette 30250 Villevieille,30352_0071_00236,G,236 CHEMIN DE LA GORGUETTE,
331963611,00016,33196361100016,O,,,,,,true,1,,,,RTE,UZES,30250,VILLEVIEILLE,,,30352,,,,,,,,,,,,,,,,,,,1987-05-31,F,,,,,55.73,NAP,N,4.108118,43.803459,0.63,street,Route d’Uzès 30250 Villevieille,30352_0187,G,ROUTE D UZES,
332255090,00034,33225509000034,O,2007-03-08,,,,2008-05-23T14:51:27,false,3,,1,,RUE,TRAVERSIERE,30250,VILLEVIEILLE,,,30352,,,,,,,,,,,,,,,,,,,2008-01-07,F,,,,,86.22C,NAFRev2,N,4.095207,43.788191,0.95,housenumber,1 Rue Traversière 30250 Villevieille,30352_0182_00001,G,1 RUE TRAVERSIERE,
332700483,00065,33270048300065,O,2006-09-01,,,,2013-03-22T04:37:47,false,3,,911,,CHE,DE LA TRUQUE,30250,VILLEVIEILLE,,,30352,,,,,,,,,,,,,,,,,,,2012-11-01,F,CARS LAFONT TOURISME,,,,49.39B,NAFRev2,N,4.106792,43.788413,0.87,housenumber,911 Chemin de la Truque 30250 Villevieille,30352_0181_00911,G,911 CHEMIN DE LA TRUQUE,
332931674,00037,33293167400037,O,2003-01-01,,,,2011-04-23T05:45:15,false,4,,271,,CHE,DU MOULIN,30250,VILLEVIEILLE,,,30352,,,,,,,,,,,,,,,,,,,2008-07-09,F,,,,,71.12B,NAFRev2,O,4.083852,43.795751,0.85,housenumber,271 Chemin du Moulin 30250 Villevieille,30352_0112_00271,G,271 CHEMIN DU MOULIN,
333236388,00018,33323638800018,O,,NN,,,,true,1,,,,,,30250,VILLEVIEILLE,,,30352,,,,,,,,,,,,,,,,,,,,F,,,,,60.09,NAP,N,,,0,,,,,,
333361681,00138,33336168100138,O,2018-06-01,,,,2018-06-22T08:32:27,false,1,MAS DE LA CALMETTE,,,AV,DE LA CALMETTE,30250,VILLEVIEILLE,,,30352,,,,,,,,,,,,,,,,,,,2018-06-01,A,,,,,71.20B,NAFRev2,O,4.092548,43.793319,0.85,street,Avenue de la Calmette 30250 Villevieille,30352_0026,G,AVENUE DE LA CALMETTE,
333365435,00028,33336543500028,O,1999-12-08,NN,,3220ZA,2016-04-26T03:16:01,false,5,,2,,ALL,DE FONTBONNE,30250,VILLEVIEILLE,,BP 62019,30352,,,,,,,,,,,,,,,,,,,2014-06-30,F,,,,,32.20Z,NAFRev2,O,4.087022,43.793245,0.86,housenumber,2 Allée de Fontbonne 30250 Villevieille,30352_0064_00002,G,2 ALLEE DE FONTBONNE,
333747681,00018,33374768100018,O,1985-10-08,NN,,,2021-11-30T08:32:52,true,4,,,,AV,DES CEVENNES,30250,VILLEVIEILLE,,,30352,,,,,,,,,,,,,,,,,,,2021-01-23,F,,,,,68.20B,NAFRev2,N,4.090388,43.790146,0.83,street,Avenue des Cevennes 30250 Villevieille,30352_0030,G,AVENUE DES CEVENNES,
334076148,00025,33407614800025,O,1991-07-01,NN,,,,true,3,,,,CHE,DU MAS PORTALIER,30250,VILLEVIEILLE,,,30352,,,,,,,,,,,,,,,,,,,1992-12-25,F,,,,,72.2Z,NAF1993,N,4.094722,43.785867,0.86,street,Chemin du Mas Portalier 30250 Villevieille,30352_0155,G,CHEMIN DU MAS PORTALIER,