siren,nic,siret,statutDiffusionEtablissement,dateCreationEtablissement,trancheEffectifsEtablissement,anneeEffectifsEtablissement,activitePrincipaleRegistreMetiersEtablissement,dateDernierTraitementEtablissement,etablissementSiege,nombrePeriodesEtablissement,complementAdresseEtablissement,numeroVoieEtablissement,indiceRepetitionEtablissement,typeVoieEtablissement,libelleVoieEtablissement,codePostalEtablissement,libelleCommuneEtablissement,libelleCommuneEtrangerEtablissement,distributionSpecialeEtablissement,codeCommuneEtablissement,codeCedexEtablissement,libelleCedexEtablissement,codePaysEtrangerEtablissement,libellePaysEtrangerEtablissement,complementAdresse2Etablissement,numeroVoie2Etablissement,indiceRepetition2Etablissement,typeVoie2Etablissement,libelleVoie2Etablissement,codePostal2Etablissement,libelleCommune2Etablissement,libelleCommuneEtranger2Etablissement,distributionSpeciale2Etablissement,codeCommune2Etablissement,codeCedex2Etablissement,libelleCedex2Etablissement,codePaysEtranger2Etablissement,libellePaysEtranger2Etablissement,dateDebut,etatAdministratifEtablissement,enseigne1Etablissement,enseigne2Etablissement,enseigne3Etablissement,denominationUsuelleEtablissement,activitePrincipaleEtablissement,nomenclatureActivitePrincipaleEtablissement,caractereEmployeurEtablissement,longitude,latitude,geo_score,geo_type,geo_adresse,geo_id,geo_ligne,geo_l4,geo_l5
130010176,00332,13001017600332,O,2010-01-25,NN,,,2019-11-14T14:00:41,false,2,CENTRE DES FINANCES PUBLIQUES,,,PL,DE LA MAIRIE,50620,SAINT-JEAN-DE-DAYE,,BP 15,50488,,,,,,,,,,,,,,,,,,,2016-12-13,F,TRESORERIE  SAINT-JEAN-DE-DAYE,,,,84.11Z,NAFRev2,N,-1.137442,49.228598,0.83,street,Place de la Mairie 50620 Saint-Jean-de-Daye,50488_0550,G,PLACE DE LA MAIRIE,
175002112,00126,17500211200126,O,1983-01-01,,,,2019-11-14T14:00:41,false,4,,,,PL,DE LA MAIRIE,50620,SAINT-JEAN-DE-DAYE,,,50488,,,,,,,,,,,,,,,,,,,2010-01-25,F,TRESORERIE DE SAINT-JEAN-DE-DAYE,,,,84.11Z,NAFRev2,N,-1.137442,49.228598,0.83,street,Place de la Mairie 50620 Saint-Jean-de-Daye,50488_0550,G,PLACE DE LA MAIRIE,
195013016,00017,19501301600017,O,1983-03-01,12,2019,,2021-10-27T08:04:57,true,4,,,,RUE,DU COLLEGE,50620,SAINT-JEAN-DE-DAYE,,,50488,,,,,,,,,,,,,,,,,,,2008-01-01,A,,,,,85.31Z,NAFRev2,N,-1.138642,49.224318,0.52,street,Rue du Clos des Barres 50620 Saint-Jean-de-Daye,50488_0435,G,RUE DU CLOS DES BARRES,
200091056,00016,20009105600016,O,2020-01-01,,,,2020-01-27T03:38:27,true,1,MAIRIE,,,PL,DE LA MAIRIE,50620,SAINT-JEAN-DE-DAYE,,,50488,,,,,,,,,,,,,,,,,,,2020-01-01,A,,,,,42.99Z,NAFRev2,O,-1.137442,49.228598,0.83,street,Place de la Mairie 50620 Saint-Jean-de-Daye,50488_0550,G,PLACE DE LA MAIRIE,
215004888,00016,21500488800016,O,1983-03-01,03,2019,,2021-10-27T08:08:41,true,4,,,,PL,DE LA MAIRIE,50620,SAINT-JEAN-DE-DAYE,,,50488,,,,,,,,,,,,,,,,,,,2008-01-01,A,MAIRIE,,,,84.11Z,NAFRev2,O,-1.137442,49.228598,0.83,street,Place de la Mairie 50620 Saint-Jean-de-Daye,50488_0550,G,PLACE DE LA MAIRIE,
215004888,00024,21500488800024,O,1983-12-21,02,2019,,2021-10-27T08:08:41,false,4,,,,RUE,MESNILS,50620,SAINT-JEAN-DE-DAYE,,,50488,,,,,,,,,,,,,,,,,,,2008-01-01,A,ECOLE PRIMAIRE PUBLIQUE,,,,85.20Z,NAFRev2,N,-1.141399,49.227909,0.86,street,Rue des Mesnils 50620 Saint-Jean-de-Daye,50488_0560,G,RUE DES MESNILS,
215004888,00032,21500488800032,O,1995-12-25,NN,,,2019-11-14T14:00:41,false,3,MAIRIE,,,PL,DE LA MAIRIE,50620,SAINT-JEAN-DE-DAYE,,,50488,,,,,,,,,,,,,,,,,,,2014-02-17,F,SERVICE D'ASSAINISSEMENT,,,,84.12Z,NAFRev2,N,-1.137442,49.228598,0.83,street,Place de la Mairie 50620 Saint-Jean-de-Daye,50488_0550,G,PLACE DE LA MAIRIE,
215004888,00040,21500488800040,O,2002-04-01,NN,,,2019-11-14T14:00:41,false,4,MAIRIE,,,PL,DE LA MAIRIE,50620,SAINT-JEAN-DE-DAYE,,,50488,,,,,,,,,,,,,,,,,,,2012-12-25,F,LOTISSEMENT COMMUNAL,,,,42.99Z,NAFRev2,N,-1.137442,49.228598,0.83,street,Place de la Mairie 50620 Saint-Jean-de-Daye,50488_0550,G,PLACE DE LA MAIRIE,
245000609,00017,24500060900017,O,1994-01-01,NN,,,2019-11-14T14:00:41,true,5,MAIRIE,,,PL,DE LA MAIRIE,50620,SAINT-JEAN-DE-DAYE,,,50488,,,,,,,,,,,,,,,,,,,2014-01-01,F,,,,,84.11Z,NAFRev2,O,-1.137442,49.228598,0.83,street,Place de la Mairie 50620 Saint-Jean-de-Daye,50488_0550,G,PLACE DE LA MAIRIE,
245000609,00025,24500060900025,O,2001-01-01,NN,,,2019-11-14T14:00:41,false,4,,1,,RUE,SAINT JEAN,50620,SAINT-JEAN-DE-DAYE,,,50488,,,,,,,,,,,,,,,,,,,2008-01-01,F,ZONE D'ACTIVITES,,,,42.99Z,NAFRev2,N,-1.13589,49.228391,0.95,housenumber,1 Rue Saint Jean 50620 Saint-Jean-de-Daye,50488_0620_00001,G,1 RUE SAINT JEAN,
245000609,00033,24500060900033,O,2002-01-01,NN,,,2019-11-14T14:00:41,false,4,,8,,RUE,DU FERRAGE,50620,SAINT-JEAN-DE-DAYE,,,50488,,,,,,,,,,,,,,,,,,,2014-01-01,F,SERVICE ORDURES MENAGERES,,,,38.11Z,NAFRev2,N,-1.1417,49.228525,0.95,housenumber,8 Rue du Ferrage 50620 Saint-Jean-de-Daye,50488_0480_00008,G,8 RUE DU FERRAGE,
245000609,00041,24500060900041,O,2002-11-20,NN,,,2019-11-14T14:00:41,false,5,,1,,RUE,SAINT JEAN,50620,SAINT-JEAN-DE-DAYE,,,50488,,,,,,,,,,,,,,,,,,,2012-12-30,F,BUREAUX,,,,84.11Z,NAFRev2,O,-1.13589,49.228391,0.95,housenumber,1 Rue Saint Jean 50620 Saint-Jean-de-Daye,50488_0620_00001,G,1 RUE SAINT JEAN,
245000609,00066,24500060900066,O,2012-12-30,,,,2019-11-14T14:00:41,false,2,,8,,RUE,DU FERRAGE,50620,SAINT-JEAN-DE-DAYE,,,50488,,,,,,,,,,,,,,,,,,,2014-01-01,F,BUREAUX ADMINISTRATIFS,,,,84.11Z,NAFRev2,O,-1.1417,49.228525,0.95,housenumber,8 Rue du Ferrage 50620 Saint-Jean-de-Daye,50488_0480_00008,G,8 RUE DU FERRAGE,
255000119,00016,25500011900016,O,1983-03-01,NN,,,2019-11-14T14:00:41,true,4,MAIRIE,,,PL,DE LA MAIRIE,50620,SAINT-JEAN-DE-DAYE,,,50488,,,,,,,,,,,,,,,,,,,2014-01-16,F,,,,,36.00Z,NAFRev2,N,-1.137442,49.228598,0.83,street,Place de la Mairie 50620 Saint-Jean-de-Daye,50488_0550,G,PLACE DE LA MAIRIE,
255001182,00013,25500118200013,O,1983-03-01,NN,,,2019-11-14T14:00:41,true,4,MAIRIE,,,PL,DE LA MAIRIE,50620,SAINT-JEAN-DE-DAYE,,,50488,,,,,,,,,,,,,,,,,,,2014-01-20,F,,,,,84.12Z,NAFRev2,N,-1.137442,49.228598,0.83,street,Place de la Mairie 50620 Saint-Jean-de-Daye,50488_0550,G,PLACE DE LA MAIRIE,
255001414,00010,25500141400010,O,,NN,,,2019-11-14T14:00:41,true,1,,,,,,50620,SAINT-JEAN-DE-DAYE,,,50488,,,,,,,,,,,,,,,,,,,1994-01-01,F,,,,,75.2J,NAF1993,N,,,0,,,,,,
255001984,00012,25500198400012,O,,NN,,,2019-11-14T14:00:41,true,1,,,,,MAIRIE,50620,SAINT-JEAN-DE-DAYE,,,50488,,,,,,,,,,,,,,,,,,,1990-12-31,F,,,,,90.12,NAP,N,-1.13738,49.228618,0.91,street,Rue de la Mairie 50620 Saint-Jean-de-Daye,50488_0551,G,RUE DE LA MAIRIE,
255002503,00019,25500250300019,O,1990-07-19,NN,,,2019-11-14T14:00:41,false,4,MAIRIE,,,PL,DE LA MAIRIE,50620,SAINT-JEAN-DE-DAYE,,,50488,,,,,,,,,,,,,,,,,,,2002-12-25,F,,,,,55.5A,NAF1993,O,-1.137442,49.228598,0.83,street,Place de la Mairie 50620 Saint-Jean-de-Daye,50488_0550,G,PLACE DE LA MAIRIE,
265004747,00019,26500474700019,O,1995-12-25,,,,2019-11-14T14:00:41,true,4,MAIRIE,,,PL,DE LA MAIRIE,50620,SAINT-JEAN-DE-DAYE,,,50488,,,,,,,,,,,,,,,,,,,2017-12-31,F,CCAS,,,,88.99B,NAFRev2,N,-1.137442,49.228598,0.83,street,Place de la Mairie 50620 Saint-Jean-de-Daye,50488_0550,G,PLACE DE LA MAIRIE,
275000172,00013,27500017200013,O,,,,,2019-11-14T14:00:41,true,1,,,,,,50620,SAINT-JEAN-DE-DAYE,,,50488,,,,,,,,,,,,,,,,,,,1995-12-25,F,,,,,90.0A,NAF1993,N,,,0,,,,,,
295000483,00012,29500048300012,O,1984-06-06,NN,,,2019-12-11T13:57:45,true,4,MAIRIE,,,PL,DE LA MAIRIE,50620,SAINT-JEAN-DE-DAYE,,,50488,,,,,,,,,,,,,,,,,,,2019-12-31,F,,,,,42.99Z,NAFRev2,N,-1.137442,49.228598,0.83,street,Place de la Mairie 50620 Saint-Jean-de-Daye,50488_0550,G,PLACE DE LA MAIRIE,
308588136,00017,30858813600017,O,1964-01-01,NN,,,2019-11-14T14:00:41,true,4,,,,PL,DE LA MAIRIE,50620,SAINT-JEAN-DE-DAYE,,,50488,,,,,,,,,,,,,,,,,,,2008-03-31,F,,,,,10.71C,NAFRev2,N,-1.137442,49.228598,0.83,street,Place de la Mairie 50620 Saint-Jean-de-Daye,50488_0550,G,PLACE DE LA MAIRIE,
309051894,00017,30905189400017,O,,NN,,,2019-11-14T14:00:41,true,1,,,,RTE,DE LA VALLEE,50620,SAINT-JEAN-DE-DAYE,,,50488,,,,,,,,,,,,,,,,,,,1987-06-30,F,,,,,58.07,NAP,N,-1.132934,49.229618,0.84,street,Route de la Vallee 50620 Saint-Jean-de-Daye,50488_h3e7ft,G,ROUTE DE LA VALLEE,
314004748,00047,31400474800047,O,1988-03-01,NN,,,2019-11-14T14:00:41,true,4,,,,RUE,DE LA LIBERATION,50620,SAINT-JEAN-DE-DAYE,,,50488,,,,,,,,,,,,,,,,,,,2007-09-30,F,,,,,15.8C,NAFRev1,O,-1.137046,49.229946,0.95,street,Rue de la Libération 50620 Saint-Jean-de-Daye,50488_0510,G,RUE DE LA LIBERATION,
314325929,00029,31432592900029,O,1900-01-01,NN,,,2019-11-14T14:00:41,false,5,,,,RUE,DES COURTINS,50620,SAINT-JEAN-DE-DAYE,,,50488,,,,,,,,,,,,,,,,,,,2014-12-31,F,,,,,86.21Z,NAFRev2,O,-1.138791,49.225531,0.95,street,Rue des Courtins 50620 Saint-Jean-de-Daye,50488_0440,G,RUE DES COURTINS,
314778937,00024,31477893700024,O,,,,,2019-11-14T14:00:41,true,1,,,,,LA COMTEE,50620,SAINT-JEAN-DE-DAYE,,,50488,,,,,,,,,,,,,,,,,,,1985-12-25,F,,,,,02.20,NAP,N,-1.137806,49.231271,0.76,street,La Comte 50620 Saint-Jean-de-Daye,50488_7lra17,G,LA COMTE,
318860046,00016,31886004600016,O,1980-05-02,NN,,,2019-11-14T14:00:41,true,5,,2,,RUE,DES COURTINS,50620,SAINT-JEAN-DE-DAYE,,,50488,,,,,,,,,,,,,,,,,,,2008-01-01,F,,,,,63.91Z,NAFRev2,N,-1.13889,49.225481,0.95,housenumber,2 Rue des Courtins 50620 Saint-Jean-de-Daye,50488_0440_00002,G,2 RUE DES COURTINS,
321197832,00017,32119783200017,O,1981-01-22,,,,2019-11-14T14:00:41,false,3,,,,RUE,SAINT JEAN,50620,SAINT-JEAN-DE-DAYE,,,50488,,,,,,,,,,,,,,,,,,,1992-12-25,F,,,,,74.1A,NAF1993,N,-1.135961,49.226334,0.95,street,Rue Saint Jean 50620 Saint-Jean-de-Daye,50488_0620,G,RUE SAINT JEAN,
322249863,00018,32224986300018,O,1981-07-01,NN,,,2019-11-14T14:00:41,true,4,,,,,LA VANNERIE,50620,SAINT-JEAN-DE-DAYE,,,50488,,,,,,,,,,,,,,,,,,,1994-12-25,F,,,,,01.4A,NAF1993,N,-1.142624,49.232145,0.47,street,La Clérauderie 50620 Saint-Jean-de-Daye,50488_vlqvqb,G,LA CLERAUDERIE,
323122200,00013,32312220000013,O,,,,,2019-11-14T14:00:41,true,1,,,,RUE,DE LA LIBERATION,50620,SAINT-JEAN-DE-DAYE,,,50488,,,,,,,,,,,,,,,,,,,1987-10-25,F,,,,,62.11,NAP,N,-1.137046,49.229946,0.95,street,Rue de la Libération 50620 Saint-Jean-de-Daye,50488_0510,G,RUE DE LA LIBERATION,
325428829,00023,32542882900023,O,1993-04-01,NN,,,2019-11-14T14:00:41,false,4,,3,,RUE,LIBERATION,50620,SAINT-JEAN-DE-DAYE,,,50488,,,,,,,,,,,,,,,,,,,2004-01-31,F,,,,,52.2C,NAFRev1,O,-1.136547,49.229047,0.94,housenumber,3 Rue de la Libération 50620 Saint-Jean-de-Daye,50488_0510_00003,G,3 RUE DE LA LIBERATION,
325428829,00031,32542882900031,O,2001-01-01,NN,,,2019-11-14T14:00:41,false,5,,,,,LE BOURG,50620,SAINT-JEAN-DE-DAYE,,,50488,,,,,,,,,,,,,,,,,,,2011-11-06,F,,,,,01.42Z,NAFRev2,N,-1.129094,49.223214,0.5,locality,Le Bois Jugan 50620 Saint-Jean-de-Daye,50488_B076,G,LE BOIS JUGAN,
325468833,00034,32546883300034,O,1986-11-01,NN,,,2019-11-14T14:00:41,false,4,,,,RUE,ST JEAN,50620,SAINT-JEAN-DE-DAYE,,,50488,,,,,,,,,,,,,,,,,,,1996-12-25,F,ALPHA MUSIC ANIMATION STANISLAS,,,,92.3B,NAF1993,O,-1.135961,49.226334,0.79,street,Rue Saint Jean 50620 Saint-Jean-de-Daye,50488_0620,G,RUE SAINT JEAN,
327118337,00010,32711833700010,O,,NN,,,2019-11-14T14:00:41,true,1,,,,RUE,DE LA LIBERATION,50620,SAINT-JEAN-DE-DAYE,,,50488,,,,,,,,,,,,,,,,,,,,F,,,,,67.01,NAP,N,-1.137046,49.229946,0.95,street,Rue de la Libération 50620 Saint-Jean-de-Daye,50488_0510,G,RUE DE LA LIBERATION,
327738365,00011,32773836500011,O,,NN,,,2019-11-14T14:00:41,true,1,,,,RUE,ST JEAN,50620,SAINT-JEAN-DE-DAYE,,,50488,,,,,,,,,,,,,,,,,,,1988-07-31,F,,,,,67.07,NAP,N,-1.135961,49.226334,0.79,street,Rue Saint Jean 50620 Saint-Jean-de-Daye,50488_0620,G,RUE SAINT JEAN,
328020680,00026,32802068000026,O,,NN,,,2019-11-14T14:00:41,true,1,,18,,RUE,POUCHIN,50620,SAINT-JEAN-DE-DAYE,,,50488,,,,,,,,,,,,,,,,,,,1993-03-29,F,,,,,51.2A,NAF1993,N,-1.14,49.226704,0.92,housenumber,18 Rue du Chanoine Pouchin 50620 Saint-Jean-de-Daye,50488_0420_00018,G,18 RUE DU CHANOINE POUCHIN,
328336185,00033,32833618500033,O,1998-04-08,,,,2019-11-14T14:00:41,false,3,,,,RTE,DE CARENTAN,50620,SAINT-JEAN-DE-DAYE,,,50488,,,,,,,,,,,,,,,,,,,1999-09-03,F,,,,,45.4A,NAF1993,N,-1.132934,49.229618,0.39,street,Route de la Vallee 50620 Saint-Jean-de-Daye,50488_h3e7ft,G,ROUTE DE LA VALLEE,
329398226,00020,32939822600020,O,1984-10-07,NN,,,2019-11-14T14:00:41,true,5,,,,RTE,DE GRAIGNES LE FERRAGE,50620,SAINT-JEAN-DE-DAYE,,,50488,,,,,,,,,,,,,,,,,,,2008-01-01,F,,,,,47.89Z,NAFRev2,N,-1.141221,49.229873,0.52,street,Rue de Graignes 50620 Saint-Jean-de-Daye,50488_0490,G,RUE DE GRAIGNES,
331042697,00036,33104269700036,O,2002-05-01,NN,,,2019-11-14T14:00:41,false,4,,14,,RUE,DE LA LIBERATION,50620,SAINT-JEAN-DE-DAYE,,,50488,,,,,,,,,,,,,,,,,,,2005-05-15,F,,,,,55.3A,NAFRev1,O,-1.136582,49.229549,0.95,housenumber,14 Rue de la Libération 50620 Saint-Jean-de-Daye,50488_0510_00014,G,14 RUE DE LA LIBERATION,
331347500,00018,33134750000018,O,1984-12-19,NN,,,2019-11-14T14:00:41,true,4,,3,,RUE,DU CHANOINE DOUCHIN,50620,SAINT-JEAN-DE-DAYE,,,50488,,,,,,,,,,,,,,,,,,,1994-12-25,F,,,,,52.6E,NAF1993,O,-1.137631,49.226983,0.87,housenumber,3 Rue du Chanoine Pouchin 50620 Saint-Jean-de-Daye,50488_0420_00003,G,3 RUE DU CHANOINE POUCHIN,
332409549,00018,33240954900018,O,,,,,2019-11-14T14:00:41,true,1,,94,,RUE,SAINT JEAN,50620,SAINT-JEAN-DE-DAYE,,,50488,,,,,,,,,,,,,,,,,,,1991-05-31,F,,,,,45.23,NAP,N,-1.135961,49.226334,0.81,street,Rue Saint Jean 50620 Saint-Jean-de-Daye,50488_0620,G,RUE SAINT JEAN,
332596311,00024,33259631100024,O,1990-07-17,NN,,,2019-11-14T14:00:41,false,4,LE BOURG,,,PL,DE L EGLISE,50620,SAINT-JEAN-DE-DAYE,,,50488,,,,,,,,,,,,,,,,,,,1998-04-01,F,,,,,52.6D,NAF1993,N,-1.135448,49.228701,0.82,street,Place de l’Eglise 50620 Saint-Jean-de-Daye,50488_0470,G,PLACE DE L EGLISE,
333228930,00017,33322893000017,O,,NN,,,2019-11-14T14:00:41,true,1,,,,RUE,DE LA LIBERATION,50620,SAINT-JEAN-DE-DAYE,,,50488,,,,,,,,,,,,,,,,,,,,F,,,,,67.05,NAP,N,-1.137046,49.229946,0.95,street,Rue de la Libération 50620 Saint-Jean-de-Daye,50488_0510,G,RUE DE LA LIBERATION,
333688646,00012,33368864600012,O,,NN,,,2019-11-14T14:00:41,true,1,,,,RTE,DE GRAIGNES,50620,SAINT-JEAN-DE-DAYE,,,50488,,,,,,,,,,,,,,,,,,,1989-12-31,F,,,,,49.01,NAP,N,-1.141221,49.229873,0.78,street,Rue de Graignes 50620 Saint-Jean-de-Daye,50488_0490,G,RUE DE GRAIGNES,
333850063,00012,33385006300012,O,,,,,2019-11-14T14:00:41,true,1,,2,,RUE,EDOUARD LAVIEILLE,50620,SAINT-JEAN-DE-DAYE,,,50488,,,,,,,,,,,,,,,,,,,1990-11-09,F,,,,,65.03,NAP,N,-1.137148,49.229929,0.95,housenumber,2 Rue Edouard Lavieille 50620 Saint-Jean-de-Daye,50488_0460_00002,G,2 RUE EDOUARD LAVIEILLE,
334128873,00018,33412887300018,O,1985-10-01,NN,,,2019-11-14T14:00:41,true,3,,,,,,50620,SAINT-JEAN-DE-DAYE,,,50488,,,,,,,,,,,,,,,,,,,2008-01-01,A,,,,,93.12Z,NAFRev2,N,,,0,,,,,,
334291986,00019,33429198600019,O,1985-12-01,NN,,,2019-11-14T14:00:41,false,4,,,,RUE,DE LA LIBERATION,50620,SAINT-JEAN-DE-DAYE,,,50488,,,,,,,,,,,,,,,,,,,1998-07-07,F,,,,,85.1J,NAF1993,O,-1.137046,49.229946,0.95,street,Rue de la Libération 50620 Saint-Jean-de-Daye,50488_0510,G,RUE DE LA LIBERATION,
334291986,00035,33429198600035,O,1998-07-07,NN,,4932ZA,2019-11-14T14:00:41,true,5,,,,RUE,EDOUART LAVIELLE,50620,SAINT-JEAN-DE-DAYE,,,50488,,,,,,,,,,,,,,,,,,,2011-07-04,A,,,,,49.32Z,NAFRev2,O,-1.138186,49.229555,0.74,street,Rue Edouard Lavieille 50620 Saint-Jean-de-Daye,50488_0460,G,RUE EDOUARD LAVIEILLE,
334447422,00018,33444742200018,O,1985-12-16,NN,,,2019-11-14T14:00:41,true,1,,14,,RUE,DE LA LIBERATION,50620,SAINT-JEAN-DE-DAYE,,,50488,,,,,,,,,,,,,,,,,,,2002-04-30,F,,,,,55.4B,NAF1993,O,-1.136582,49.229549,0.95,housenumber,14 Rue de la Libération 50620 Saint-Jean-de-Daye,50488_0510_00014,G,14 RUE DE LA LIBERATION,
341912517,00016,34191251700016,O,,NN,,,2019-11-14T14:00:41,true,1,,,,RTE,DE LA VALLEE,50620,SAINT-JEAN-DE-DAYE,,,50488,,,,,,,,,,,,,,,,,,,1990-12-31,F,,,,,19.01,NAP,N,-1.132934,49.229618,0.84,street,Route de la Vallee 50620 Saint-Jean-de-Daye,50488_h3e7ft,G,ROUTE DE LA VALLEE,
342866860,00014,34286686000014,O,,NN,,,2019-11-14T14:00:41,true,1,,9,,RUE,DE LA LIBERATION,50620,SAINT-JEAN-DE-DAYE,,,50488,,,,,,,,,,,,,,,,,,,1994-12-31,F,,,,,52.1B,NAF1993,N,-1.13693,49.229297,0.95,housenumber,9 Rue de la Libération 50620 Saint-Jean-de-Daye,50488_0510_00009,G,9 RUE DE LA LIBERATION,
343150066,00052,34315006600052,O,2016-03-10,,,,2019-11-14T14:00:41,false,2,,,,RUE,EDOUARD LAVIEILLE,50620,SAINT-JEAN-DE-DAYE,,,50488,,,,,,,,,,,,,,,,,,,2017-12-01,A,PLESSIS DEFORTESCU,,,PLESSIS DEFORTESCU,96.03Z,NAFRev2,O,-1.138186,49.229555,0.95,street,Rue Edouard Lavieille 50620 Saint-Jean-de-Daye,50488_0460,G,RUE EDOUARD LAVIEILLE,
344205737,00010,34420573700010,O,,,,,2019-11-14T14:00:41,true,1,,,,,MAIRIE,50620,SAINT-JEAN-DE-DAYE,,,50488,,,,,,,,,,,,,,,,,,,1988-01-02,F,,,,,96.24,NAP,N,-1.13738,49.228618,0.91,street,Rue de la Mairie 50620 Saint-Jean-de-Daye,50488_0551,G,RUE DE LA MAIRIE,
344469192,00019,34446919200019,O,1988-04-01,NN,,4332AA,2019-11-14T14:00:41,true,5,,,,RUE,EDOUARD LAVIEILLE,50620,SAINT-JEAN-DE-DAYE,,,50488,,,,,,,,,,,,,,,,,,,2016-03-10,F,,,,,43.32A,NAFRev2,O,-1.138186,49.229555,0.95,street,Rue Edouard Lavieille 50620 Saint-Jean-de-Daye,50488_0460,G,RUE EDOUARD LAVIEILLE,
347499824,00030,34749982400030,O,1994-10-15,NN,,,2019-11-14T14:00:41,false,4,,10,,RUE,ST-JEAN,50620,SAINT-JEAN-DE-DAYE,,,50488,,,,,,,,,,,,,,,,,,,2003-09-01,F,,,,,85.1G,NAFRev1,N,-1.136069,49.227673,0.83,housenumber,10 Rue Saint Jean 50620 Saint-Jean-de-Daye,50488_0620_00010,G,10 RUE SAINT JEAN,
347499824,00048,34749982400048,O,2003-09-01,NN,,,2019-11-14T14:00:41,false,3,,1,,PL,DE L EGLISE,50620,SAINT-JEAN-DE-DAYE,,,50488,,,,,,,,,,,,,,,,,,,2004-01-01,F,,,,,85.1G,NAFRev1,N,-1.135696,49.228494,0.83,housenumber,1 Place de l’Eglise 50620 Saint-Jean-de-Daye,50488_0470_00001,G,1 PLACE DE L EGLISE,
347816910,00017,34781691000017,O,1900-01-01,NN,,,2019-11-14T14:00:41,false,3,,,,PL,DE L EGLISE,50620,SAINT-JEAN-DE-DAYE,,,50488,,,,,,,,,,,,,,,,,,,1990-12-25,F,,,,,62.43,NAP,N,-1.135448,49.228701,0.82,street,Place de l’Eglise 50620 Saint-Jean-de-Daye,50488_0470,G,PLACE DE L EGLISE,
347946014,00011,34794601400011,O,1988-08-01,NN,,,2019-11-14T14:00:41,true,4,,,,RUE,ST JEAN,50620,SAINT-JEAN-DE-DAYE,,,50488,,,,,,,,,,,,,,,,,,,2008-01-01,A,,,,,68.20B,NAFRev2,N,-1.135961,49.226334,0.79,street,Rue Saint Jean 50620 Saint-Jean-de-Daye,50488_0620,G,RUE SAINT JEAN,
349057075,00039,34905707500039,O,1991-07-01,NN,,,2019-11-14T14:00:41,false,5,,,,,LE BOURG,50620,SAINT-JEAN-DE-DAYE,,,50488,,,,,,,,,,,,,,,,,,,2008-01-01,A,,,,,15.12Z,NAFRev2,N,-1.129094,49.223214,0.5,locality,Le Bois Jugan 50620 Saint-Jean-de-Daye,50488_B076,G,LE BOIS JUGAN,
349111559,00028,34911155900028,O,1998-01-12,NN,,,2019-11-14T14:00:41,false,3,,7,,RUE,ST JEAN,50620,SAINT-JEAN-DE-DAYE,,,50488,,,,,,,,,,,,,,,,,,,1998-12-31,F,,,,,50.4Z,NAF1993,O,-1.135886,49.228192,0.82,housenumber,7 Rue Saint Jean 50620 Saint-Jean-de-Daye,50488_0620_00007,G,7 RUE SAINT JEAN,
350018867,00027,35001886700027,O,1990-12-01,NN,,,2019-11-14T14:00:41,false,4,,10,,RUE,ST JEAN,50620,SAINT-JEAN-DE-DAYE,,,50488,,,,,,,,,,,,,,,,,,,2003-09-01,F,,,,,85.1G,NAFRev1,N,-1.136069,49.227673,0.83,housenumber,10 Rue Saint Jean 50620 Saint-Jean-de-Daye,50488_0620_00010,G,10 RUE SAINT JEAN,
350018867,00035,35001886700035,O,2003-09-01,NN,,,2019-11-14T14:00:41,false,4,,1,,PL,DE L EGLISE,50620,SAINT-JEAN-DE-DAYE,,,50488,,,,,,,,,,,,,,,,,,,2014-12-01,F,,,,,86.90D,NAFRev2,N,-1.135696,49.228494,0.83,housenumber,1 Place de l’Eglise 50620 Saint-Jean-de-Daye,50488_0470_00001,G,1 PLACE DE L EGLISE,
350018867,00043,35001886700043,O,2014-12-01,,,,2022-01-27T03:38:17,true,2,,40,,RUE,SAINT JEAN,50620,SAINT-JEAN-DE-DAYE,,,50488,,,,,,,,,,,,,,,,,,,2021-12-31,F,,,,,86.90D,NAFRev2,N,-1.135793,49.224276,0.95,housenumber,40 Rue Saint Jean 50620 Saint-Jean-de-Daye,50488_0620_00040,G,40 RUE SAINT JEAN,
350407094,00050,35040709400050,O,2000-10-10,NN,,,2019-11-14T14:00:41,false,4,,1,,PL,DE L EGLISE,50620,SAINT-JEAN-DE-DAYE,,,50488,,,,,,,,,,,,,,,,,,,2001-11-13,F,,,,,67.2Z,NAF1993,N,-1.135696,49.228494,0.83,housenumber,1 Place de l’Eglise 50620 Saint-Jean-de-Daye,50488_0470_00001,G,1 PLACE DE L EGLISE,
351394317,00017,35139431700017,O,1900-01-01,NN,,,2019-11-14T14:00:41,false,3,,,,RTE,DE ST LO,50620,SAINT-JEAN-DE-DAYE,,,50488,,,,,,,,,,,,,,,,,,,1993-12-25,F,,,,,50.1Z,NAF1993,N,-1.132934,49.229618,0.45,street,Route de la Vallee 50620 Saint-Jean-de-Daye,50488_h3e7ft,G,ROUTE DE LA VALLEE,
351520945,00012,35152094500012,O,1989-07-20,NN,,,2019-11-14T14:00:41,true,4,,,,,MAIRIE,50620,SAINT-JEAN-DE-DAYE,,,50488,,,,,,,,,,,,,,,,,,,1998-09-21,F,,,,,91.3E,NAF1993,N,-1.13738,49.228618,0.91,street,Rue de la Mairie 50620 Saint-Jean-de-Daye,50488_0551,G,RUE DE LA MAIRIE,
356000000,11865,35600000011865,O,2012-01-01,NN,,,2019-11-14T14:00:41,false,2,,9043,,PL,DE LA MAIRIE,50620,SAINT-JEAN-DE-DAYE,,,50488,,,,,,,,,,,,,,,,,,,2014-01-10,A,LA POSTE,,,,53.10Z,NAFRev2,O,-1.137442,49.228598,0.63,street,Place de la Mairie 50620 Saint-Jean-de-Daye,50488_0550,G,PLACE DE LA MAIRIE,
356000257,01950,35600025701950,O,1991-01-01,NN,,,2019-11-14T14:00:41,false,4,,,,PL,DE LA MAIRIE,50620,SAINT-JEAN-DE-DAYE,,,50488,,,,,,,,,,,,,,,,,,,2011-12-31,F,BUREAU DE POSTE,,,,53.10Z,NAFRev2,O,-1.137442,49.228598,0.83,street,Place de la Mairie 50620 Saint-Jean-de-Daye,50488_0550,G,PLACE DE LA MAIRIE,
356000257,07189,35600025707189,O,2004-05-18,,,,2019-11-14T14:00:41,false,5,,,,PL,DE LA MAIRIE,50620,SAINT-JEAN-DE-DAYE,,,50488,,,,,,,,,,,,,,,,,,,2011-12-31,F,EQUIPE AGENT ROULEUR RESEAU GD PUBLIC,,,,53.10Z,NAFRev2,O,-1.137442,49.228598,0.83,street,Place de la Mairie 50620 Saint-Jean-de-Daye,50488_0550,G,PLACE DE LA MAIRIE,
356000257,09284,35600025709284,O,2005-10-25,NN,,,2019-11-14T14:00:41,false,5,,,,PL,DE LA MAIRIE,50620,SAINT-JEAN-DE-DAYE,,,50488,,,,,,,,,,,,,,,,,,,2011-12-31,F,PLATEFORME DISTRIBUTION COURRIER,,,,53.10Z,NAFRev2,O,-1.137442,49.228598,0.83,street,Place de la Mairie 50620 Saint-Jean-de-Daye,50488_0550,G,PLACE DE LA MAIRIE,
377684774,00013,37768477400013,O,,NN,,,2019-11-14T14:00:41,true,1,,,,,LE BOIS JUGAN,50620,SAINT-JEAN-DE-DAYE,,,50488,,,,,,,,,,,,,,,,,,,1996-03-31,F,,,,,01.3Z,NAF1993,N,-1.129094,49.223214,0.94,locality,Le Bois Jugan 50620 Saint-Jean-de-Daye,50488_B076,G,LE BOIS JUGAN,
377741442,00018,37774144200018,O,1990-04-01,NN,,,2019-11-14T14:00:41,true,5,,,,RUE,DE LA LIBERATION,50620,SAINT-JEAN-DE-DAYE,,,50488,,,,,,,,,,,,,,,,,,,2014-01-06,F,,,,,47.73Z,NAFRev2,O,-1.137046,49.229946,0.95,street,Rue de la Libération 50620 Saint-Jean-de-Daye,50488_0510,G,RUE DE LA LIBERATION,
379646748,00010,37964674800010,O,1990-10-04,NN,,,2022-03-30T11:32:04,true,4,,,,RUE,SAINT JEAN,50620,SAINT-JEAN-DE-DAYE,,,50488,,,,,,,,,,,,,,,,,,,2021-12-30,F,,,,,68.20B,NAFRev2,N,-1.135961,49.226334,0.95,street,Rue Saint Jean 50620 Saint-Jean-de-Daye,50488_0620,G,RUE SAINT JEAN,
380117598,00017,38011759800017,O,1990-05-01,NN,,,2019-11-14T14:00:41,true,3,,,,,LE MESNIL ANGOT,50620,SAINT-JEAN-DE-DAYE,,,50488,,,,,,,,,,,,,,,,,,,2008-01-01,A,,,,,01.41Z,NAFRev2,N,-1.141399,49.227909,0.38,street,Rue des Mesnils 50620 Saint-Jean-de-Daye,50488_0560,G,RUE DES MESNILS,
381735125,00019,38173512500019,O,1991-04-01,NN,,,2019-11-14T14:00:41,true,4,,2,,RUE,EDOUARD LAVIEILLE,50620,SAINT-JEAN-DE-DAYE,,,50488,,,,,,,,,,,,,,,,,,,2005-08-31,F,,,,,50.1Z,NAFRev1,O,-1.137148,49.229929,0.95,housenumber,2 Rue Edouard Lavieille 50620 Saint-Jean-de-Daye,50488_0460_00002,G,2 RUE EDOUARD LAVIEILLE,
381990464,00012,38199046400012,O,1991-01-01,NN,,,2019-11-14T14:00:41,true,4,,,,,LE MONT AUGER,50620,SAINT-JEAN-DE-DAYE,,,50488,,,,,,,,,,,,,,,,,,,1996-12-25,F,,,,,01.2A,NAF1993,N,-1.141935,49.226527,0.35,locality,Le Clos Mottet du Levant 50620 Saint-Jean-de-Daye,50488_B088,G,LE CLOS MOTTET DU LEVANT,
383853801,00710,38385380100710,O,2003-12-01,,,,2019-11-14T14:00:41,false,3,,,,PL,DE LA MAIRIE,50620,SAINT-JEAN-DE-DAYE,,,50488,,,,,,,,,,,,,,,,,,,2008-01-01,A,GROUPAMA,,,,65.12Z,NAFRev2,N,-1.137442,49.228598,0.83,street,Place de la Mairie 50620 Saint-Jean-de-Daye,50488_0550,G,PLACE DE LA MAIRIE,