siren,nic,siret,statutDiffusionEtablissement,dateCreationEtablissement,trancheEffectifsEtablissement,anneeEffectifsEtablissement,activitePrincipaleRegistreMetiersEtablissement,dateDernierTraitementEtablissement,etablissementSiege,nombrePeriodesEtablissement,complementAdresseEtablissement,numeroVoieEtablissement,indiceRepetitionEtablissement,typeVoieEtablissement,libelleVoieEtablissement,codePostalEtablissement,libelleCommuneEtablissement,libelleCommuneEtrangerEtablissement,distributionSpecialeEtablissement,codeCommuneEtablissement,codeCedexEtablissement,libelleCedexEtablissement,codePaysEtrangerEtablissement,libellePaysEtrangerEtablissement,complementAdresse2Etablissement,numeroVoie2Etablissement,indiceRepetition2Etablissement,typeVoie2Etablissement,libelleVoie2Etablissement,codePostal2Etablissement,libelleCommune2Etablissement,libelleCommuneEtranger2Etablissement,distributionSpeciale2Etablissement,codeCommune2Etablissement,codeCedex2Etablissement,libelleCedex2Etablissement,codePaysEtranger2Etablissement,libellePaysEtranger2Etablissement,dateDebut,etatAdministratifEtablissement,enseigne1Etablissement,enseigne2Etablissement,enseigne3Etablissement,denominationUsuelleEtablissement,activitePrincipaleEtablissement,nomenclatureActivitePrincipaleEtablissement,caractereEmployeurEtablissement,longitude,latitude,geo_score,geo_type,geo_adresse,geo_id,geo_ligne,geo_l4,geo_l5
215900234,00018,21590023400018,O,1983-03-01,11,2019,,2021-10-27T08:09:11,true,4,,,,RTE,NATIONALE,59265,AUBENCHEUL-AU-BAC,,,59023,,,,,,,,,,,,,,,,,,,2008-01-01,A,MAIRIE,,,,84.11Z,NAFRev2,O,3.160663,50.255988,0.82,street,Route Nationale 59265 Aubencheul-au-Bac,59023_0120,G,ROUTE NATIONALE,
215900234,00026,21590023400026,O,1983-12-21,02,2019,,2021-10-27T08:09:11,false,4,,4,,RTE,NATIONALE,59265,AUBENCHEUL-AU-BAC,,,59023,,,,,,,,,,,,,,,,,,,2020-12-25,A,ECOLE ELEMENTAIRE HENRI MATISSE RPI 23,,,,85.20Z,NAFRev2,N,3.158923,50.2575,0.84,housenumber,4 Route Nationale 59265 Aubencheul-au-Bac,59023_0120_00004,G,4 ROUTE NATIONALE,
215900234,00034,21590023400034,O,1988-07-21,NN,,,2019-11-14T14:00:47,false,3,,,,RTE,DE FRESSIES,59265,AUBENCHEUL-AU-BAC,,,59023,,,,,,,,,,,,,,,,,,,2008-01-01,A,CAMPING MUNICIPAL LES COLOMBES,,,,55.30Z,NAFRev2,N,3.162861,50.255573,0.78,street,Rue de Fressies 59265 Aubencheul-au-Bac,59023_0080,G,RUE DE FRESSIES,
265900233,00015,26590023300015,O,1983-03-01,NN,,,2019-11-14T14:00:47,true,4,MAIRIE,,,RTE,NATIONALE,59265,AUBENCHEUL-AU-BAC,,,59023,,,,,,,,,,,,,,,,,,,2017-08-01,F,CCAS,,,,88.99B,NAFRev2,N,3.160663,50.255988,0.82,street,Route Nationale 59265 Aubencheul-au-Bac,59023_0120,G,ROUTE NATIONALE,
300058872,00015,30005887200015,O,,,,,2019-11-14T14:00:47,true,1,,3,,RUE,NEUVE,59265,AUBENCHEUL-AU-BAC,,,59023,,,,,,,,,,,,,,,,,,,1984-12-25,F,,,,,62.46,NAP,N,3.162814,50.254033,0.94,housenumber,3 Rue Neuve 59265 Aubencheul-au-Bac,59023_0140_00003,G,3 RUE NEUVE,
303240154,00011,30324015400011,O,,,,,2019-11-14T14:00:47,true,1,,3,,,GRAND RUE,59265,AUBENCHEUL-AU-BAC,,,59023,,,,,,,,,,,,,,,,,,,1985-12-25,F,,,,,00.10,NAP,N,3.158556,50.257577,0.41,housenumber,3 Rue Roger Salengro 59265 Aubencheul-au-Bac,59023_0160_00003,G,3 RUE ROGER SALENGRO,
305485344,00017,30548534400017,O,1900-01-01,,,,2019-11-14T14:00:47,false,3,,54,,RUE,ROGER SALENGRO,59265,AUBENCHEUL-AU-BAC,,,59023,,,,,,,,,,,,,,,,,,,1993-12-28,F,,,,,45.1A,NAF1993,N,3.154252,50.258791,0.95,housenumber,54 Rue Roger Salengro 59265 Aubencheul-au-Bac,59023_0160_00054,G,54 RUE ROGER SALENGRO,
306848862,00018,30684886200018,O,,NN,,,2019-11-14T14:00:47,true,1,,12,,RTE,NATIONALE,59265,AUBENCHEUL-AU-BAC,,,59023,,,,,,,,,,,,,,,,,,,1996-12-17,F,,,,,52.4C,NAF1993,O,3.159491,50.256944,0.84,housenumber,12 Route Nationale 59265 Aubencheul-au-Bac,59023_0120_00012,G,12 ROUTE NATIONALE,
310218771,00023,31021877100023,O,1971-01-01,NN,,,2019-11-14T14:00:47,true,1,,28,,RTE,NATIONALE,59265,AUBENCHEUL-AU-BAC,,,59023,,,,,,,,,,,,,,,,,,,1998-10-31,F,,,,,01.1A,NAF1993,N,3.161571,50.254522,0.84,housenumber,28 Route Nationale 59265 Aubencheul-au-Bac,59023_0120_00028,G,28 ROUTE NATIONALE,
310278346,00013,31027834600013,O,,NN,,,2019-11-14T14:00:47,true,1,,4,,RUE,DE FRESSIES,59265,AUBENCHEUL-AU-BAC,,,59023,,,,,,,,,,,,,,,,,,,1993-03-31,F,,,,,45.2V,NAF1993,N,3.161843,50.256146,0.95,housenumber,4 Rue de Fressies 59265 Aubencheul-au-Bac,59023_0080_00004,G,4 RUE DE FRESSIES,
312757784,00011,31275778400011,O,1978-01-01,NN,,,2019-11-14T14:00:47,true,3,,,,RTE,NATIONALE,59265,AUBENCHEUL-AU-BAC,,,59023,,,,,,,,,,,,,,,,,,,2001-12-03,F,,,,,70.2C,NAF1993,N,3.160663,50.255988,0.82,street,Route Nationale 59265 Aubencheul-au-Bac,59023_0120,G,ROUTE NATIONALE,
319822664,00011,31982266400011,O,1980-09-01,,,,2019-11-14T14:00:47,false,4,,5,,RTE,NATIONALE,59265,AUBENCHEUL-AU-BAC,,,59023,,,,,,,,,,,,,,,,,,,1994-09-01,F,,,,,60.2M,NAF1993,N,3.159151,50.257638,0.84,housenumber,5 Route Nationale 59265 Aubencheul-au-Bac,59023_0120_00005,G,5 ROUTE NATIONALE,
321949182,00018,32194918200018,O,,NN,,,2019-11-14T14:00:47,true,1,,10,,RTE,NATIONALE,59265,AUBENCHEUL-AU-BAC,,,59023,,,,,,,,,,,,,,,,,,,,F,,,,,84.10,NAP,N,3.159203,50.257147,0.84,housenumber,10 Route Nationale 59265 Aubencheul-au-Bac,59023_0120_00010,G,10 ROUTE NATIONALE,
322527235,00012,32252723500012,O,,,,,2019-11-14T14:00:47,true,1,,34,,RTE,NATIONALE,59265,AUBENCHEUL-AU-BAC,,,59023,,,,,,,,,,,,,,,,,,,1984-12-25,F,,,,,64.46,NAP,N,3.162006,50.253874,0.84,housenumber,34 Route Nationale 59265 Aubencheul-au-Bac,59023_0120_00034,G,34 ROUTE NATIONALE,
325629343,00014,32562934300014,O,1982-09-01,NN,,,2019-11-14T14:00:47,false,3,,19,B,RTE,NATIONALE,59265,AUBENCHEUL-AU-BAC,,,59023,,,,,,,,,,,,,,,,,,,1995-01-01,F,,,,,60.2L,NAF1993,N,3.159818,50.256789,0.75,housenumber,19bis Route Nationale 59265 Aubencheul-au-Bac,59023_0120_00019_bis,G,19BIS ROUTE NATIONALE,
326598471,00059,32659847100059,O,2010-01-01,,,,2019-11-14T14:00:47,false,3,,29,,RTE,ROUTE NATIONALE,59265,AUBENCHEUL-AU-BAC,,,59023,,,,,,,,,,,,,,,,,,,2011-04-01,F,,,,,47.79Z,NAFRev2,N,3.161616,50.256263,0.84,housenumber,29 Route Nationale 59265 Aubencheul-au-Bac,59023_0120_00029,G,29 ROUTE NATIONALE,
327122214,00015,32712221400015,O,1982-12-05,NN,,,2019-11-14T14:00:47,true,1,,1,,RTE,NATIONALE,59265,AUBENCHEUL-AU-BAC,,,59023,,,,,,,,,,,,,,,,,,,1997-11-30,F,,,,,55.4B,NAF1993,O,3.158921,50.257992,0.84,housenumber,1 Route Nationale 59265 Aubencheul-au-Bac,59023_0120_00001,G,1 ROUTE NATIONALE,
327609681,00041,32760968100041,O,2011-01-01,,,,2019-11-14T14:00:47,false,2,,5,B,RUE,DE FRESSIES,59265,AUBENCHEUL-AU-BAC,,,59023,,,,,,,,,,,,,,,,,,,2012-12-31,F,,,,,46.19B,NAFRev2,N,3.16147,50.256453,0.86,housenumber,5bis Rue de Fressies 59265 Aubencheul-au-Bac,59023_0080_00005_bis,G,5BIS RUE DE FRESSIES,
328325543,00085,32832554300085,O,2011-08-01,,,,2019-11-14T14:00:47,false,2,,1,,RTE,NATIONALE,59265,AUBENCHEUL-AU-BAC,,,59023,,,,,,,,,,,,,,,,,,,2011-10-01,F,,,,,56.10C,NAFRev2,N,3.158921,50.257992,0.84,housenumber,1 Route Nationale 59265 Aubencheul-au-Bac,59023_0120_00001,G,1 ROUTE NATIONALE,
328325543,00093,32832554300093,O,2011-10-01,,,,2019-11-14T14:00:47,false,2,,1,B,RTE,NATIONALE,59265,AUBENCHEUL-AU-BAC,,,59023,,,,,,,,,,,,,,,,,,,2012-01-16,F,,,,,56.10C,NAFRev2,N,3.158921,50.257992,0.74,housenumber,1bis Route Nationale 59265 Aubencheul-au-Bac,59023_0120_00001_bis,G,1BIS ROUTE NATIONALE,
329380752,00017,32938075200017,O,1984-01-01,NN,,,2019-11-14T14:00:47,true,6,,29,,RTE,NATIONALE,59265,AUBENCHEUL-AU-BAC,,,59023,,,,,,,,,,,,,,,,,,,2006-12-31,F,,,,,36.1K,NAFRev1,O,3.161616,50.256263,0.84,housenumber,29 Route Nationale 59265 Aubencheul-au-Bac,59023_0120_00029,G,29 ROUTE NATIONALE,
329588073,00018,32958807300018,O,,NN,,,2019-11-14T14:00:47,true,1,,26,,RTE,NATIONALE,59265,AUBENCHEUL-AU-BAC,,,59023,,,,,,,,,,,,,,,,,,,,F,,,,,62.45,NAP,N,3.161468,50.254667,0.84,housenumber,26 Route Nationale 59265 Aubencheul-au-Bac,59023_0120_00026,G,26 ROUTE NATIONALE,
334578523,00022,33457852300022,O,2004-06-01,NN,,,2019-11-14T14:00:47,false,3,,54,,RUE,ROGER SALENGRO,59265,AUBENCHEUL-AU-BAC,,,59023,,,,,,,,,,,,,,,,,,,2004-12-25,F,,,,,74.8F,NAFRev1,N,3.154252,50.258791,0.95,housenumber,54 Rue Roger Salengro 59265 Aubencheul-au-Bac,59023_0160_00054,G,54 RUE ROGER SALENGRO,
334913696,00012,33491369600012,O,1986-01-01,NN,,,2019-11-14T14:00:47,false,4,,3,,,GRAND PLACE,59265,AUBENCHEUL-AU-BAC,,,59023,,,,,,,,,,,,,,,,,,,1996-12-25,F,,,,,45.1A,NAF1993,O,3.160639,50.256972,0.47,housenumber,3 Place Georges Tarlier 59265 Aubencheul-au-Bac,59023_0090_00003,G,3 PLACE GEORGES TARLIER,
334913696,00020,33491369600020,O,1996-01-01,NN,,,2019-11-14T14:00:47,true,6,,,,RTE,DE FRESSIES,59265,AUBENCHEUL-AU-BAC,,,59023,,,,,,,,,,,,,,,,,,,2009-01-31,F,,,,,42.91Z,NAFRev2,N,3.162861,50.255573,0.78,street,Rue de Fressies 59265 Aubencheul-au-Bac,59023_0080,G,RUE DE FRESSIES,
335100046,00028,33510004600028,O,,NN,,,2019-11-14T14:00:47,true,1,,23,,RUE,DE FRESSIES,59265,AUBENCHEUL-AU-BAC,,,59023,,,,,,,,,,,,,,,,,,,1990-02-05,F,,,,,59.08,NAP,N,3.163623,50.255388,0.95,housenumber,23 Rue de Fressies 59265 Aubencheul-au-Bac,59023_0080_00023,G,23 RUE DE FRESSIES,
337596027,00033,33759602700033,O,2019-04-20,,,5610CQ,2019-11-14T14:00:47,true,1,CAMPING LES COLOMBES,2,,RUE,DES COLOMBES,59265,AUBENCHEUL-AU-BAC,,,59023,,,,,,,,,,,,,,,,,,,2019-04-20,A,,,,,56.10C,NAFRev2,N,3.165887,50.255915,0.94,housenumber,2 Rue des Colombes 59265 Aubencheul-au-Bac,59023_0015_00002,G,2 RUE DES COLOMBES,
338668858,00016,33866885800016,O,,NN,,,2019-11-14T14:00:47,true,1,,26,,RTE,NATIONALE,59265,AUBENCHEUL-AU-BAC,,,59023,,,,,,,,,,,,,,,,,,,,F,,,,,62.46,NAP,N,3.161468,50.254667,0.84,housenumber,26 Route Nationale 59265 Aubencheul-au-Bac,59023_0120_00026,G,26 ROUTE NATIONALE,
338901937,00023,33890193700023,O,,NN,,,2019-11-14T14:00:47,true,1,,6,,RUE,DE LA HALTE,59265,AUBENCHEUL-AU-BAC,,,59023,,,,,,,,,,,,,,,,,,,1987-08-24,F,,,,,55.71,NAP,N,3.157221,50.256504,0.94,housenumber,6 Rue de la Halte 59265 Aubencheul-au-Bac,59023_0100_00006,G,6 RUE DE LA HALTE,
345363816,00033,34536381600033,O,2016-09-15,,,,2021-02-23T11:00:14,true,1,,271,,RUE,DE FRESSIES,59265,AUBENCHEUL-AU-BAC,,,59023,,,,,,,,,,,,,,,,,,,2016-09-15,A,SAGE FEMME LIBERALE,,,,86.90D,NAFRev2,N,3.163462,50.25543,0.95,housenumber,271 Rue de Fressies 59265 Aubencheul-au-Bac,59023_0080_00271,G,271 RUE DE FRESSIES,
348116690,00010,34811669000010,O,1988-09-27,NN,,,2019-11-14T14:00:47,true,4,,12,,RTE,NATIONALE,59265,AUBENCHEUL-AU-BAC,,,59023,,,,,,,,,,,,,,,,,,,2003-07-02,F,,,,,74.1J,NAFRev1,N,3.159491,50.256944,0.84,housenumber,12 Route Nationale 59265 Aubencheul-au-Bac,59023_0120_00012,G,12 ROUTE NATIONALE,
348625237,00014,34862523700014,O,1988-11-16,,,,2019-11-14T14:00:47,true,3,,12,,RTE,NATIONALE,59265,AUBENCHEUL-AU-BAC,,,59023,,,,,,,,,,,,,,,,,,,1997-06-19,F,,,,,70.2C,NAF1993,N,3.159491,50.256944,0.84,housenumber,12 Route Nationale 59265 Aubencheul-au-Bac,59023_0120_00012,G,12 ROUTE NATIONALE,
348685728,00019,34868572800019,O,1988-10-01,NN,,,2020-08-25T10:43:34,false,5,,,,RTE,NATIONALE,59265,AUBENCHEUL-AU-BAC,,,59023,,,,,,,,,,,,,,,,,,,2018-01-01,F,,,,,47.76Z,NAFRev2,O,3.160663,50.255988,0.82,street,Route Nationale 59265 Aubencheul-au-Bac,59023_0120,G,ROUTE NATIONALE,
349019133,00017,34901913300017,O,1988-11-04,NN,,,2019-11-14T14:00:47,false,4,,5,,RTE,NATIONALE,59265,AUBENCHEUL-AU-BAC,,,59023,,,,,,,,,,,,,,,,,,,2008-01-01,F,,,,,68.20B,NAFRev2,N,3.159151,50.257638,0.84,housenumber,5 Route Nationale 59265 Aubencheul-au-Bac,59023_0120_00005,G,5 ROUTE NATIONALE,
350554366,00012,35055436600012,O,,NN,,,2019-11-14T14:00:47,true,1,,9,,RUE,NEUVE,59265,AUBENCHEUL-AU-BAC,,,59023,,,,,,,,,,,,,,,,,,,1988-10-31,F,,,,,64.43,NAP,N,3.163698,50.254227,0.94,housenumber,9 Rue Neuve 59265 Aubencheul-au-Bac,59023_0140_00009,G,9 RUE NEUVE,
350900072,00025,35090007200025,O,1999-05-28,NN,,,2019-11-14T14:00:47,true,1,,23,,RUE,NATIONALE,59265,AUBENCHEUL-AU-BAC,,,59023,,,,,,,,,,,,,,,,,,,2001-06-30,F,,,,,67.1E,NAF1993,N,3.160188,50.256453,0.79,housenumber,23 Route Nationale 59265 Aubencheul-au-Bac,59023_0120_00023,G,23 ROUTE NATIONALE,
351763453,00013,35176345300013,O,,,,,2019-11-14T14:00:47,true,1,,20,B,RUE,ROGER SALENGRO,59265,AUBENCHEUL-AU-BAC,,,59023,,,,,,,,,,,,,,,,,,,1989-09-05,F,,,,,55.60,NAP,N,3.156223,50.258135,0.87,housenumber,20bis Rue Roger Salengro 59265 Aubencheul-au-Bac,59023_0160_00020_bis,G,20BIS RUE ROGER SALENGRO,
380055715,00037,38005571500037,O,2019-03-21,,,,2021-02-23T11:08:35,true,1,,6,,RUE,DU HERON,59265,AUBENCHEUL-AU-BAC,,,59023,,,,,,,,,,,,,,,,,,,2019-03-21,A,,,,,47.99A,NAFRev2,N,3.166663,50.255317,0.95,housenumber,6 Rue du Heron 59265 Aubencheul-au-Bac,59023_0103_00006,G,6 RUE DU HERON,
383336427,00026,38333642700026,O,1994-07-01,NN,,4332AA,2019-11-14T14:00:47,true,3,,1,,RUE,NEUVE,59265,AUBENCHEUL-AU-BAC,,,59023,,,,,,,,,,,,,,,,,,,1995-12-25,F,,,,,45.4C,NAF1993,O,3.162551,50.253977,0.94,housenumber,1 Rue Neuve 59265 Aubencheul-au-Bac,59023_0140_00001,G,1 RUE NEUVE,
388227852,00018,38822785200018,O,1992-07-31,NN,,,2019-11-14T14:00:47,false,4,,12,,RTE,NATIONALE,59265,AUBENCHEUL-AU-BAC,,,59023,,,,,,,,,,,,,,,,,,,1996-10-25,F,,,,,70.2C,NAF1993,N,3.159491,50.256944,0.84,housenumber,12 Route Nationale 59265 Aubencheul-au-Bac,59023_0120_00012,G,12 ROUTE NATIONALE,
388922460,00026,38892246000026,O,1997-04-01,NN,,,2019-11-14T14:00:47,false,4,,7,,RTE,NATIONALE,59265,AUBENCHEUL-AU-BAC,,,59023,,,,,,,,,,,,,,,,,,,2001-08-01,F,,,,,60.2M,NAF1993,O,3.15928,50.257454,0.84,housenumber,7 Route Nationale 59265 Aubencheul-au-Bac,59023_0120_00007,G,7 ROUTE NATIONALE,
391162856,00010,39116285600010,O,1993-04-01,01,2019,4520AA,2021-10-27T08:18:58,true,6,,,,RTE,NATIONALE,59265,AUBENCHEUL-AU-BAC,,,59023,,,,,,,,,,,,,,,,,,,2020-09-30,F,,,,,47.30Z,NAFRev2,N,3.160663,50.255988,0.82,street,Route Nationale 59265 Aubencheul-au-Bac,59023_0120,G,ROUTE NATIONALE,
392380838,00046,39238083800046,O,2007-04-01,,,,2021-02-23T11:18:11,true,2,,9,T,CHE,DES POSTES,59265,AUBENCHEUL-AU-BAC,,,59023,,,,,,,,,,,,,,,,,,,2008-01-01,A,,,,,86.90D,NAFRev2,N,3.156133,50.25575,0.73,housenumber,9ter Chemin des Postes 59265 Aubencheul-au-Bac,59023_0152_00009_ter,G,9TER CHEMIN DES POSTES,
392902003,00012,39290200300012,O,1993-10-07,NN,,,2019-11-14T14:00:47,true,4,,12,,RTE,NATIONALE,59265,AUBENCHEUL-AU-BAC,,,59023,,,,,,,,,,,,,,,,,,,1999-12-25,F,,,,,51.4C,NAF1993,O,3.159491,50.256944,0.84,housenumber,12 Route Nationale 59265 Aubencheul-au-Bac,59023_0120_00012,G,12 ROUTE NATIONALE,
392936233,00015,39293623300015,O,1993-10-12,NN,,,2019-11-14T14:00:47,true,3,,37,,RTE,NATIONALE,59265,AUBENCHEUL-AU-BAC,,,59023,,,,,,,,,,,,,,,,,,,2008-01-01,A,,,,,68.20B,NAFRev2,N,3.162498,50.253552,0.84,housenumber,37 Route Nationale 59265 Aubencheul-au-Bac,59023_0120_00037,G,37 ROUTE NATIONALE,
397878570,00027,39787857000027,O,2001-07-01,NN,,,2019-11-14T14:00:47,false,5,,,,RTE,NATIONALE,59265,AUBENCHEUL-AU-BAC,,,59023,,,,,,,,,,,,,,,,,,,2015-06-27,F,,,,,46.21Z,NAFRev2,O,3.160663,50.255988,0.82,street,Route Nationale 59265 Aubencheul-au-Bac,59023_0120,G,ROUTE NATIONALE,
403781156,00019,40378115600019,O,1996-02-01,NN,,,2019-11-14T14:00:47,false,4,,5,R,RTE,NATIONALE,59265,AUBENCHEUL-AU-BAC,,,59023,,,,,,,,,,,,,,,,,,,2008-01-01,F,,,,,68.20B,NAFRev2,N,3.159234,50.257654,0.84,interpolation,5 Route Nationale 59265 Aubencheul-au-Bac,,G,3 ROUTE NATIONALE,
407696749,00016,40769674900016,O,1987-03-12,NN,,,2019-11-14T14:00:47,true,3,MAIRIE,,,RTE,NATIONALE,59265,AUBENCHEUL-AU-BAC,,,59023,,,,,,,,,,,,,,,,,,,2008-01-01,A,,,,,93.12Z,NAFRev2,N,3.160663,50.255988,0.82,street,Route Nationale 59265 Aubencheul-au-Bac,59023_0120,G,ROUTE NATIONALE,
408422277,00017,40842227700017,O,1996-07-22,NN,,,2019-11-14T14:00:47,true,1,,,,RTE,N 43,59265,AUBENCHEUL-AU-BAC,,,59023,,,,,,,,,,,,,,,,,,,1998-05-05,F,,,,,45.4C,NAF1993,O,3.160663,50.255988,0.32,street,Route Nationale 59265 Aubencheul-au-Bac,59023_0120,G,ROUTE NATIONALE,
409131323,00019,40913132300019,O,1996-08-01,NN,,,2019-11-14T14:00:47,false,4,,26,,,SALENGRO,59265,AUBENCHEUL-AU-BAC,,,59023,,,,,,,,,,,,,,,,,,,1999-11-15,F,,,,,45.4J,NAF1993,O,3.155862,50.258288,0.86,housenumber,26 Rue Roger Salengro 59265 Aubencheul-au-Bac,59023_0160_00026,G,26 RUE ROGER SALENGRO,
409131323,00027,40913132300027,O,1999-11-15,01,2019,4334ZB,2021-10-27T08:32:45,true,5,AUBENCHEUL AU BAC,33,,RTE,NATIONALE,59265,AUBENCHEUL-AU-BAC,,,59023,,,,,,,,,,,,,,,,,,,2011-01-30,A,,,,,43.34Z,NAFRev2,O,3.161535,50.254953,0.84,housenumber,33 Route Nationale 59265 Aubencheul-au-Bac,59023_0120_00033,G,33 ROUTE NATIONALE,
410088744,00017,41008874400017,O,,NN,,,2019-11-14T14:00:47,true,1,,54,,RUE,ROGER SALENGRO,59265,AUBENCHEUL-AU-BAC,,,59023,,,,,,,,,,,,,,,,,,,1997-03-31,F,,,,,51.1G,NAF1993,N,3.154252,50.258791,0.95,housenumber,54 Rue Roger Salengro 59265 Aubencheul-au-Bac,59023_0160_00054,G,54 RUE ROGER SALENGRO,
414734335,00691,41473433500691,O,2001-02-28,NN,,,2019-11-14T14:00:47,false,3,,,,RTE,NATIONALE,59265,AUBENCHEUL-AU-BAC,,,59023,,,,,,,,,,,,,,,,,,,2007-02-01,F,,,,,52.1D,NAFRev1,O,3.160663,50.255988,0.82,street,Route Nationale 59265 Aubencheul-au-Bac,59023_0120,G,ROUTE NATIONALE,
414894006,00017,41489400600017,O,1997-12-01,NN,,,2019-11-14T14:00:47,false,5,,14,,RUE,DU HERON,59265,AUBENCHEUL-AU-BAC,,,59023,,,,,,,,,,,,,,,,,,,2009-02-02,F,,,,,43.12A,NAFRev2,O,3.167947,50.255253,0.95,housenumber,14 Rue du Heron 59265 Aubencheul-au-Bac,59023_0103_00014,G,14 RUE DU HERON,
414894006,00025,41489400600025,O,2009-02-02,02,2019,4312AZ,2021-10-27T08:38:26,true,1,,475,,RUE,NEUVE,59265,AUBENCHEUL-AU-BAC,,,59023,,,,,,,,,,,,,,,,,,,2009-02-02,A,,,,,43.12A,NAFRev2,O,3.163954,50.254163,0.94,housenumber,475 Rue Neuve 59265 Aubencheul-au-Bac,59023_0140_00475,G,475 RUE NEUVE,
420145021,00010,42014502100010,O,1998-08-01,NN,,,2019-11-14T14:00:47,false,4,,1,,RTE,NATIONALE,59265,AUBENCHEUL-AU-BAC,,,59023,,,,,,,,,,,,,,,,,,,2003-02-13,F,,,,,55.4A,NAFRev1,N,3.158921,50.257992,0.84,housenumber,1 Route Nationale 59265 Aubencheul-au-Bac,59023_0120_00001,G,1 ROUTE NATIONALE,
420145021,00028,42014502100028,O,2003-03-12,NN,,,2019-11-14T14:00:47,true,5,,2,,RUE,DES COLOMBES,59265,AUBENCHEUL-AU-BAC,,,59023,,,,,,,,,,,,,,,,,,,2012-01-31,F,,,,,55.30Z,NAFRev2,O,3.165887,50.255915,0.94,housenumber,2 Rue des Colombes 59265 Aubencheul-au-Bac,59023_0015_00002,G,2 RUE DES COLOMBES,
423435544,00139,42343554400139,O,2000-01-01,11,2019,,2021-10-27T08:05:02,false,3,,,,RTE,NATIONALE,59265,AUBENCHEUL-AU-BAC,,,59023,,,,,,,,,,,,,,,,,,,2008-01-01,A,,,,,46.21Z,NAFRev2,O,3.160663,50.255988,0.82,street,Route Nationale 59265 Aubencheul-au-Bac,59023_0120,G,ROUTE NATIONALE,
424779189,00010,42477918900010,O,2000-01-01,NN,,,2019-11-14T14:00:47,true,3,,23,,RUE,NATIONALE,59265,AUBENCHEUL-AU-BAC,,,59023,,,,,,,,,,,,,,,,,,,2008-01-01,A,,,,,68.20B,NAFRev2,N,3.160188,50.256453,0.79,housenumber,23 Route Nationale 59265 Aubencheul-au-Bac,59023_0120_00023,G,23 ROUTE NATIONALE,
428983175,00020,42898317500020,O,2016-05-27,,,4334ZC,2021-02-23T11:48:35,true,1,LOT NORMANDIE,7,,RUE,NEUVE,59265,AUBENCHEUL-AU-BAC,,,59023,,,,,,,,,,,,,,,,,,,2016-05-27,A,,,,BORD,43.34Z,NAFRev2,N,3.163419,50.254166,0.94,housenumber,7 Rue Neuve 59265 Aubencheul-au-Bac,59023_0140_00007,G,7 RUE NEUVE,
430745000,00017,43074500000017,O,1968-01-01,NN,,,2019-11-14T14:00:47,true,3,,17,,RUE,SALENGRO,59265,AUBENCHEUL-AU-BAC,,,59023,,,,,,,,,,,,,,,,,,,2008-01-01,A,,,,,01.11Z,NAFRev2,N,3.155901,50.258172,0.88,housenumber,17 Rue Roger Salengro 59265 Aubencheul-au-Bac,59023_0160_00017,G,17 RUE ROGER SALENGRO,
432422962,00030,43242296200030,O,2020-11-05,,,,2021-06-23T08:36:25,false,1,,,,,6 RUE NEUVE,59265,AUBENCHEUL-AU-BAC,,,59023,,,,,,,,,,,,,,,,,,,2020-11-05,A,,,,,71.12B,NAFRev2,N,3.163242,50.254128,0.94,housenumber,6 Rue Neuve 59265 Aubencheul-au-Bac,59023_0140_00006,G,6 RUE NEUVE,
432561876,00033,43256187600033,O,2015-05-19,,,,2021-02-23T13:13:48,true,1,,1,T,RTE,NATIONALE,59265,AUBENCHEUL-AU-BAC,,,59023,,,,,,,,,,,,,,,,,,,2015-05-19,A,DANA PIZZA,,,,56.10C,NAFRev2,N,3.158921,50.257992,0.74,housenumber,1ter Route Nationale 59265 Aubencheul-au-Bac,59023_0120_00001_ter,G,1TER ROUTE NATIONALE,
437628266,00037,43762826600037,O,2017-02-01,,,5610CQ,2021-02-23T13:17:49,true,1,,1,B,RTE,NATIONALE,59265,AUBENCHEUL-AU-BAC,,,59023,,,,,,,,,,,,,,,,,,,2017-02-01,A,,,,CHEZ JO,56.10C,NAFRev2,N,3.158921,50.257992,0.74,housenumber,1bis Route Nationale 59265 Aubencheul-au-Bac,59023_0120_00001_bis,G,1BIS ROUTE NATIONALE,
438199275,00019,43819927500019,O,2001-04-01,NN,,,2020-05-05T03:54:56,true,7,,2,,RUE,DES SOURCES,59265,AUBENCHEUL-AU-BAC,,,59023,,,,,,,,,,,,,,,,,,,2020-05-02,A,,,,,46.18Z,NAFRev2,O,3.166818,50.254759,0.94,housenumber,2 Rue des Sources 59265 Aubencheul-au-Bac,59023_0184_00002,G,2 RUE DES SOURCES,
438322489,00016,43832248900016,O,2001-07-01,NN,,,2022-03-18T14:53:22,false,5,,475,,RUE,NEUVE,59265,AUBENCHEUL-AU-BAC,,,59023,,,,,,,,,,,,,,,,,,,2022-02-24,F,,,,,45.20A,NAFRev2,O,3.163954,50.254163,0.94,housenumber,475 Rue Neuve 59265 Aubencheul-au-Bac,59023_0140_00475,G,475 RUE NEUVE,
438322489,00032,43832248900032,O,2022-02-24,,,,2022-03-18T14:53:22,false,1,,24,,RTE,NATIONALE,59265,AUBENCHEUL-AU-BAC,,,59023,,,,,,,,,,,,,,,,,,,2022-02-24,A,,,,,45.20A,NAFRev2,N,3.161279,50.254934,0.84,housenumber,24 Route Nationale 59265 Aubencheul-au-Bac,59023_0120_00024,G,24 ROUTE NATIONALE,
441513694,00030,44151369400030,O,2007-10-01,NN,,8121ZZ,2019-11-14T14:00:47,false,2,,2,B,,IMPASSE JACQUES BREL,59265,AUBENCHEUL-AU-BAC,,,59023,,,,,,,,,,,,,,,,,,,2015-03-31,F,,,,,81.21Z,NAFRev2,O,3.161078,50.253472,0.86,housenumber,2bis Impasse Jacques Brel 59265 Aubencheul-au-Bac,59023_0101_00002_bis,G,2BIS IMPASSE JACQUES BREL,
441513694,00048,44151369400048,O,2007-10-01,01,2019,,2021-10-27T08:21:45,true,2,,2,T,,IMPASSE JACQUES BREL,59265,AUBENCHEUL-AU-BAC,,,59023,,,,,,,,,,,,,,,,,,,2012-12-31,A,,,,,43.34Z,NAFRev2,O,3.161176,50.253495,0.94,street,Impasse Jacques Brel 59265 Aubencheul-au-Bac,59023_0101,G,IMPASSE JACQUES BREL,
444329478,00390,44432947800390,O,2007-02-01,03,2019,,2021-10-27T08:25:20,false,5,,35,B,RTE,NATIONALE,59265,AUBENCHEUL-AU-BAC,,,59023,,,,,,,,,,,,,,,,,,,2020-03-03,F,ALDI MARCHE,,,,47.11D,NAFRev2,O,3.162017,50.254252,0.84,interpolation,35 Route Nationale 59265 Aubencheul-au-Bac,,G,33 ROUTE NATIONALE,
444329478,01257,44432947801257,O,2020-03-04,,,,2020-02-11T11:07:45,false,1,,38,,RTE,NATIONALE,59265,AUBENCHEUL-AU-BAC,,,59023,,,,,,,,,,,,,,,,,,,2020-03-04,A,ALDI MARCHE,,,,47.11D,NAFRev2,O,3.159921,50.256557,0.84,housenumber,38 Route Nationale 59265 Aubencheul-au-Bac,59023_0120_00038,G,38 ROUTE NATIONALE,
444958656,00019,44495865600019,O,2002-12-31,NN,,,2019-11-14T14:00:47,false,5,,1,,RTE,NATIONALE,59265,AUBENCHEUL-AU-BAC,,,59023,,,,,,,,,,,,,,,,,,,2008-01-01,A,,,,,68.20B,NAFRev2,N,3.158921,50.257992,0.84,housenumber,1 Route Nationale 59265 Aubencheul-au-Bac,59023_0120_00001,G,1 ROUTE NATIONALE,
450467022,00015,45046702200015,O,2003-10-20,NN,,,2019-11-14T14:00:47,true,3,,6,,RUE,DE FRESSIES,59265,AUBENCHEUL-AU-BAC,,,59023,,,,,,,,,,,,,,,,,,,2008-01-01,A,,,,,68.20A,NAFRev2,N,3.162878,50.255564,0.95,housenumber,6 Rue de Fressies 59265 Aubencheul-au-Bac,59023_0080_00006,G,6 RUE DE FRESSIES,
451729560,00016,45172956000016,O,2004-01-01,NN,,,2019-11-14T14:00:47,true,5,,29,,RTE,NATIONALE,59265,AUBENCHEUL-AU-BAC,,,59023,,,,,,,,,,,,,,,,,,,2009-12-31,F,,,,,47.79Z,NAFRev2,O,3.161616,50.256263,0.84,housenumber,29 Route Nationale 59265 Aubencheul-au-Bac,59023_0120_00029,G,29 ROUTE NATIONALE,
453397739,00013,45339773900013,O,2004-05-03,NN,,,2019-11-14T14:00:47,true,3,,2,B,RUE,DE FRESSIES,59265,AUBENCHEUL-AU-BAC,,,59023,,,,,,,,,,,,,,,,,,,2008-01-01,A,,,,,41.20A,NAFRev2,O,3.161314,50.256428,0.95,housenumber,2b Rue de Fressies 59265 Aubencheul-au-Bac,59023_0080_00002_b,G,2B RUE DE FRESSIES,
481582120,00012,48158212000012,O,2005-01-01,,,,2019-11-14T14:00:47,true,2,,475,,RUE,NEUVE,59265,AUBENCHEUL-AU-BAC,,,59023,,,,,,,,,,,,,,,,,,,2008-01-01,A,,,,,68.20B,NAFRev2,N,3.163954,50.254163,0.94,housenumber,475 Rue Neuve 59265 Aubencheul-au-Bac,59023_0140_00475,G,475 RUE NEUVE,