siren,nic,siret,statutDiffusionEtablissement,dateCreationEtablissement,trancheEffectifsEtablissement,anneeEffectifsEtablissement,activitePrincipaleRegistreMetiersEtablissement,dateDernierTraitementEtablissement,etablissementSiege,nombrePeriodesEtablissement,complementAdresseEtablissement,numeroVoieEtablissement,indiceRepetitionEtablissement,typeVoieEtablissement,libelleVoieEtablissement,codePostalEtablissement,libelleCommuneEtablissement,libelleCommuneEtrangerEtablissement,distributionSpecialeEtablissement,codeCommuneEtablissement,codeCedexEtablissement,libelleCedexEtablissement,codePaysEtrangerEtablissement,libellePaysEtrangerEtablissement,complementAdresse2Etablissement,numeroVoie2Etablissement,indiceRepetition2Etablissement,typeVoie2Etablissement,libelleVoie2Etablissement,codePostal2Etablissement,libelleCommune2Etablissement,libelleCommuneEtranger2Etablissement,distributionSpeciale2Etablissement,codeCommune2Etablissement,codeCedex2Etablissement,libelleCedex2Etablissement,codePaysEtranger2Etablissement,libellePaysEtranger2Etablissement,dateDebut,etatAdministratifEtablissement,enseigne1Etablissement,enseigne2Etablissement,enseigne3Etablissement,denominationUsuelleEtablissement,activitePrincipaleEtablissement,nomenclatureActivitePrincipaleEtablissement,caractereEmployeurEtablissement,longitude,latitude,geo_score,geo_type,geo_adresse,geo_id,geo_ligne,geo_l4,geo_l5
215906124,00015,21590612400015,O,1983-03-01,03,2019,,2021-10-27T08:09:19,true,4,,,,PL,CARLIER,59730,VERTAIN,,,59612,,,,,,,,,,,,,,,,,,,2008-01-01,A,MAIRIE,,,,84.11Z,NAFRev2,O,3.524461,50.212433,0.76,street,Place Irenée Carlier 59730 Vertain,59612_0120,G,PLACE IRENEE CARLIER,
215906124,00023,21590612400023,O,1983-12-21,01,2019,,2021-10-27T08:09:19,false,3,,198,,RUE,DU CALVAIRE,59730,VERTAIN,,,59612,,,,,,,,,,,,,,,,,,,2008-01-01,A,ECOLE PRIMAIRE PUBLIQUE,,,,85.20Z,NAFRev2,N,3.526307,50.214369,0.95,housenumber,198 Rue du Calvaire 59730 Vertain,59612_0040_00198,G,198 RUE DU CALVAIRE,
215906124,00031,21590612400031,O,1995-03-09,NN,,,2013-10-05T12:12:24,false,4,MAIRIE,,,PL,CARLIER,59730,VERTAIN,,,59612,,,,,,,,,,,,,,,,,,,2012-12-25,F,SERVICE D'EAU ET D'ASSAINISSEMENT,,,,36.00Z,NAFRev2,N,3.524461,50.212433,0.76,street,Place Irenée Carlier 59730 Vertain,59612_0120,G,PLACE IRENEE CARLIER,
255901308,00015,25590130800015,O,,NN,,,,true,1,,,,,GRAND PLACE,59730,VERTAIN,,,59612,,,,,,,,,,,,,,,,,,,,F,,,,,06.01,NAP,N,3.524461,50.212433,0.47,street,Place Irenée Carlier 59730 Vertain,59612_0120,G,PLACE IRENEE CARLIER,
265906123,00012,26590612300012,O,1983-03-01,NN,,,2020-11-27T14:47:19,true,5,MAIRIE,,,PL,CARLIER,59730,VERTAIN,,,59612,,,,,,,,,,,,,,,,,,,2019-01-01,F,,,,,88.99B,NAFRev2,N,3.524461,50.212433,0.76,street,Place Irenée Carlier 59730 Vertain,59612_0120,G,PLACE IRENEE CARLIER,
295901581,00013,29590158100013,O,1986-05-09,NN,,,2017-07-13T14:27:53,true,4,MAIRIE,1,,PL,CARLIER,59730,VERTAIN,,,59612,,,,,,,,,,,,,,,,,,,2016-12-25,F,,,,,42.99Z,NAFRev2,N,3.524552,50.212039,0.79,housenumber,1 Place Irenée Carlier 59730 Vertain,59612_0120_00001,G,1 PLACE IRENEE CARLIER,
295902837,00018,29590283700018,O,1992-12-31,NN,,,2014-06-13T23:49:13,false,5,MAIRIE,1,,PL,IRENEE CARLIER,59730,VERTAIN,,,59612,,,,,,,,,,,,,,,,,,,2012-09-29,F,,,,,42.99Z,NAFRev2,N,3.524552,50.212039,0.85,housenumber,1 Place Irenée Carlier 59730 Vertain,59612_0120_00001,G,1 PLACE IRENEE CARLIER,
300978939,00027,30097893900027,O,,NN,,,,true,1,,64,,RUE,PAUL PAVOT,59730,VERTAIN,,,59612,,,,,,,,,,,,,,,,,,,1988-03-31,F,,,,,77.10,NAP,N,3.528078,50.214909,0.95,housenumber,64 Rue Paul Pavot 59730 Vertain,59612_0180_00064,G,64 RUE PAUL PAVOT,
303799191,00018,30379919100018,O,,,,,,true,1,,,,PL,CARLIER,59730,VERTAIN,,,59612,,,,,,,,,,,,,,,,,,,1985-12-25,F,,,,,67.07,NAP,N,3.524461,50.212433,0.76,street,Place Irenée Carlier 59730 Vertain,59612_0120,G,PLACE IRENEE CARLIER,
313946584,00015,31394658400015,O,1900-01-01,,,,2007-01-18T09:13:23,true,2,,,,RUE,DU MARAIS FERME DU MOULIN,59730,VERTAIN,,,59612,,,,,,,,,,,,,,,,,,,1993-12-25,F,,,,,01.3Z,NAF1993,N,3.523908,50.210379,0.58,street,Rue du Marais 59730 Vertain,59612_0160,G,RUE DU MARAIS,
316739341,00022,31673934100022,O,1982-11-09,NN,,,,true,3,,,,PL,CARLIER,59730,VERTAIN,,,59612,,,,,,,,,,,,,,,,,,,2002-12-31,F,,,,,91.3A,NAF1993,N,3.524461,50.212433,0.76,street,Place Irenée Carlier 59730 Vertain,59612_0120,G,PLACE IRENEE CARLIER,
317230076,00018,31723007600018,O,,,,,,true,1,,,,RUE,DE SOLESMES,59730,VERTAIN,,,59612,,,,,,,,,,,,,,,,,,,1985-12-25,F,,,,,67.04,NAP,N,3.52481,50.210537,0.43,street,Rue des Anciens Combattants 59730 Vertain,59612_0010,G,RUE DES ANCIENS COMBATTANTS,
317917912,00022,31791791200022,O,1984-01-01,NN,,,2018-05-31T11:11:17,true,4,,,,RUE,PAUL PAVOT,59730,VERTAIN,,,59612,,,,,,,,,,,,,,,,,,,2018-10-01,F,,,,,86.90D,NAFRev2,N,3.529283,50.210872,0.95,street,Rue Paul Pavot 59730 Vertain,59612_0180,G,RUE PAUL PAVOT,
318209178,00017,31820917800017,O,1980-01-01,NN,,,2008-01-04T20:58:44,true,3,,,,RUE,DE SOLESMES,59730,VERTAIN,,,59612,,,,,,,,,,,,,,,,,,,2008-01-01,A,,,,,68.20B,NAFRev2,N,3.52481,50.210537,0.43,street,Rue des Anciens Combattants 59730 Vertain,59612_0010,G,RUE DES ANCIENS COMBATTANTS,
320644099,00014,32064409900014,O,,,,,,true,1,,2,,RUE,DE LA CHASSE,59730,VERTAIN,,,59612,,,,,,,,,,,,,,,,,,,1985-12-25,F,,,,,64.43,NAP,N,3.52673,50.210969,0.86,street,Rue de la Chasse 59730 Vertain,59612_0080,G,RUE DE LA CHASSE,
321927113,00027,32192711300027,O,1985-10-25,NN,,,2018-09-29T12:19:29,true,5,,,,RUE,BAUDRY,59730,VERTAIN,,,59612,,,,,,,,,,,,,,,,,,,2017-12-31,F,,,,,86.21Z,NAFRev2,O,3.523591,50.214244,0.95,street,Rue Baudry 59730 Vertain,59612_0020,G,RUE BAUDRY,
322721572,00012,32272157200012,O,,NN,,,,true,1,,,,RUE,PAUL PAVOT,59730,VERTAIN,,,59612,,,,,,,,,,,,,,,,,,,,F,,,,,66.02,NAP,N,3.529283,50.210872,0.95,street,Rue Paul Pavot 59730 Vertain,59612_0180,G,RUE PAUL PAVOT,
322814427,00017,32281442700017,O,1981-08-14,NN,,,2008-01-04T18:39:27,true,3,,,,RUE,PONCHAUX,59730,VERTAIN,,,59612,,,,,,,,,,,,,,,,,,,2008-01-01,A,,,,,90.04Z,NAFRev2,N,3.521234,50.211777,0.95,street,Rue Ponchaux 59730 Vertain,59612_0200,G,RUE PONCHAUX,
326249398,00032,32624939800032,O,1997-09-01,NN,,,,true,1,,172,,RUE,BAUDRY,59730,VERTAIN,,,59612,,,,,,,,,,,,,,,,,,,2001-08-30,F,,,,,52.6E,NAF1993,N,3.523493,50.214579,0.95,housenumber,172 Rue Baudry 59730 Vertain,59612_0020_00172,G,172 RUE BAUDRY,
326883816,00026,32688381600026,O,,NN,,,,true,1,,231,,RUE,PONCHEAUX,59730,VERTAIN,,,59612,,,,,,,,,,,,,,,,,,,1992-12-25,F,,,,,51.1T,NAF1993,N,3.521234,50.211777,0.62,street,Rue Ponchaux 59730 Vertain,59612_0200,G,RUE PONCHAUX,
330638123,00019,33063812300019,O,1984-10-01,NN,,,,false,4,,,,PL,CARLIER,59730,VERTAIN,,,59612,,,,,,,,,,,,,,,,,,,1996-12-25,F,CAFE DE LA PLACE,,,,55.3A,NAF1993,O,3.524461,50.212433,0.76,street,Place Irenée Carlier 59730 Vertain,59612_0120,G,PLACE IRENEE CARLIER,
330638123,00027,33063812300027,O,1996-05-01,01,2019,,2021-10-27T08:28:02,true,8,,117,,PL,CARLIER,59730,VERTAIN,,,59612,,,,,,,,,,,,,,,,,,,2011-10-13,A,,,,,56.30Z,NAFRev2,O,3.524197,50.21281,0.81,housenumber,117 Place Irenée Carlier 59730 Vertain,59612_0120_00117,G,117 PLACE IRENEE CARLIER,
331286567,00010,33128656700010,O,,NN,,,,true,1,,,,RUE,PHILIPPE DE RUBEMPRE,59730,VERTAIN,,,59612,,,,,,,,,,,,,,,,,,,1987-05-31,F,,,,,67.04,NAP,N,3.521761,50.210926,0.95,street,Rue Philippe de Rubempré 59730 Vertain,59612_0190,G,RUE PHILIPPE DE RUBEMPRE,
331438473,00018,33143847300018,O,,NN,,,,true,1,,,,RUE,PAUL PAVOT,59730,VERTAIN,,,59612,,,,,,,,,,,,,,,,,,,,F,,,,,64.12,NAP,N,3.529283,50.210872,0.95,street,Rue Paul Pavot 59730 Vertain,59612_0180,G,RUE PAUL PAVOT,
332664135,00016,33266413500016,O,1985-05-02,NN,,,,true,3,,1609,,RUE,PAUL PAVOT,59730,VERTAIN,,,59612,,,,,,,,,,,,,,,,,,,1991-12-25,F,,,,,54.10,NAP,N,3.529283,50.210872,0.74,street,Rue Paul Pavot 59730 Vertain,59612_0180,G,RUE PAUL PAVOT,
333285591,00017,33328559100017,O,1985-07-17,NN,,,,true,3,,230,,RUE,PONCHAUX,59730,VERTAIN,,,59612,,,,,,,,,,,,,,,,,,,1996-12-25,F,,,,,55.5D,NAF1993,O,3.521234,50.211777,0.95,housenumber,230 Rue Ponchaux 59730 Vertain,59612_0200_00230,G,230 RUE PONCHAUX,
333833747,00012,33383374700012,O,1985-10-01,NN,,,2009-05-31T05:17:36,true,3,,,,RUE,DE LA CHASSE,59730,VERTAIN,,,59612,,,,,,,,,,,,,,,,,,,2008-01-01,A,,,,,68.20B,NAFRev2,N,3.52673,50.210969,0.94,street,Rue de la Chasse 59730 Vertain,59612_0080,G,RUE DE LA CHASSE,
333891174,00018,33389117400018,O,,NN,,,,true,1,,32,,RUE,DE LA CHASSE,59730,VERTAIN,,,59612,,,,,,,,,,,,,,,,,,,1990-09-04,F,,,,,86.06,NAP,N,3.525782,50.210617,0.94,housenumber,32 Rue de la Chasse 59730 Vertain,59612_0080_00032,G,32 RUE DE LA CHASSE,
337977813,00019,33797781300019,O,,NN,,,,true,1,,,,RUE,PAUL PAVOT,59730,VERTAIN,,,59612,,,,,,,,,,,,,,,,,,,1987-11-14,F,,,,,64.42,NAP,N,3.529283,50.210872,0.95,street,Rue Paul Pavot 59730 Vertain,59612_0180,G,RUE PAUL PAVOT,
341513950,00012,34151395000012,O,,NN,,,,true,1,,72,,RUE,PHILIPPE DE RUBEMPRE,59730,VERTAIN,,,59612,,,,,,,,,,,,,,,,,,,1992-10-30,F,,,,,55.4B,NAF1993,N,3.523207,50.211418,0.95,housenumber,72 Rue Philippe de Rubempré 59730 Vertain,59612_0190_00072,G,72 RUE PHILIPPE DE RUBEMPRE,
343167755,00010,34316775500010,O,,NN,,,,true,1,,531,,RUE,PAUL PAVOT,59730,VERTAIN,,,59612,,,,,,,,,,,,,,,,,,,1988-01-15,F,,,,,55.60,NAP,N,3.529283,50.210872,0.95,housenumber,531 Rue Paul Pavot 59730 Vertain,59612_0180_00531,G,531 RUE PAUL PAVOT,
343167813,00017,34316781300017,O,,NN,,,,true,1,,531,,RUE,PAUL PAVOT,59730,VERTAIN,,,59612,,,,,,,,,,,,,,,,,,,1988-01-15,F,,,,,55.60,NAP,N,3.529283,50.210872,0.95,housenumber,531 Rue Paul Pavot 59730 Vertain,59612_0180_00531,G,531 RUE PAUL PAVOT,
347692204,00048,34769220400048,O,2011-01-09,,,,2012-04-08T05:50:24,true,2,,591,,RUE,PAUL PAVOT,59730,VERTAIN,,,59612,,,,,,,,,,,,,,,,,,,2011-12-31,F,,,,,86.21Z,NAFRev2,N,3.529207,50.210317,0.95,housenumber,591 Rue Paul Pavot 59730 Vertain,59612_0180_00591,G,591 RUE PAUL PAVOT,
349175299,00016,34917529900016,O,,,,,,true,1,,,,RUE,PAUL PAVOT,59730,VERTAIN,,,59612,,,,,,,,,,,,,,,,,,,1989-03-31,F,,,,,59.03,NAP,N,3.529283,50.210872,0.95,street,Rue Paul Pavot 59730 Vertain,59612_0180,G,RUE PAUL PAVOT,
350101887,00015,35010188700015,O,1989-03-24,,,,,true,1,,14,,RUE,PAUL PAVOT,59730,VERTAIN,,,59612,,,,,,,,,,,,,,,,,,,1997-01-10,F,,,,,01.2A,NAF1993,N,3.527823,50.215309,0.95,housenumber,14 Rue Paul Pavot 59730 Vertain,59612_0180_00014,G,14 RUE PAUL PAVOT,
353625585,00016,35362558500016,O,1990-02-01,NN,,,2020-08-25T10:13:44,true,4,LD FERME DU MOULIN,126,,RUE,DU MARAIS,59730,VERTAIN,,,59612,,,,,,,,,,,,,,,,,,,2015-12-31,A,,,,,01.11Z,NAFRev2,O,3.5238,50.209974,0.94,housenumber,126 Rue du Marais 59730 Vertain,59612_0160_00126,G,126 RUE DU MARAIS,
353662190,00027,35366219000027,O,1992-04-30,NN,,,,false,4,,192,,RUE,DE RUBEMPRE,59730,VERTAIN,,,59612,,,,,,,,,,,,,,,,,,,1996-10-01,F,,,,,51.5F,NAF1993,O,3.521761,50.210926,0.93,housenumber,192 Rue Philippe de Rubempré 59730 Vertain,59612_0190_00192,G,192 RUE PHILIPPE DE RUBEMPRE,
381507953,00010,38150795300010,O,1991-04-04,01,2019,4332AA,2021-10-27T08:09:39,true,5,,330,,RUE,PONCHAUX,59730,VERTAIN,,,59612,,,,,,,,,,,,,,,,,,,2010-12-31,A,,,,,43.32A,NAFRev2,O,3.520092,50.211337,0.95,housenumber,330 Rue Ponchaux 59730 Vertain,59612_0200_00330,G,330 RUE PONCHAUX,
385027172,00019,38502717200019,O,1992-04-07,NN,,,,true,4,,32,,RUE,DE LA CHASSE,59730,VERTAIN,,,59612,,,,,,,,,,,,,,,,,,,1995-12-25,F,,,,,67.1E,NAF1993,N,3.525782,50.210617,0.94,housenumber,32 Rue de la Chasse 59730 Vertain,59612_0080_00032,G,32 RUE DE LA CHASSE,
385370390,00010,38537039000010,O,1992-05-11,NN,,,,true,4,,32,,RUE,DE LA CHASSE,59730,VERTAIN,,,59612,,,,,,,,,,,,,,,,,,,1994-12-25,F,,,,,67.1C,NAF1993,N,3.525782,50.210617,0.94,housenumber,32 Rue de la Chasse 59730 Vertain,59612_0080_00032,G,32 RUE DE LA CHASSE,
385370515,00012,38537051500012,O,1992-05-11,NN,,,,true,3,,32,,RUE,DE LA CHASSE,59730,VERTAIN,,,59612,,,,,,,,,,,,,,,,,,,1994-12-25,F,,,,,72.2Z,NAF1993,N,3.525782,50.210617,0.94,housenumber,32 Rue de la Chasse 59730 Vertain,59612_0080_00032,G,32 RUE DE LA CHASSE,
388513855,00014,38851385500014,O,1992-07-01,NN,,,,true,4,,32,,RUE,DE LA CHASSE,59730,VERTAIN,,,59612,,,,,,,,,,,,,,,,,,,1998-01-13,F,,,,,51.1A,NAF1993,N,3.525782,50.210617,0.94,housenumber,32 Rue de la Chasse 59730 Vertain,59612_0080_00032,G,32 RUE DE LA CHASSE,
389858358,00010,38985835800010,O,,NN,,,,true,1,,72,,RUE,PHILIPPE DE RUBEMPRE,59730,VERTAIN,,,59612,,,,,,,,,,,,,,,,,,,1994-06-30,F,,,,,55.4B,NAF1993,N,3.523207,50.211418,0.95,housenumber,72 Rue Philippe de Rubempré 59730 Vertain,59612_0190_00072,G,72 RUE PHILIPPE DE RUBEMPRE,
390881654,00011,39088165400011,O,1987-01-01,NN,,,2019-01-23T15:08:55,true,4,,82,,RUE,BAUDRY,59730,VERTAIN,,,59612,,,,,,,,,,,,,,,,,,,2018-10-31,F,,,,,01.11Z,NAFRev2,N,3.523896,50.213828,0.95,housenumber,82 Rue Baudry 59730 Vertain,59612_0020_00082,G,82 RUE BAUDRY,
393012075,00015,39301207500015,O,1993-10-15,01,2019,,2021-10-27T08:20:57,true,5,,,,RUE,DE LA CHASSE,59730,VERTAIN,,,59612,,,,,,,,,,,,,,,,,,,2008-01-30,A,,,,,85.51Z,NAFRev2,O,3.52673,50.210969,0.94,street,Rue de la Chasse 59730 Vertain,59612_0080,G,RUE DE LA CHASSE,
393897798,00012,39389779800012,O,1994-01-02,NN,,,2017-05-04T04:08:17,false,6,,194,,RUE,DE LA CHASSE,59730,VERTAIN,,,59612,,,,,,,,,,,,,,,,,,,2011-08-22,A,,,,,25.50B,NAFRev2,N,3.527325,50.210911,0.94,housenumber,194 Rue de la Chasse 59730 Vertain,59612_0080_00194,G,194 RUE DE LA CHASSE,
394919484,00037,39491948400037,O,2019-05-15,,,1105ZZ,2021-02-23T11:20:41,true,1,,656,,RUE,PAUL PAVOT,59730,VERTAIN,,,59612,,,,,,,,,,,,,,,,,,,2019-05-15,A,,,,,11.05Z,NAFRev2,N,3.528855,50.20979,0.95,housenumber,656 Rue Paul Pavot 59730 Vertain,59612_0180_00656,G,656 RUE PAUL PAVOT,
394939771,00017,39493977100017,O,1980-10-31,NN,,,,true,1,,42,,RUE,PONCHAUX,59730,VERTAIN,,,59612,,,,,,,,,,,,,,,,,,,2000-04-30,F,,,,,01.1A,NAF1993,N,3.523584,50.212475,0.95,housenumber,42 Rue Ponchaux 59730 Vertain,59612_0200_00042,G,42 RUE PONCHAUX,
394956346,00016,39495634600016,O,1963-10-01,NN,,,2008-01-04T18:17:12,true,3,,191,,RUE,DU CALVAIRE,59730,VERTAIN,,,59612,,,,,,,,,,,,,,,,,,,2008-01-01,A,,,,,01.11Z,NAFRev2,N,3.526018,50.214292,0.95,housenumber,191 Rue du Calvaire 59730 Vertain,59612_0040_00191,G,191 RUE DU CALVAIRE,
395043789,00019,39504378900019,O,2008-07-01,NN,,,2008-09-10T09:22:25,true,4,,132,,,GRAND PLACE,59730,VERTAIN,,,59612,,,,,,,,,,,,,,,,,,,2008-07-31,A,,,,,01.11Z,NAFRev2,N,3.524347,50.212934,0.53,housenumber,132 Place Irenée Carlier 59730 Vertain,59612_0120_00132,G,132 PLACE IRENEE CARLIER,
397796608,00024,39779660800024,O,1997-10-01,NN,,,2006-11-25T12:30:42,false,3,,160,,RUE,DES ANCIENS COMBATTANTS,59730,VERTAIN,,,59612,,,,,,,,,,,,,,,,,,,2004-01-01,F,GEDELEC,,,,74.2C,NAFRev1,O,3.52504,50.210145,0.95,housenumber,160 Rue des Anciens Combattants 59730 Vertain,59612_0010_00160,G,160 RUE DES ANCIENS COMBATTANTS,
400568424,00016,40056842400016,O,1995-04-01,NN,,,2018-06-13T04:27:56,true,4,,72,,RUE,PHILIPPE RUBEMPRE,59730,VERTAIN,,,59612,,,,,,,,,,,,,,,,,,,2018-01-31,F,,,,,68.20B,NAFRev2,N,3.523207,50.211418,0.94,housenumber,72 Rue Philippe de Rubempré 59730 Vertain,59612_0190_00072,G,72 RUE PHILIPPE DE RUBEMPRE,
408426385,00014,40842638500014,O,1995-12-25,NN,,,2021-10-26T08:55:06,true,3,,32,,RUE,DE LA CHASSE,59730,VERTAIN,,,59612,,,,,,,,,,,,,,,,,,,2021-10-04,F,,,,,68.20B,NAFRev2,N,3.525782,50.210617,0.94,housenumber,32 Rue de la Chasse 59730 Vertain,59612_0080_00032,G,32 RUE DE LA CHASSE,
409255429,00022,40925542900022,O,2014-04-01,,,,2016-02-02T09:13:25,false,1,,895,,RUE,PAUL PAVOT,59730,VERTAIN,,,59612,,,,,,,,,,,,,,,,,,,2014-04-01,F,,,,,88.10A,NAFRev2,N,3.528772,50.207591,0.95,housenumber,895 Rue Paul Pavot 59730 Vertain,59612_0180_00895,G,895 RUE PAUL PAVOT,
409310349,00017,40931034900017,O,1996-01-01,NN,,,2008-01-04T21:24:57,true,3,,765,,RUE,PAUL PAVOT,59730,VERTAIN,,,59612,,,,,,,,,,,,,,,,,,,2008-01-01,A,,,,,01.46Z,NAFRev2,N,3.528725,50.20871,0.95,housenumber,765 Rue Paul Pavot 59730 Vertain,59612_0180_00765,G,765 RUE PAUL PAVOT,
410728885,00014,41072888500014,O,1997-01-10,NN,,,2019-06-24T13:29:06,true,3,,14,,RUE,PAUL PAVOT,59730,VERTAIN,,,59612,,,,,,,,,,,,,,,,,,,2008-01-01,A,,,,,01.11Z,NAFRev2,N,3.527823,50.215309,0.95,housenumber,14 Rue Paul Pavot 59730 Vertain,59612_0180_00014,G,14 RUE PAUL PAVOT,
413721457,00013,41372145700013,O,1961-12-01,NN,,,2006-10-28T04:11:55,true,3,,14,,RUE,PAUL PAVOT,59730,VERTAIN,,,59612,,,,,,,,,,,,,,,,,,,2005-12-25,F,,,,,01.1A,NAFRev1,N,3.527823,50.215309,0.95,housenumber,14 Rue Paul Pavot 59730 Vertain,59612_0180_00014,G,14 RUE PAUL PAVOT,
413931569,00037,41393156900037,O,2021-05-01,,,,2021-11-25T03:43:24,false,1,,210,,RUE,PAUL PAVOT,59730,VERTAIN,,,59612,,,,,,,,,,,,,,,,,,,2021-05-01,A,,,,,55.20Z,NAFRev2,N,3.528718,50.213736,0.95,housenumber,210 Rue Paul Pavot 59730 Vertain,59612_0180_00210,G,210 RUE PAUL PAVOT,
418418273,00011,41841827300011,O,1998-04-15,NN,,,2021-01-14T15:55:05,false,5,CHEZ MR TRIFI JEAN-JACQUES,173,,RUE,DE BAUDRY,59730,VERTAIN,,,59612,,,,,,,,,,,,,,,,,,,2020-11-30,F,,,,,47.59A,NAFRev2,N,3.523591,50.214244,0.63,street,Rue Baudry 59730 Vertain,59612_0020,G,RUE BAUDRY,
418453577,00011,41845357700011,O,1998-04-06,NN,,,2019-07-16T03:47:32,true,3,,172,,RUE,DE BAUDRY,59730,VERTAIN,,,59612,,,,,,,,,,,,,,,,,,,2008-01-01,A,,,,,68.20B,NAFRev2,N,3.523493,50.214579,0.81,housenumber,172 Rue Baudry 59730 Vertain,59612_0020_00172,G,172 RUE BAUDRY,
428320998,00019,42832099800019,O,1995-01-01,NN,,,2008-01-05T01:25:35,true,3,,,,,,59730,VERTAIN,,,59612,,,,,,,,,,,,,,,,,,,2008-01-01,A,,,,,01.43Z,NAFRev2,N,,,0,,,,,,
430744847,00012,43074484700012,O,1994-01-01,NN,,,2008-01-05T01:55:53,true,3,,120,,RUE,PONCHAUX,59730,VERTAIN,,,59612,,,,,,,,,,,,,,,,,,,2008-01-01,A,,,,,68.20B,NAFRev2,N,3.522603,50.212271,0.95,housenumber,120 Rue Ponchaux 59730 Vertain,59612_0200_00120,G,120 RUE PONCHAUX,
431650936,00013,43165093600013,O,2000-05-01,NN,,,2008-01-04T18:15:19,true,3,,70,,RUE,PONCHAUX,59730,VERTAIN,,,59612,,,,,,,,,,,,,,,,,,,2008-01-01,A,,,,,01.11Z,NAFRev2,N,3.523289,50.212431,0.95,housenumber,70 Rue Ponchaux 59730 Vertain,59612_0200_00070,G,70 RUE PONCHAUX,
432734457,00018,43273445700018,O,2000-08-18,NN,,,2020-01-01T03:50:08,true,3,,110,,RUE,DE CALVAIRE,59730,VERTAIN,,,59612,,,,,,,,,,,,,,,,,,,2008-01-01,A,,,,,68.20B,NAFRev2,N,3.525374,50.213713,0.81,housenumber,110 Rue du Calvaire 59730 Vertain,59612_0040_00110,G,110 RUE DU CALVAIRE,
433259892,00019,43325989200019,O,2000-10-17,NN,,,2008-01-05T20:57:17,true,3,,172,,RUE,BAUDRY,59730,VERTAIN,,,59612,,,,,,,,,,,,,,,,,,,2008-01-01,A,,,,,68.20B,NAFRev2,N,3.523493,50.214579,0.95,housenumber,172 Rue Baudry 59730 Vertain,59612_0020_00172,G,172 RUE BAUDRY,
435243738,00018,43524373800018,O,2001-03-15,NN,,,2022-02-15T03:39:55,true,4,,279,,RUE,DE BAUDRY,59730,VERTAIN,,,59612,,,,,,,,,,,,,,,,,,,2021-11-02,F,,,,,68.20A,NAFRev2,N,3.523064,50.21542,0.81,housenumber,279 Rue Baudry 59730 Vertain,59612_0020_00279,G,279 RUE BAUDRY,
440498608,00023,44049860800023,O,2001-11-01,NN,,,,false,4,JEROME LEVEQUE,58,,RUE,DES ANC COMBATTANTS,59730,VERTAIN,,,59612,,,,,,,,,,,,,,,,,,,2002-03-31,F,,,,,45.4C,NAF1993,N,3.524316,50.211135,0.88,housenumber,58 Rue des Anciens Combattants 59730 Vertain,59612_0010_00058,G,58 RUE DES ANCIENS COMBATTANTS,
440830784,00011,44083078400011,O,2002-02-15,NN,,,2010-04-18T09:22:52,true,5,RESIDENCE HORTENCE,,,RUE,DU CHEMIN BAUDRY,59730,VERTAIN,,,59612,,,,,,,,,,,,,,,,,,,2008-12-31,A,,,,,46.69B,NAFRev2,N,3.523591,50.214244,0.52,street,Rue Baudry 59730 Vertain,59612_0020,G,RUE BAUDRY,
441321163,00012,44132116300012,O,2002-02-09,,,,2006-11-25T17:50:20,false,3,,240,,RTE,DE BAUDRY,59730,VERTAIN,,,59612,,,,,,,,,,,,,,,,,,,2005-03-15,F,,,,,74.2C,NAFRev1,N,3.523227,50.2151,0.66,housenumber,240 Rue Baudry 59730 Vertain,59612_0020_00240,G,240 RUE BAUDRY,
443985015,00074,44398501500074,O,2009-10-01,NN,,,2021-02-23T13:26:33,true,1,,192,,RUE,PHILIPPE  RUBEMPRE,59730,VERTAIN,,,59612,,,,,,,,,,,,,,,,,,,2009-10-01,A,,,,,70.10Z,NAFRev2,O,3.521761,50.210926,0.94,housenumber,192 Rue Philippe de Rubempré 59730 Vertain,59612_0190_00192,G,192 RUE PHILIPPE DE RUBEMPRE,
452119993,00049,45211999300049,O,2017-10-01,,,,2021-02-23T13:35:51,true,2,,276,,RUE,DU CALVAIRE,59730,VERTAIN,,,59612,,,,,,,,,,,,,,,,,,,2019-02-07,A,,,,,71.11Z,NAFRev2,N,3.526902,50.214862,0.95,housenumber,276 Rue du Calvaire 59730 Vertain,59612_0040_00276,G,276 RUE DU CALVAIRE,
453705402,00031,45370540200031,O,2021-12-11,,,,2022-02-10T11:06:35,true,1,,60,,RUE,BAUDRY,59730,VERTAIN,,,59612,,,,,,,,,,,,,,,,,,,2021-12-11,A,,,,,68.20A,NAFRev2,N,3.523999,50.213645,0.95,housenumber,60 Rue Baudry 59730 Vertain,59612_0020_00060,G,60 RUE BAUDRY,
479495103,00018,47949510300018,O,2004-05-08,NN,,,2008-01-05T04:04:08,true,3,,332,,RUE,PAUL PAVOT,59730,VERTAIN,,,59612,,,,,,,,,,,,,,,,,,,2008-01-01,A,,,,,90.01Z,NAFRev2,N,3.529047,50.212654,0.95,housenumber,332 Rue Paul Pavot 59730 Vertain,59612_0180_00332,G,332 RUE PAUL PAVOT,
479810087,00011,47981008700011,O,2004-11-30,NN,,,2008-01-05T21:43:28,true,3,,330,,RUE,PONCHAUX,59730,VERTAIN,,,59612,,,,,,,,,,,,,,,,,,,2008-01-01,A,,,,,68.20B,NAFRev2,N,3.520092,50.211337,0.95,housenumber,330 Rue Ponchaux 59730 Vertain,59612_0200_00330,G,330 RUE PONCHAUX,
480805175,00019,48080517500019,O,2005-01-18,01,2019,,2021-10-27T08:16:58,true,2,,126,,RUE,DU MARAIS,59730,VERTAIN,,,59612,,,,,,,,,,,,,,,,,,,2008-01-01,A,,,,,01.61Z,NAFRev2,N,3.5238,50.209974,0.94,housenumber,126 Rue du Marais 59730 Vertain,59612_0160_00126,G,126 RUE DU MARAIS,
497485714,00016,49748571400016,O,2007-04-13,,,,2009-02-20T07:54:51,false,3,,81,,RUE,DU MARAIS,59730,VERTAIN,,,59612,,,,,,,,,,,,,,,,,,,2008-07-31,F,,,,,16.23Z,NAFRev2,N,3.523648,50.210631,0.94,housenumber,81 Rue du Marais 59730 Vertain,59612_0160_00081,G,81 RUE DU MARAIS,
498037282,00015,49803728200015,O,2007-05-03,,,,2021-03-16T19:32:28,true,2,,183,,RUE,DE BAUDRY,59730,VERTAIN,,,59612,,,,,,,,,,,,,,,,,,,2008-01-01,A,,,,,68.20B,NAFRev2,N,3.523375,50.214617,0.81,housenumber,183 Rue Baudry 59730 Vertain,59612_0020_00183,G,183 RUE BAUDRY,
499602373,00015,49960237300015,O,2007-06-24,,,,2021-02-23T14:08:19,true,4,,236,,RUE,DU CALVAIRE,59730,VERTAIN,,,59612,,,,,,,,,,,,,,,,,,,2011-03-15,A,,,,,86.90D,NAFRev2,N,3.526524,50.214546,0.95,housenumber,236 Rue du Calvaire 59730 Vertain,59612_0040_00236,G,236 RUE DU CALVAIRE,
499687044,00010,49968704400010,O,2007-09-01,NN,,,2014-07-10T00:56:50,true,4,,433,,RUE,PAUL PAVOT,59730,VERTAIN,,,59612,,,,,,,,,,,,,,,,,,,2009-03-04,F,,,,,25.50A,NAFRev2,O,3.529231,50.211793,0.95,housenumber,433 Rue Paul Pavot 59730 Vertain,59612_0180_00433,G,433 RUE PAUL PAVOT,
504189317,00010,50418931700010,O,2008-05-07,NN,,,2010-04-18T13:35:29,true,3,,220,,RUE,PAUL PAVOT,59730,VERTAIN,,,59612,,,,,,,,,,,,,,,,,,,2008-05-31,A,,,,,68.20B,NAFRev2,N,3.528813,50.213574,0.95,housenumber,220 Rue Paul Pavot 59730 Vertain,59612_0180_00220,G,220 RUE PAUL PAVOT,
504889353,00018,50488935300018,O,2008-06-09,,,,2021-10-22T08:42:36,true,3,,64,,RUE,PAUL PAVOT,59730,VERTAIN,,,59612,,,,,,,,,,,,,,,,,,,2021-10-21,A,,,,BATIMAX,43.33Z,NAFRev2,N,3.528078,50.214909,0.95,housenumber,64 Rue Paul Pavot 59730 Vertain,59612_0180_00064,G,64 RUE PAUL PAVOT,
505258962,00016,50525896200016,O,2008-06-07,,,,2008-07-16T13:59:26,true,1,,1,,PL,IRENEE CARLIER,59730,VERTAIN,,,59612,,,,,,,,,,,,,,,,,,,2008-06-07,A,,,,,94.99Z,NAFRev2,N,3.524552,50.212039,0.85,housenumber,1 Place Irenée Carlier 59730 Vertain,59612_0120_00001,G,1 PLACE IRENEE CARLIER,
509850228,00016,50985022800016,O,2009-01-02,,,,2011-01-31T02:53:38,true,2,,155,,RUE,DES ANCIENS COMBATTANTS,59730,VERTAIN,,,59612,,,,,,,,,,,,,,,,,,,2010-08-01,F,,,,,74.10Z,NAFRev2,N,3.52514,50.210186,0.95,housenumber,155 Rue des Anciens Combattants 59730 Vertain,59612_0010_00155,G,155 RUE DES ANCIENS COMBATTANTS,
517479564,00026,51747956400026,O,2015-03-09,,,,2018-08-02T04:17:06,true,2,,391,,RUE,PAUL PAVOT,59730,VERTAIN,,59730,59612,,,,,,,,,,,,,,,,,,,2018-06-30,F,,,,,62.02A,NAFRev2,N,3.529231,50.212044,0.95,housenumber,391 Rue Paul Pavot 59730 Vertain,59612_0180_00391,G,391 RUE PAUL PAVOT,