siren,nic,siret,statutDiffusionEtablissement,dateCreationEtablissement,trancheEffectifsEtablissement,anneeEffectifsEtablissement,activitePrincipaleRegistreMetiersEtablissement,dateDernierTraitementEtablissement,etablissementSiege,nombrePeriodesEtablissement,complementAdresseEtablissement,numeroVoieEtablissement,indiceRepetitionEtablissement,typeVoieEtablissement,libelleVoieEtablissement,codePostalEtablissement,libelleCommuneEtablissement,libelleCommuneEtrangerEtablissement,distributionSpecialeEtablissement,codeCommuneEtablissement,codeCedexEtablissement,libelleCedexEtablissement,codePaysEtrangerEtablissement,libellePaysEtrangerEtablissement,complementAdresse2Etablissement,numeroVoie2Etablissement,indiceRepetition2Etablissement,typeVoie2Etablissement,libelleVoie2Etablissement,codePostal2Etablissement,libelleCommune2Etablissement,libelleCommuneEtranger2Etablissement,distributionSpeciale2Etablissement,codeCommune2Etablissement,codeCedex2Etablissement,libelleCedex2Etablissement,codePaysEtranger2Etablissement,libellePaysEtranger2Etablissement,dateDebut,etatAdministratifEtablissement,enseigne1Etablissement,enseigne2Etablissement,enseigne3Etablissement,denominationUsuelleEtablissement,activitePrincipaleEtablissement,nomenclatureActivitePrincipaleEtablissement,caractereEmployeurEtablissement,longitude,latitude,geo_score,geo_type,geo_adresse,geo_id,geo_ligne,geo_l4,geo_l5
025771148,00019,02577114800019,O,1957-01-01,NN,,,2012-07-28T09:13:07,true,5,,,,RTE,ST GEORGES,79210,ARCAIS,,,79010,,,,,,,,,,,,,,,,,,,2008-01-01,F,,,,,01.43Z,NAFRev2,N,-0.689453,46.293758,0.7,street,Route de Saint Georges 79210 Arçais,79010_gy3r84,G,ROUTE DE SAINT GEORGES,
026572222,00011,02657222200011,O,,NN,,,,true,1,,,,,,79210,ARCAIS,,,79010,,,,,,,,,,,,,,,,,,,1989-03-15,F,,,,,67.08,NAP,N,,,0,,,,,,
026770172,00018,02677017200018,O,,NN,,9999ZZ,2015-03-17T00:10:34,true,1,,,,RUE,DU MARAIS,79210,ARCAIS,,,79010,,,,,,,,,,,,,,,,,,,1991-10-01,F,,,,,62.43,NAP,N,-0.689902,46.296579,0.95,street,Rue du Marais 79210 Arçais,79010_0220,G,RUE DU MARAIS,
026772269,00010,02677226900010,O,,,,,,true,1,,,,,,79210,ARCAIS,,,79010,,,,,,,,,,,,,,,,,,,1984-12-25,F,,,,,62.11,NAP,N,,,0,,,,,,
026871343,00013,02687134300013,O,,NN,,,,true,1,,,,,,79210,ARCAIS,,,79010,,,,,,,,,,,,,,,,,,,1987-03-31,F,,,,,38.40,NAP,N,,,0,,,,,,
026970608,00027,02697060800027,O,1994-07-01,NN,,,,false,4,,,,RUE,DU MARAIS,79210,ARCAIS,,,79010,,,,,,,,,,,,,,,,,,,1999-09-30,F,LA PIGOUILLE,,,,55.4A,NAF1993,N,-0.689902,46.296579,0.95,street,Rue du Marais 79210 Arçais,79010_0220,G,RUE DU MARAIS,
026970608,00035,02697060800035,O,1997-04-01,,,,2010-11-16T00:10:46,false,4,,,,RTE,DAMVIX,79210,ARCAIS,,,79010,,,,,,,,,,,,,,,,,,,1999-09-30,F,,,,,55.2C,NAF1993,N,-0.694997,46.298769,0.76,street,Route de Damvix 79210 Arçais,79010_0123,G,ROUTE DE DAMVIX,
027170265,00014,02717026500014,O,,,,,,true,1,,,,RUE,DE LA METAIRIE,79210,ARCAIS,,,79010,,,,,,,,,,,,,,,,,,,1992-04-08,F,,,,,51.2E,NAF1993,N,-0.692076,46.29402,0.94,street,Rue de la Métairie 79210 Arçais,79010_0230,G,RUE DE LA METAIRIE,
027370220,00017,02737022000017,O,,NN,,,,true,1,,,,,,79210,ARCAIS,,,79010,,,,,,,,,,,,,,,,,,,1989-03-15,F,,,,,70.01,NAP,N,,,0,,,,,,
027370964,00010,02737096400010,O,2001-03-01,NN,,,2006-11-25T09:04:51,true,4,,,,PL,DU PORT,79210,ARCAIS,,,79010,,,,,,,,,,,,,,,,,,,2004-12-31,F,,,,,61.2Z,NAFRev1,O,-0.690903,46.295875,0.75,street,Venelle du Port de la Planche 79210 Arçais,79010_0290,G,VENELLE DU PORT DE LA PLANCHE,
200021343,00013,20002134300013,O,2009-07-17,NN,,,2019-06-24T13:08:30,true,2,MAIRIE,,,RUE,DE LA MAIRIE,79210,ARCAIS,,,79010,,,,,,,,,,,,,,,,,,,2015-01-01,A,,,,,84.13Z,NAFRev2,O,-0.689667,46.297204,0.94,street,Rue de la Mairie 79210 Arçais,79010_0210,G,RUE DE LA MAIRIE,
217900109,00018,21790010900018,O,1983-03-01,02,2019,,2021-10-27T08:10:45,true,4,,,,RUE,DE LA MAIRIE,79210,ARCAIS,,,79010,,,,,,,,,,,,,,,,,,,2008-01-01,A,MAIRIE,,,,84.11Z,NAFRev2,O,-0.689667,46.297204,0.94,street,Rue de la Mairie 79210 Arçais,79010_0210,G,RUE DE LA MAIRIE,
217900109,00026,21790010900026,O,1983-12-21,01,2019,,2021-10-27T08:10:45,false,4,,,,RUE,DE LA MAIRIE,79210,ARCAIS,,,79010,,,,,,,,,,,,,,,,,,,2008-01-01,A,ECOLE ELEMENTAIRE,,,,85.20Z,NAFRev2,N,-0.689667,46.297204,0.94,street,Rue de la Mairie 79210 Arçais,79010_0210,G,RUE DE LA MAIRIE,
217900109,00034,21790010900034,O,1999-07-15,NN,,,2008-01-04T18:42:49,false,5,,,,RTE,DE DAMVIX,79210,ARCAIS,,,79010,,,,,,,,,,,,,,,,,,,2008-01-01,A,CAMPING MUNICIPAL DE LA TAILLEE,,,,55.30Z,NAFRev2,N,-0.694997,46.298769,0.79,street,Route de Damvix 79210 Arçais,79010_0123,G,ROUTE DE DAMVIX,
217900109,00042,21790010900042,O,1999-11-02,NN,,,2006-10-26T23:41:43,false,3,MAIRIE,,,,,79210,ARCAIS,,,79010,,,,,,,,,,,,,,,,,,,2004-12-25,F,LOTISSEMENT,,,,70.1C,NAFRev1,N,-0.689667,46.297204,0.92,street,Rue de la Mairie 79210 Arçais,79010_0210,D,RUE DE LA MAIRIE,
257901538,00013,25790153800013,O,1990-01-31,NN,,,2017-01-30T14:57:07,true,5,MAIRIE,,,RUE,DE LA MAIRIE,79210,ARCAIS,,,79010,,,,,,,,,,,,,,,,,,,2016-12-31,F,,,,,84.13Z,NAFRev2,N,-0.689667,46.297204,0.94,street,Rue de la Mairie 79210 Arçais,79010_0210,G,RUE DE LA MAIRIE,
257902346,00010,25790234600010,O,2001-09-05,NN,,,2016-04-26T01:31:52,false,4,MAIRIE,,,RUE,DE LA MAIRIE,79210,ARCAIS,,,79010,,,,,,,,,,,,,,,,,,,2014-08-07,F,,,,,84.12Z,NAFRev2,O,-0.689667,46.297204,0.94,street,Rue de la Mairie 79210 Arçais,79010_0210,G,RUE DE LA MAIRIE,
267903540,00016,26790354000016,O,1995-12-25,NN,,,2017-08-06T14:18:26,true,4,MAIRIE,,,RUE,DE LA MAIRIE,79210,ARCAIS,,,79010,,,,,,,,,,,,,,,,,,,2017-08-01,F,,,,,88.99B,NAFRev2,N,-0.689667,46.297204,0.94,street,Rue de la Mairie 79210 Arçais,79010_0210,G,RUE DE LA MAIRIE,
267904878,00019,26790487800019,O,1995-12-25,NN,,,2007-04-12T17:42:51,true,2,MAIRIE,,,RUE,DE LA MAIRIE,79210,ARCAIS,,,79010,,,,,,,,,,,,,,,,,,,2007-04-05,F,CDE,,,,85.3K,NAFRev1,N,-0.689667,46.297204,0.94,street,Rue de la Mairie 79210 Arçais,79010_0210,G,RUE DE LA MAIRIE,
301685913,00016,30168591300016,O,1900-01-01,NN,,,2014-10-15T19:26:16,true,4,,,,,,79210,ARCAIS,,,79010,,,,,,,,,,,,,,,,,,,2014-09-30,F,,,,,86.90D,NAFRev2,N,,,0,,,,,,
302649769,00015,30264976900015,O,,NN,,9999ZZ,2015-03-17T00:11:09,true,1,,,,,,79210,ARCAIS,,,79010,,,,,,,,,,,,,,,,,,,1990-05-31,F,,,,,44.39,NAP,N,,,0,,,,,,
303035760,00014,30303576000014,O,,NN,,,,true,1,,,,,,79210,ARCAIS,,,79010,,,,,,,,,,,,,,,,,,,1989-03-15,F,,,,,67.08,NAP,N,,,0,,,,,,
303334510,00011,30333451000011,O,,,,,,true,1,,,,,,79210,ARCAIS,,,79010,,,,,,,,,,,,,,,,,,,1985-12-25,F,,,,,84.10,NAP,N,,,0,,,,,,
304017668,00076,30401766800076,O,2008-11-07,,,,2014-12-24T14:04:13,true,1,,,,,,79210,ARCAIS,,,79010,,,,,,,,,,,,,,,,,,,2008-11-07,A,,,,,02.10Z,NAFRev2,N,,,0,,,,,,
304388416,00014,30438841600014,O,,,,,,true,1,,,,,,79210,ARCAIS,,,79010,,,,,,,,,,,,,,,,,,,1987-02-28,F,,,,,67.05,NAP,N,,,0,,,,,,
304734494,00012,30473449400012,O,1994-12-31,01,2019,,2021-10-27T08:15:19,true,3,,,,,,79210,ARCAIS,,,79010,,,,,,,,,,,,,,,,,,,2008-01-01,A,,,,,01.50Z,NAFRev2,N,,,0,,,,,,
306930785,00051,30693078500051,O,1999-04-01,NN,,1071CB,2015-03-17T00:11:52,false,4,,11,,RUE,DU MARAIS,79210,ARCAIS,,,79010,,,,,,,,,,,,,,,,,,,2002-12-18,F,,,,,15.8C,NAF1993,O,-0.690711,46.296748,0.95,housenumber,11 Rue du Marais 79210 Arçais,79010_0220_00011,G,11 RUE DU MARAIS,
307276287,00017,30727628700017,O,1900-01-01,NN,,,2008-01-04T19:46:04,true,3,MAIRIE,,,,,79210,ARCAIS,,,79010,,,,,,,,,,,,,,,,,,,2008-01-01,A,,,,,88.10A,NAFRev2,N,-0.689667,46.297204,0.92,street,Rue de la Mairie 79210 Arçais,79010_0210,D,RUE DE LA MAIRIE,
307662270,00015,30766227000015,O,,NN,,,,true,1,,,,RUE,PRINCIPALE,79210,ARCAIS,,,79010,,,,,,,,,,,,,,,,,,,,F,,,,,62.11,NAP,N,-0.68655,46.299443,0.33,street,Rue des Prunelles 79210 Arçais,79010_0301,G,RUE DES PRUNELLES,
309100022,00016,30910002200016,O,1900-01-01,,,,2019-02-19T04:28:35,true,5,,5,,RUE,DU COURSAULT,79210,ARCAIS,,,79010,,,,,,,,,,,,,,,,,,,2018-02-15,F,,,,,68.20A,NAFRev2,N,-0.689894,46.296357,0.95,housenumber,5 Rue du Coursault 79210 Arçais,79010_0115_00005,G,5 RUE DU COURSAULT,
309355592,00010,30935559200010,O,,NN,,,,true,1,,,,,,79210,ARCAIS,,,79010,,,,,,,,,,,,,,,,,,,1989-12-31,F,,,,,70.01,NAP,N,,,0,,,,,,
309446698,00016,30944669800016,O,,NN,,,,true,1,,,,,,79210,ARCAIS,,,79010,,,,,,,,,,,,,,,,,,,1990-03-15,F,,,,,80.06,NAP,N,,,0,,,,,,
315405373,00012,31540537300012,O,,,,,,true,1,,,,,,79210,ARCAIS,,,79010,,,,,,,,,,,,,,,,,,,1984-12-25,F,,,,,00.30,NAP,N,,,0,,,,,,
317909349,00019,31790934900019,O,1980-01-01,NN,,4332AA,2015-03-17T00:14:33,true,1,,,,,VENELLE DU CORDONNIER,79210,ARCAIS,,,79010,,,,,,,,,,,,,,,,,,,1999-03-30,F,,,,,45.4C,NAF1993,N,-0.690742,46.297469,0.94,street,Venelle du Cordonnier 79210 Arçais,79010_0100,G,VENELLE DU CORDONNIER,
318149135,00028,31814913500028,O,,NN,,,,true,1,,,,,,79210,ARCAIS,,,79010,,,,,,,,,,,,,,,,,,,,F,,,,,65.03,NAP,N,,,0,,,,,,
318758521,00013,31875852100013,O,,,,,,true,1,,,,,BOURDETTE,79210,ARCAIS,,,79010,,,,,,,,,,,,,,,,,,,1985-12-25,F,,,,,67.01,NAP,N,-0.712449,46.304595,0.92,street,Route des Bourdettes 79210 Arçais,79010_0065,G,ROUTE DES BOURDETTES,
319446316,00014,31944631600014,O,,NN,,,,true,1,,,,,GRANDE RUE,79210,ARCAIS,,,79010,,,,,,,,,,,,,,,,,,,,F,,,,,62.11,NAP,N,-0.689433,46.299553,0.44,street,Rue de la Garenne 79210 Arçais,79010_0170,G,RUE DE LA GARENNE,
319569687,00019,31956968700019,O,,NN,,,,true,1,,,,RUE,DE LA GARENNE,79210,ARCAIS,,,79010,,,,,,,,,,,,,,,,,,,,F,,,,,55.72,NAP,N,-0.689433,46.299553,0.95,street,Rue de la Garenne 79210 Arçais,79010_0170,G,RUE DE LA GARENNE,
320052194,00018,32005219400018,O,1980-06-16,,,,2007-01-18T09:15:17,true,3,,,,,,79210,ARCAIS,,,79010,,,,,,,,,,,,,,,,,,,1997-01-28,F,,,,,01.1A,NAF1993,N,,,0,,,,,,
321257016,00055,32125701600055,O,1993-07-01,NN,,,,false,4,,,,RUE,DE LA MAIRIE,79210,ARCAIS,,,79010,,,,,,,,,,,,,,,,,,,2000-11-06,F,,,,,85.1G,NAF1993,N,-0.689667,46.297204,0.94,street,Rue de la Mairie 79210 Arçais,79010_0210,G,RUE DE LA MAIRIE,
321441107,00026,32144110700026,O,,NN,,9999ZZ,2015-03-17T00:16:02,true,1,,,,,LE BOURG,79210,ARCAIS,,,79010,,,,,,,,,,,,,,,,,,,1991-03-31,F,,,,,38.40,NAP,N,-0.712449,46.304595,0.41,street,Route des Bourdettes 79210 Arçais,79010_0065,G,ROUTE DES BOURDETTES,
324306398,00011,32430639800011,O,,,,9999ZZ,2015-03-17T00:17:22,true,1,,,,RUE,DU COURSAULT,79210,ARCAIS,,,79010,,,,,,,,,,,,,,,,,,,1989-09-20,F,,,,,55.71,NAP,N,-0.69066,46.295305,0.95,street,Rue du Coursault 79210 Arçais,79010_0115,G,RUE DU COURSAULT,
325411775,00019,32541177500019,O,1982-09-01,NN,,,,false,3,,,,RTE,DE LA MAIRIE,79210,ARCAIS,,,79010,,,,,,,,,,,,,,,,,,,1992-02-15,F,,,,,85.1G,NAF1993,N,-0.689667,46.297204,0.79,street,Rue de la Mairie 79210 Arçais,79010_0210,G,RUE DE LA MAIRIE,
325437747,00018,32543774700018,O,,NN,,,,true,1,,,,,VENELLE DU CORDONNIER,79210,ARCAIS,,,79010,,,,,,,,,,,,,,,,,,,1990-06-30,F,,,,,55.71,NAP,N,-0.690742,46.297469,0.94,street,Venelle du Cordonnier 79210 Arçais,79010_0100,G,VENELLE DU CORDONNIER,
325476406,00013,32547640600013,O,1982-09-07,NN,,,2008-01-04T19:07:16,true,3,,,,,,79210,ARCAIS,,,79010,,,,,,,,,,,,,,,,,,,2008-01-01,A,,,,,56.29B,NAFRev2,N,,,0,,,,,,
325489912,00049,32548991200049,O,1988-07-01,NN,,,2012-10-30T08:32:49,true,4,,,,,LA PLAINE DES MOULINS,79210,ARCAIS,,,79010,,,,,,,,,,,,,,,,,,,2012-07-29,F,,,,,86.21Z,NAFRev2,N,-0.683634,46.300825,0.54,street,Chemin des Moulins 79210 Arçais,79010_0240,G,CHEMIN DES MOULINS,
325672822,00021,32567282200021,O,,NN,,,,true,1,,,,RUE,DE LA GARENNE,79210,ARCAIS,,,79010,,,,,,,,,,,,,,,,,,,1994-02-17,F,,,,,70.2A,NAF1993,N,-0.689433,46.299553,0.95,street,Rue de la Garenne 79210 Arçais,79010_0170,G,RUE DE LA GARENNE,
326363959,00015,32636395900015,O,1982-10-01,NN,,4332AA,2018-10-19T04:40:58,true,5,,,,,VENELLE DU CORDONNIER,79210,ARCAIS,,,79010,,,,,,,,,,,,,,,,,,,2018-10-15,F,,,,,43.32A,NAFRev2,N,-0.690742,46.297469,0.94,street,Venelle du Cordonnier 79210 Arçais,79010_0100,G,VENELLE DU CORDONNIER,
326830809,00017,32683080900017,O,1983-01-17,NN,,,2016-04-13T08:28:31,false,4,,,,,,79210,ARCAIS,,,79010,,,,,,,,,,,,,,,,,,,2016-03-31,F,,,,,86.21Z,NAFRev2,N,,,0,,,,,,
326830817,00010,32683081700010,O,,NN,,9999ZZ,2015-03-17T00:18:34,true,1,,,,,LA GARENNE,79210,ARCAIS,,,79010,,,,,,,,,,,,,,,,,,,1989-03-22,F,,,,,55.71,NAP,N,-0.689433,46.299553,0.93,street,Rue de la Garenne 79210 Arçais,79010_0170,G,RUE DE LA GARENNE,
328456553,00010,32845655300010,O,1983-10-10,02,2019,,2021-10-27T08:26:36,true,4,LD MAISON MEDICALE,23,,RTE,DU VANNEAU,79210,ARCAIS,,,79010,,,,,,,,,,,,,,,,,,,2008-01-01,A,,,,,86.23Z,NAFRev2,O,-0.682175,46.297297,0.85,housenumber,23 Route du Vanneau 79210 Arçais,79010_0360_00023,G,23 ROUTE DU VANNEAU,
328955679,00019,32895567900019,O,,NN,,4520AA,2015-03-17T00:19:36,true,1,,,,RTE,DU VANNEAU,79210,ARCAIS,,,79010,,,,,,,,,,,,,,,,,,,1994-06-30,F,,,,,50.2Z,NAF1993,N,-0.681988,46.297318,0.83,street,Route du Vanneau 79210 Arçais,79010_0360,G,ROUTE DU VANNEAU,
329029243,00014,32902924300014,O,1984-01-01,NN,,9999ZZ,2015-03-17T00:19:38,false,4,,,,PL,DU PORT,79210,ARCAIS,,,79010,,,,,,,,,,,,,,,,,,,2010-01-31,F,,,,,68.20B,NAFRev2,N,-0.690903,46.295875,0.75,street,Venelle du Port de la Planche 79210 Arçais,79010_0290,G,VENELLE DU PORT DE LA PLANCHE,
329432868,00035,32943286800035,O,1988-02-27,NN,,,2007-01-25T15:28:14,true,4,,,,,FERBAULT,79210,ARCAIS,,,79010,,,,,,,,,,,,,,,,,,,2006-11-08,F,,,,,70.2C,NAFRev1,N,-0.69066,46.295305,0.42,street,Rue du Coursault 79210 Arçais,79010_0115,G,RUE DU COURSAULT,
329432868,00043,32943286800043,O,1993-08-13,NN,,,,false,3,,,,RTE,DU VANNEAU,79210,ARCAIS,,,79010,,,,,,,,,,,,,,,,,,,1994-07-20,F,LE SAPHIR,,,,92.7C,NAF1993,N,-0.681988,46.297318,0.83,street,Route du Vanneau 79210 Arçais,79010_0360,G,ROUTE DU VANNEAU,
329433544,00015,32943354400015,O,1984-01-01,NN,,,2014-06-04T09:50:23,true,5,,11,,RUE,DU PORT DE CHEUSSE,79210,ARCAIS,,,79010,,,,,,,,,,,,,,,,,,,2013-09-13,F,,,,,68.20B,NAFRev2,N,-0.692401,46.294699,0.85,street,Rue du Port de Cheusse 79210 Arçais,79010_0285,G,RUE DU PORT DE CHEUSSE,
329876015,00010,32987601500010,O,1984-01-01,NN,,,,true,1,,,,,,79210,ARCAIS,,,79010,,,,,,,,,,,,,,,,,,,1998-09-12,F,,,,,01.1A,NAF1993,N,,,0,,,,,,
330361742,00019,33036174200019,O,,,,,,true,1,,,,PL,DE L EGLISE,79210,ARCAIS,,,79010,,,,,,,,,,,,,,,,,,,1987-04-01,F,,,,,65.03,NAP,N,-0.692049,46.296931,0.82,street,Place de l’Eglise 79210 Arçais,79010_0140,G,PLACE DE L EGLISE,
330478512,00016,33047851200016,O,,NN,,,,true,1,,,,,LES BOURDETTES,79210,ARCAIS,,,79010,,,,,,,,,,,,,,,,,,,,F,,,,,67.01,NAP,N,-0.712449,46.304595,0.8,street,Route des Bourdettes 79210 Arçais,79010_0065,G,ROUTE DES BOURDETTES,
331335018,00015,33133501800015,O,,NN,,,,true,1,,,,,,79210,ARCAIS,,,79010,,,,,,,,,,,,,,,,,,,1987-12-31,F,,,,,59.07,NAP,N,,,0,,,,,,
331706580,00015,33170658000015,O,,NN,,,,true,1,,,,RTE,DE ST HILAIRE,79210,ARCAIS,,,79010,,,,,,,,,,,,,,,,,,,1989-06-24,F,,,,,02.20,NAP,N,-0.690493,46.292321,0.75,street,Route de Saint-Hilaire 79210 Arçais,79010_0340,G,ROUTE DE SAINT HILAIRE,
332253111,00014,33225311100014,O,1985-04-01,NN,,,2006-12-15T00:26:17,false,4,,,,LD,LES BOURDETTES,79210,ARCAIS,,,79010,,,,,,,,,,,,,,,,,,,1998-02-14,F,,,,,55.3A,NAF1993,O,-0.712449,46.304595,0.8,street,Route des Bourdettes 79210 Arçais,79010_0065,G,ROUTE DES BOURDETTES,
332771567,00010,33277156700010,O,1985-07-01,NN,,,,true,1,,,,RUE,DU MARAIS,79210,ARCAIS,,,79010,,,,,,,,,,,,,,,,,,,2000-04-30,F,,,,,52.1B,NAF1993,N,-0.689902,46.296579,0.95,street,Rue du Marais 79210 Arçais,79010_0220,G,RUE DU MARAIS,
333143998,00032,33314399800032,O,,NN,,,,true,1,,,,,RUELLE DU ROULIER,79210,ARCAIS,,,79010,,,,,,,,,,,,,,,,,,,1995-03-30,F,,,,,93.0N,NAF1993,N,-0.691308,46.295681,0.78,street,Venelle du Roulier 79210 Arçais,79010_0310,G,VENELLE DU ROULIER,
333255446,00010,33325544600010,O,,NN,,,,true,1,,,,RTE,DAMVIX,79210,ARCAIS,,,79010,,,,,,,,,,,,,,,,,,,1989-10-11,F,,,,,70.01,NAP,N,-0.694997,46.298769,0.76,street,Route de Damvix 79210 Arçais,79010_0123,G,ROUTE DE DAMVIX,
333439743,00035,33343974300035,O,1995-11-01,,,3109BA,2015-03-17T00:22:02,false,3,,,,,ANCIENNE LAITERIE,79210,ARCAIS,,,79010,,,,,,,,,,,,,,,,,,,1999-03-31,F,,,,,36.1G,NAF1993,N,2.1023413,48.5748222,0.9,poi.attraction,Ancienne Laiterie (Attraction) Le Val-Saint-Germain,https://osm.org/way/205104457,G,,
333535219,00021,33353521900021,O,2012-01-15,,,9602AA,2015-03-17T00:22:05,true,3,CHEZ M THIBAUT  MARC,13,,RUE,DU MARAIS,79210,ARCAIS,,,79010,,,,,,,,,,,,,,,,,,,2012-11-12,A,,,,,90.03A,NAFRev2,N,-0.690543,46.296721,0.95,housenumber,13 Rue du Marais 79210 Arçais,79010_0220_00013,G,13 RUE DU MARAIS,
333619724,00011,33361972400011,O,1985-10-01,NN,,4321AB,2015-03-17T00:22:08,true,4,,,,RUE,DU COURSAULT,79210,ARCAIS,,,79010,,,,,,,,,,,,,,,,,,,2005-03-31,F,,,,,45.3A,NAFRev1,O,-0.69066,46.295305,0.95,street,Rue du Coursault 79210 Arçais,79010_0115,G,RUE DU COURSAULT,
334234754,00029,33423475400029,O,1987-06-09,NN,,,2010-01-07T05:46:53,false,4,,,,,,79210,ARCAIS,,,79010,,,,,,,,,,,,,,,,,,,2009-10-01,F,,,,,86.21Z,NAFRev2,N,,,0,,,,,,
334868734,00024,33486873400024,O,2003-02-18,NN,,,2008-01-04T20:55:34,true,3,LES BOURDETTES,14,,CHE,DE LA FOULEE,79210,ARCAIS,,,79010,,,,,,,,,,,,,,,,,,,2008-01-01,A,,,,,55.20Z,NAFRev2,N,-0.716847,46.307673,0.85,housenumber,14 Chemin de la Foulee 79210 Arçais,79010_0160_00014,G,14 CHEMIN DE LA FOULEE,
338248800,00066,33824880000066,O,2011-04-01,,,,2015-06-12T08:51:40,true,4,,20,,RUE,DU MARAIS,79210,ARCAIS,,,79010,,,,,,,,,,,,,,,,,,,2015-02-02,F,,,,,56.10B,NAFRev2,N,-0.690367,46.296653,0.95,housenumber,20 Rue du Marais 79210 Arçais,79010_0220_00020,G,20 RUE DU MARAIS,
338276397,00027,33827639700027,O,2009-04-01,,,9602AB,2015-03-17T00:23:34,false,2,,4,,RUE,PORT DE CHEUSSE,79210,ARCAIS,,,79010,,,,,,,,,,,,,,,,,,,2009-07-01,F,,,,,96.02A,NAFRev2,N,-0.691839,46.294552,0.9,housenumber,4 Rue du Port de Cheusse 79210 Arçais,79010_0285_00004,G,4 RUE DU PORT DE CHEUSSE,
338419864,00107,33841986400107,O,2018-10-01,01,2019,1083ZZ,2021-10-27T08:32:00,true,1,,37,,RUE,DE L'OUCHE,79210,ARCAIS,,,79010,,,,,,,,,,,,,,,,,,,2018-10-01,A,,,,,10.83Z,NAFRev2,N,-0.692973,46.296481,0.95,housenumber,37 Rue de l’Ouche 79210 Arçais,79010_0250_00037,G,37 RUE DE L OUCHE,
339347775,00019,33934777500019,O,1986-10-01,NN,,,2016-03-01T08:42:55,false,4,,,,RUE,DU MARAIS,79210,ARCAIS,,,79010,,,,,,,,,,,,,,,,,,,2016-02-01,F,,,,,86.90E,NAFRev2,N,-0.689902,46.296579,0.95,street,Rue du Marais 79210 Arçais,79010_0220,G,RUE DU MARAIS,
340299890,00012,34029989000012,O,1986-10-01,NN,,,2016-07-07T08:25:22,false,6,,,,RUE,DU MARAIS,79210,ARCAIS,,,79010,,,,,,,,,,,,,,,,,,,2016-02-01,F,,,,,86.90E,NAFRev2,O,-0.689902,46.296579,0.95,street,Rue du Marais 79210 Arçais,79010_0220,G,RUE DU MARAIS,
340777440,00017,34077744000017,O,,NN,,,,true,1,,,,RTE,DE LA MAIRIE,79210,ARCAIS,,,79010,,,,,,,,,,,,,,,,,,,1987-04-30,F,,,,,84.12,NAP,N,-0.689667,46.297204,0.79,street,Rue de la Mairie 79210 Arçais,79010_0210,G,RUE DE LA MAIRIE,
340957711,00013,34095771100013,O,,,,,,true,1,,,,RUE,DU MARAIS,79210,ARCAIS,,,79010,,,,,,,,,,,,,,,,,,,1991-10-01,F,,,,,62.43,NAP,N,-0.689902,46.296579,0.95,street,Rue du Marais 79210 Arçais,79010_0220,G,RUE DU MARAIS,
341502771,00072,34150277100072,O,2010-06-01,,,,2021-02-23T10:57:14,true,1,DE LA COUR,,,,VENELLE,79210,ARCAIS,,,79010,,,,,,,,,,,,,,,,,,,2010-06-01,A,,,,,58.11Z,NAFRev2,N,-0.691371,46.293659,0.91,locality,Venelle du Berger 79210 Arçais,79010_0040,G,VENELLE DU BERGER,
341538189,00018,34153818900018,O,1987-07-01,NN,,,2013-07-25T08:43:14,false,4,,1,,RUE,DU COURSAULT,79210,ARCAIS,,,79010,,,,,,,,,,,,,,,,,,,2013-06-30,F,,,,,88.99B,NAFRev2,N,-0.689709,46.296469,0.95,housenumber,1 Rue du Coursault 79210 Arçais,79010_0115_00001,G,1 RUE DU COURSAULT,
341538189,00026,34153818900026,O,2013-06-30,,,,2015-06-12T08:51:48,true,2,,36,,RTE,DE SAINT HILAIRE,79210,ARCAIS,,,79010,,,,,,,,,,,,,,,,,,,2015-03-31,F,,,,,86.90F,NAFRev2,N,-0.690649,46.290246,0.87,housenumber,36 Route de Saint-Hilaire 79210 Arçais,79010_0340_00036,G,36 ROUTE DE SAINT HILAIRE,
341892271,00014,34189227100014,O,1987-07-02,,,,,true,4,,,,,GRAND RUE,79210,ARCAIS,,,79010,,,,,,,,,,,,,,,,,,,1994-12-25,F,,,,,52.4Z,NAF1993,N,-0.692469,46.297845,0.56,street,Place du Grand Port 79210 Arçais,79010_0180,G,PLACE DU GRAND PORT,
342282803,00010,34228280300010,O,1987-07-09,NN,,,2007-01-18T09:24:22,true,4,,,,,MAIRIE,79210,ARCAIS,,,79010,,,,,,,,,,,,,,,,,,,1996-12-25,F,,,,,01.4A,NAF1993,N,-0.689667,46.297204,0.92,street,Rue de la Mairie 79210 Arçais,79010_0210,G,RUE DE LA MAIRIE,
342414695,00011,34241469500011,O,1987-09-07,NN,,,,true,1,,,,RTE,DE ST HILAIRE,79210,ARCAIS,,,79010,,,,,,,,,,,,,,,,,,,2002-01-01,F,,,,,70.2A,NAF1993,O,-0.690493,46.292321,0.75,street,Route de Saint-Hilaire 79210 Arçais,79010_0340,G,ROUTE DE SAINT HILAIRE,
342425287,00089,34242528700089,O,2017-09-11,,,,2018-03-21T14:14:03,false,2,,23,,RTE,DU VANNEAU,79210,ARCAIS,,,79010,,,,,,,,,,,,,,,,,,,2018-04-01,F,,,,,86.23Z,NAFRev2,N,-0.682175,46.297297,0.85,housenumber,23 Route du Vanneau 79210 Arçais,79010_0360_00023,G,23 ROUTE DU VANNEAU,
342731577,00017,34273157700017,O,1984-10-15,NN,,,2012-05-05T02:51:01,true,6,,,,,,79210,ARCAIS,,,79010,,,,,,,,,,,,,,,,,,,2010-06-01,A,,,,,82.19Z,NAFRev2,N,,,0,,,,,,
342731700,00015,34273170000015,O,,NN,,,,true,1,,,,,,79210,ARCAIS,,,79010,,,,,,,,,,,,,,,,,,,1988-06-30,F,,,,,84.10,NAP,N,,,0,,,,,,
344438890,00024,34443889000024,O,2001-05-01,,,,2021-02-23T10:59:27,true,1,,21,,RUE,DE LA MAIRIE,79210,ARCAIS,,,79010,,,,,,,,,,,,,,,,,,,2001-05-01,A,,,,,55.20Z,NAFRev2,N,-0.689191,46.297279,0.94,housenumber,21 Rue de la Mairie 79210 Arçais,79010_0210_00021,G,21 RUE DE LA MAIRIE,
345292452,00017,34529245200017,O,,,,,,true,1,,,,PL,DE L EGLISE,79210,ARCAIS,,,79010,,,,,,,,,,,,,,,,,,,1990-12-25,F,,,,,62.46,NAP,N,-0.692049,46.296931,0.82,street,Place de l’Eglise 79210 Arçais,79010_0140,G,PLACE DE L EGLISE,
348411950,00028,34841195000028,O,1900-01-01,NN,,4520AB,2016-01-27T14:18:19,false,4,,,,RTE,ST HILAIRE LA PALUD,79210,ARCAIS,,,79010,,,,,,,,,,,,,,,,,,,1996-12-25,F,,,,,50.1Z,NAF1993,O,-0.690493,46.292321,0.46,street,Route de Saint-Hilaire 79210 Arçais,79010_0340,G,ROUTE DE SAINT HILAIRE,
349164657,00018,34916465700018,O,1989-01-01,NN,,,,true,1,,,,,,79210,ARCAIS,,,79010,,,,,,,,,,,,,,,,,,,2001-04-30,F,,,,,01.3Z,NAF1993,N,,,0,,,,,,
349769562,00019,34976956200019,O,1989-01-31,NN,,,2007-01-18T09:27:00,true,3,,,,,,79210,ARCAIS,,,79010,,,,,,,,,,,,,,,,,,,1998-12-25,F,,,,,01.1A,NAF1993,N,,,0,,,,,,
350400545,00017,35040054500017,O,1989-04-02,,,,,true,1,,30,,RTE,DU VANNEAU,79210,ARCAIS,,,79010,,,,,,,,,,,,,,,,,,,1998-09-30,F,,,,,61.2Z,NAF1993,N,-0.680598,46.297076,0.85,housenumber,30 Route du Vanneau 79210 Arçais,79010_0360_00030,G,30 ROUTE DU VANNEAU,
350462719,00013,35046271900013,O,,NN,,,2014-06-17T19:24:49,true,1,,,,,,79210,ARCAIS,,,79010,,,,,,,,,,,,,,,,,,,1997-05-01,F,,,,,55.1A,NAF1993,O,,,0,,,,,,
351155791,00012,35115579100012,O,,NN,,,,true,1,,,,RUE,DU COURSAULT,79210,ARCAIS,,,79010,,,,,,,,,,,,,,,,,,,1994-09-30,F,,,,,91.3E,NAF1993,O,-0.69066,46.295305,0.95,street,Rue du Coursault 79210 Arçais,79010_0115,G,RUE DU COURSAULT,
352906960,00021,35290696000021,O,1990-01-01,NN,,,2015-05-14T03:44:24,false,5,,,,,,79210,ARCAIS,,,79010,,,,,,,,,,,,,,,,,,,2014-01-28,F,UNITE DE VIE,,,,87.10A,NAFRev2,O,,,0,,,,,,
353292477,00018,35329247700018,O,,NN,,,,true,1,,,,,CHAUVILLON,79210,ARCAIS,,,79010,,,,,,,,,,,,,,,,,,,1994-12-31,F,,,,,55.4B,NAF1993,N,,,0,,,,,,
356000547,00477,35600054700477,O,1991-01-01,NN,,,2008-01-15T10:34:30,false,4,,,,PL,DE L EGLISE,79210,ARCAIS,,,79010,,,,,,,,,,,,,,,,,,,2008-01-04,F,BUREAU DE POSTE,,,,53.10Z,NAFRev2,O,-0.692049,46.296931,0.82,street,Place de l’Eglise 79210 Arçais,79010_0140,G,PLACE DE L EGLISE,
377498811,00027,37749881100027,O,2010-09-06,,,,2017-02-07T09:10:08,true,2,,37,,RUE,DU MARAIS,79210,ARCAIS,,,79010,,,,,,,,,,,,,,,,,,,2017-04-01,F,,,,,86.21Z,NAFRev2,N,-0.688257,46.296667,0.95,housenumber,37 Rue du Marais 79210 Arçais,79010_0220_00037,G,37 RUE DU MARAIS,
377755764,00018,37775576400018,O,1990-04-01,NN,,,2007-08-23T15:18:23,false,3,,,,RUE,DE LA GARENNE,79210,ARCAIS,,,79010,,,,,,,,,,,,,,,,,,,2007-07-20,F,,,,,70.1D,NAFRev1,N,-0.689433,46.299553,0.95,street,Rue de la Garenne 79210 Arçais,79010_0170,G,RUE DE LA GARENNE,