siren,nic,siret,statutDiffusionEtablissement,dateCreationEtablissement,trancheEffectifsEtablissement,anneeEffectifsEtablissement,activitePrincipaleRegistreMetiersEtablissement,dateDernierTraitementEtablissement,etablissementSiege,nombrePeriodesEtablissement,complementAdresseEtablissement,numeroVoieEtablissement,indiceRepetitionEtablissement,typeVoieEtablissement,libelleVoieEtablissement,codePostalEtablissement,libelleCommuneEtablissement,libelleCommuneEtrangerEtablissement,distributionSpecialeEtablissement,codeCommuneEtablissement,codeCedexEtablissement,libelleCedexEtablissement,codePaysEtrangerEtablissement,libellePaysEtrangerEtablissement,complementAdresse2Etablissement,numeroVoie2Etablissement,indiceRepetition2Etablissement,typeVoie2Etablissement,libelleVoie2Etablissement,codePostal2Etablissement,libelleCommune2Etablissement,libelleCommuneEtranger2Etablissement,distributionSpeciale2Etablissement,codeCommune2Etablissement,codeCedex2Etablissement,libelleCedex2Etablissement,codePaysEtranger2Etablissement,libellePaysEtranger2Etablissement,dateDebut,etatAdministratifEtablissement,enseigne1Etablissement,enseigne2Etablissement,enseigne3Etablissement,denominationUsuelleEtablissement,activitePrincipaleEtablissement,nomenclatureActivitePrincipaleEtablissement,caractereEmployeurEtablissement,longitude,latitude,geo_score,geo_type,geo_adresse,geo_id,geo_ligne,geo_l4,geo_l5
219100799,00010,21910079900010,O,1983-03-01,03,2019,,2021-10-27T08:11:18,true,4,,,,PL,DE LA PAIX,91690,BOISSY-LA-RIVIERE,,,91079,,,,,,,,,,,,,,,,,,,2008-01-01,A,MAIRIE,,,,84.11Z,NAFRev2,O,2.155101,48.375183,0.8,street,Place de la Paix 91690 Boissy-la-Rivière,91079_0031,G,PLACE DE LA PAIX,
219100799,00028,21910079900028,O,1983-12-21,NN,,,2019-11-14T14:01:05,false,4,,1,,PL,DE LA PAIX,91690,BOISSY-LA-RIVIERE,,,91079,,,,,,,,,,,,,,,,,,,1997-12-31,F,ECOLE PRIMAIRE PUBLIQUE,,,,80.1Z,NAF1993,N,2.155086,48.375148,0.82,housenumber,1 Place de la Paix 91690 Boissy-la-Rivière,91079_0031_00001,G,1 PLACE DE LA PAIX,
219100799,00036,21910079900036,O,1996-09-01,02,2019,,2021-10-27T08:11:18,false,3,,,,RUE,DE LA REPUBLIQUE,91690,BOISSY-LA-RIVIERE,,,91079,,,,,,,,,,,,,,,,,,,2008-01-01,A,ECOLE MATERNELLE PUBLIQUE,,,,85.10Z,NAFRev2,N,2.152396,48.371945,0.95,street,Rue de la République 91690 Boissy-la-Rivière,91079_0032,G,RUE DE LA REPUBLIQUE,
219100799,00044,21910079900044,O,1996-09-01,01,2019,,2021-10-27T08:11:18,false,3,,6,,RUE,DE LA REPUBLIQUE,91690,BOISSY-LA-RIVIERE,,,91079,,,,,,,,,,,,,,,,,,,2008-01-01,A,ECOLE ELEMENTAIRE PUBLIQUE,,,,85.20Z,NAFRev2,N,2.1525,48.374258,0.95,housenumber,6 Rue de la République 91690 Boissy-la-Rivière,91079_0032_00006,G,6 RUE DE LA REPUBLIQUE,
219100799,00051,21910079900051,O,1997-12-25,NN,,,2020-08-19T11:23:41,false,3,MAIRIE,,,PL,DE LA PAIX,91690,BOISSY-LA-RIVIERE,,,91079,,,,,,,,,,,,,,,,,,,2019-12-31,F,SERVICE D'ASSAINISSEMENT,,,,37.00Z,NAFRev2,N,2.155101,48.375183,0.8,street,Place de la Paix 91690 Boissy-la-Rivière,91079_0031,G,PLACE DE LA PAIX,
259101863,00027,25910186300027,O,2009-02-26,NN,,,2019-11-14T14:01:05,false,2,MAIRIE,,,RUE,DE LA MAIRIE,91690,BOISSY-LA-RIVIERE,,,91079,,,,,,,,,,,,,,,,,,,2013-07-12,F,,,,,84.12Z,NAFRev2,O,2.154701,48.374521,0.94,street,Rue de la Mairie 91690 Boissy-la-Rivière,91079_0019,G,RUE DE LA MAIRIE,
259102481,00019,25910248100019,O,1997-12-15,NN,,,2019-11-14T14:01:05,true,3,MAIRIE,,,PL,DE LA PAIX,91690,BOISSY-LA-RIVIERE,,,91079,,,,,,,,,,,,,,,,,,,2004-01-23,F,,,,,90.0A,NAFRev1,N,2.155101,48.375183,0.8,street,Place de la Paix 91690 Boissy-la-Rivière,91079_0031,G,PLACE DE LA PAIX,
269103594,00017,26910359400017,O,1994-01-27,NN,,,2020-06-19T10:57:49,true,4,MAIRIE,,,PL,DE LA PAIX,91690,BOISSY-LA-RIVIERE,,,91079,,,,,,,,,,,,,,,,,,,2008-01-01,F,CDE,,,,88.99B,NAFRev2,N,2.155101,48.375183,0.8,street,Place de la Paix 91690 Boissy-la-Rivière,91079_0031,G,PLACE DE LA PAIX,
269103602,00018,26910360200018,O,1994-01-27,NN,,,2019-11-14T14:01:05,true,4,MAIRIE,,,PL,DE LA PAIX,91690,BOISSY-LA-RIVIERE,,,91079,,,,,,,,,,,,,,,,,,,2016-01-01,F,CCAS,,,,88.99B,NAFRev2,N,2.155101,48.375183,0.8,street,Place de la Paix 91690 Boissy-la-Rivière,91079_0031,G,PLACE DE LA PAIX,
300066974,00043,30006697400043,O,1991-11-22,NN,,7420ZS,2019-11-14T14:01:05,true,4,,3,,,MONTOIR DE MESNIL GIRAULT,91690,BOISSY-LA-RIVIERE,,,91079,,,,,,,,,,,,,,,,,,,2014-08-01,F,,,,,74.20Z,NAFRev2,N,2.156962,48.374795,0.89,housenumber,3 Voie Communale Montoir de Mesnil Girault 91690 Boissy-la-Rivière,91079_0055_00003,G,3 VOIE C MONTOIR MESNIL GIRAULT,
301544433,00016,30154443300016,O,,NN,,,2019-11-14T14:01:05,true,1,,,,,RELAIS DE BIERVILLE,91690,BOISSY-LA-RIVIERE,,,91079,,,,,,,,,,,,,,,,,,,1974-01-01,F,,,,,55.1A,NAF1993,N,,,0,,,,,,
302175369,00032,30217536900032,O,1900-01-01,NN,,,2019-11-14T14:01:05,false,3,,34,,,MONTOIR DES GRANDS REBORDS,91690,BOISSY-LA-RIVIERE,,,91079,,,,,,,,,,,,,,,,,,,1995-12-31,F,,,,,70.3A,NAF1993,N,2.162332,48.373158,0.9,housenumber,34 Voie Communale Montoir des Grands Rebords 91690 Boissy-la-Rivière,91079_0053_00034,G,34 VOIE C MONTOIR GDS REBORDS,
304284938,00020,30428493800020,O,2011-12-01,,,,2019-11-14T14:01:05,true,2,,33,,RUE,DE LA REPUBLIQUE,91690,BOISSY-LA-RIVIERE,,,91079,,,,,,,,,,,,,,,,,,,2013-12-01,F,,,,,74.20Z,NAFRev2,N,2.15073,48.369629,0.95,housenumber,33 Rue de la République 91690 Boissy-la-Rivière,91079_0032_00033,G,33 RUE DE LA REPUBLIQUE,
307689901,00022,30768990100022,O,,,,,2019-11-14T14:01:05,true,1,,2,,RUE,DE LA REPUBLIQUE,91690,BOISSY-LA-RIVIERE,,,91079,,,,,,,,,,,,,,,,,,,1991-06-26,F,,,,,67.01,NAP,N,2.154708,48.375323,0.95,housenumber,2 Rue de la République 91690 Boissy-la-Rivière,91079_0032_00002,G,2 RUE DE LA REPUBLIQUE,
308358076,00039,30835807600039,O,,NN,,,2019-11-14T14:01:05,true,1,,8,,RUE,DE LA FRATERNITE,91690,BOISSY-LA-RIVIERE,,,91079,,,,,,,,,,,,,,,,,,,1997-12-31,F,,,,,45.4C,NAF1993,O,2.155813,48.374973,0.95,housenumber,8 Rue de la Fraternité 91690 Boissy-la-Rivière,91079_0015_00008,G,8 RUE DE LA FRATERNITE,
314295320,00027,31429532000027,O,,,,,2019-11-14T14:01:05,true,1,,,,,MESNIL GIRAULT,91690,BOISSY-LA-RIVIERE,,,91079,,,,,,,,,,,,,,,,,,,1992-10-04,F,,,,,74.7Z,NAF1993,N,2.202418,48.389182,0.94,street,Mesnil Girault 91690 Boissy-la-Rivière,91079_B032,G,MESNIL GIRAULT,
317819589,00019,31781958900019,O,,,,,2019-11-14T14:01:05,true,1,,,,CHE,DES CLERCS,91690,BOISSY-LA-RIVIERE,,,91079,,,,,,,,,,,,,,,,,,,1984-12-25,F,,,,,86.10,NAP,N,2.143401,48.385761,0.82,street,Chemin des Clercs 91690 Boissy-la-Rivière,91079_0007,G,CHEMIN DES CLERCS,
319073425,00013,31907342500013,O,1980-03-13,NN,,,2019-11-14T14:01:05,true,3,,,,,CHATEAU DE BIERVILLE,91690,BOISSY-LA-RIVIERE,,,91079,,,,,,,,,,,,,,,,,,,2008-01-01,A,,,,,90.04Z,NAFRev2,N,2.140069,48.383224,0.39,street,Voie Communale Montoir de la Tete de Chat 91690 Boissy-la-Rivière,91079_0059,G,VOIE C MONTOIR LA TETE DE CHAT,
322222068,00031,32222206800031,O,,NN,,,2019-11-14T14:01:05,true,1,,22,,RUE,DE LA REPUBLIQUE,91690,BOISSY-LA-RIVIERE,,,91079,,,,,,,,,,,,,,,,,,,1991-04-15,F,,,,,64.23,NAP,N,2.15294,48.373561,0.95,housenumber,22 Rue de la République 91690 Boissy-la-Rivière,91079_0032_00022,G,22 RUE DE LA REPUBLIQUE,
323075358,00081,32307535800081,O,2021-07-01,,,,2021-06-19T11:43:18,true,1,,13,,RUE,DE LA FRATERNITE,91690,BOISSY-LA-RIVIERE,,,91079,,,,,,,,,,,,,,,,,,,2021-07-01,A,,,,,96.09Z,NAFRev2,N,2.156292,48.37492,0.95,housenumber,13 Rue de la Fraternité 91690 Boissy-la-Rivière,91079_0015_00013,G,13 RUE DE LA FRATERNITE,
325698264,00034,32569826400034,O,2006-06-12,,,,2020-12-19T08:34:30,true,3,,6,,,MONTOIR DE LA GENEVRIERE,91690,BOISSY-LA-RIVIERE,,,91079,,,,,,,,,,,,,,,,,,,2020-12-17,F,,,,,70.10Z,NAFRev2,N,2.154158,48.376429,0.94,housenumber,6 Montoir de la Genevriere 91690 Boissy-la-Rivière,91079_4xmrld_00006,G,6 MONTOIR DE LA GENEVRIERE,
327068193,00017,32706819300017,O,,,,,2019-11-14T14:01:05,true,1,,,,,MONTOIR DE LA ROBINETTE,91690,BOISSY-LA-RIVIERE,,,91079,,,,,,,,,,,,,,,,,,,1993-12-20,F,,,,,92.6A,NAF1993,N,2.147253,48.383977,0.92,locality,Voie Communale Montoir de la Robinette 91690 Boissy-la-Rivière,91079_0056,G,VOIE C MONTOIR DE LA ROBINETTE,
328222732,00013,32822273200013,O,1983-07-08,NN,,,2019-11-14T14:01:05,true,3,MINAS,,,,MINAS,91690,BOISSY-LA-RIVIERE,,,91079,,,,,,,,,,,,,,,,,,,2006-10-16,F,,,,,70.2C,NAFRev1,N,2.145105,48.386423,0.91,street,Les Pentes de Minas 91690 Boissy-la-Rivière,91079_B041,G,LES PENTES DE MINAS,
329108336,00036,32910833600036,O,2008-03-01,,,,2019-11-14T14:01:05,false,1,,6,,RUE,DE LA DEMOCRATIE,91690,BOISSY-LA-RIVIERE,,,91079,,,,,,,,,,,,,,,,,,,2008-03-01,A,,,,,82.19Z,NAFRev2,N,2.153363,48.378112,0.95,housenumber,6 Rue de la Démocratie 91690 Boissy-la-Rivière,91079_0010_00006,G,6 RUE DE LA DEMOCRATIE,
329660815,00013,32966081500013,O,1900-01-01,NN,,,2019-11-14T14:01:05,false,3,,15,,RUE,DE LA REPUBLIQUE,91690,BOISSY-LA-RIVIERE,,,91079,,,,,,,,,,,,,,,,,,,1992-12-31,F,,,,,74.2C,NAF1993,N,2.152316,48.371736,0.95,housenumber,15 Rue de la République 91690 Boissy-la-Rivière,91079_0032_00015,G,15 RUE DE LA REPUBLIQUE,
330539537,00010,33053953700010,O,,NN,,,2019-11-14T14:01:05,true,1,,6,,,MONTOIR DES GRANDS REBORDS,91690,BOISSY-LA-RIVIERE,,,91079,,,,,,,,,,,,,,,,,,,1988-08-31,F,,,,,64.49,NAP,N,2.161603,48.373352,0.93,street,Voie Communale Montoir des Grands Rebords 91690 Boissy-la-Rivière,91079_0053,G,VOIE C MONTOIR DES GDS REBORDS,
333539518,00014,33353951800014,O,,NN,,,2019-11-14T14:01:05,true,1,,4,,RUE,DE LA MAIRIE,91690,BOISSY-LA-RIVIERE,,,91079,,,,,,,,,,,,,,,,,,,1991-02-28,F,,,,,77.03,NAP,N,2.154994,48.374567,0.94,housenumber,4 Rue de la Mairie 91690 Boissy-la-Rivière,91079_0019_00004,G,4 RUE DE LA MAIRIE,
334718152,00021,33471815200021,O,1900-01-01,NN,,,2019-11-14T14:01:05,true,5,,14,,,MONTOIR DES GRANDS REBORDS,91690,BOISSY-LA-RIVIERE,,,91079,,,,,,,,,,,,,,,,,,,2011-03-30,F,,,,,70.21Z,NAFRev2,N,2.158784,48.373045,0.9,housenumber,14 Voie Communale Montoir des Grands Rebords 91690 Boissy-la-Rivière,91079_0053_00014,G,14 VOIE C MONTOIR GDS REBORDS,
335319075,00016,33531907500016,O,1986-03-22,NN,,,2019-11-14T14:01:05,true,3,,22,B,RUE,DEMOCRATIE,91690,BOISSY-LA-RIVIERE,,,91079,,,,,,,,,,,,,,,,,,,1991-12-21,F,,,,,52.4J,NAF1993,N,2.151934,48.380641,0.85,housenumber,22bis Rue de la Démocratie 91690 Boissy-la-Rivière,91079_0010_00022_bis,G,22BIS RUE DE LA DEMOCRATIE,
337664585,00011,33766458500011,O,1986-05-06,NN,,,2019-11-14T14:01:05,true,3,,,,RTE,D ORMOY LA JOEVE,91690,BOISSY-LA-RIVIERE,,,91079,,,,,,,,,,,,,,,,,,,2008-01-01,A,,,,,43.12A,NAFRev2,N,,,0,,,,,,
339269847,00028,33926984700028,O,1992-09-21,NN,,,2019-11-14T14:01:05,true,3,,6,,RUE,DU MONTOIR DE LA GENEVIEVE,91690,BOISSY-LA-RIVIERE,,,91079,,,,,,,,,,,,,,,,,,,2008-01-01,A,,,,,68.20B,NAFRev2,N,2.154325,48.37648,0.62,housenumber,6 Voie Communale Montoir de la Genevriere 91690 Boissy-la-Rivière,91079_0054_00006,G,6 VOIE C MONTOIR LA GENEVRIERE,
339459828,00010,33945982800010,O,,NN,,,2019-11-14T14:01:05,true,1,,5,,,REPUBLIQUE,91690,BOISSY-LA-RIVIERE,,,91079,,,,,,,,,,,,,,,,,,,1987-07-08,F,,,,,64.11,NAP,N,2.152945,48.372508,0.93,housenumber,5 Rue de la République 91690 Boissy-la-Rivière,91079_0032_00005,G,5 RUE DE LA REPUBLIQUE,
340812528,00024,34081252800024,O,2009-10-16,01,2019,4399CZ,2021-10-27T08:33:54,true,2,,2,,CHE,CLERCS,91690,BOISSY-LA-RIVIERE,,,91079,,,,,,,,,,,,,,,,,,,2010-11-02,A,,,,,43.99C,NAFRev2,O,2.144862,48.385116,0.8,housenumber,2 Chemin des Clercs 91690 Boissy-la-Rivière,91079_0007_00002,G,2 CHEMIN DES CLERCS,
341672046,00016,34167204600016,O,1986-11-01,NN,,,2019-11-14T14:01:05,true,3,,2,,RUE,DES SAUCIERS,91690,BOISSY-LA-RIVIERE,,,91079,,,,,,,,,,,,,,,,,,,2003-12-31,F,,,,,67.2Z,NAFRev1,N,2.150799,48.368817,0.95,housenumber,2 Rue des Sauciers 91690 Boissy-la-Rivière,91079_0052_00002,G,2 RUE DES SAUCIERS,
341959930,00015,34195993000015,O,1987-08-05,NN,,,2019-11-14T14:01:05,true,4,,4,,,MONTOIR GRANDS REBORDS,91690,BOISSY-LA-RIVIERE,,,91079,,,,,,,,,,,,,,,,,,,2009-12-25,F,,,,,01.11Z,NAFRev2,N,2.161603,48.373352,0.89,street,Voie Communale Montoir des Grands Rebords 91690 Boissy-la-Rivière,91079_0053,G,VOIE C MONTOIR DES GDS REBORDS,
341959963,00016,34195996300016,O,1987-08-05,NN,,,2019-11-14T14:01:05,true,4,MESNIL GIRAULT,,,RTE,DE BOISSY LA RIVIERE,91690,BOISSY-LA-RIVIERE,,,91079,,,,,,,,,,,,,,,,,,,2013-03-31,F,,,,,01.11Z,NAFRev2,N,2.15493,48.375395,0.86,street,Rue de la Fraternité 91690 Boissy-la-Rivière,91079_0015,G,RUE DE LA FRATERNITE,
341987162,00029,34198716200029,O,1993-12-25,NN,,,2019-11-14T14:01:05,true,2,,,,,MESNIL GIRAULT,91690,BOISSY-LA-RIVIERE,,,91079,,,,,,,,,,,,,,,,,,,2006-12-31,F,,,,,01.1A,NAFRev1,N,2.202418,48.389182,0.94,street,Mesnil Girault 91690 Boissy-la-Rivière,91079_B032,G,MESNIL GIRAULT,
342353307,00016,34235330700016,O,1987-09-23,NN,,,2019-11-14T14:01:05,true,3,,,,,,91690,BOISSY-LA-RIVIERE,,,91079,,,,,,,,,,,,,,,,,,,1995-12-25,F,,,,,70.2A,NAF1993,N,,,0,,,,,,
342888328,00016,34288832800016,O,1987-10-17,NN,,,2019-11-14T14:01:05,true,3,,5,,CHE,DES CLERCS,91690,BOISSY-LA-RIVIERE,,,91079,,,,,,,,,,,,,,,,,,,2008-01-01,A,,,,,71.12B,NAFRev2,N,2.141166,48.384878,0.84,housenumber,5 Chemin des Clercs 91690 Boissy-la-Rivière,91079_0007_00005,G,5 CHEMIN DES CLERCS,
347805129,00017,34780512900017,O,1988-08-01,,,,2019-11-14T14:01:05,true,4,,6,,CHE,DE MINAS,91690,BOISSY-LA-RIVIERE,,,91079,,,,,,,,,,,,,,,,,,,1995-07-24,F,,,,,74.2A,NAF1993,N,2.146226,48.38641,0.68,street,Chemin de Minas 91690 Boissy-la-Rivière,91079_0005,G,CHEMIN DE MINAS,
347942658,00019,34794265800019,O,,NN,,,2019-11-14T14:01:05,true,1,,4,,,MONTOIR DES GRANDS REBORDS,91690,BOISSY-LA-RIVIERE,,,91079,,,,,,,,,,,,,,,,,,,1997-03-31,F,,,,,01.4A,NAF1993,N,2.161603,48.373352,0.93,street,Voie Communale Montoir des Grands Rebords 91690 Boissy-la-Rivière,91079_0053,G,VOIE C MONTOIR DES GDS REBORDS,
348746744,00039,34874674400039,O,2010-05-29,,,,2021-02-23T11:01:42,true,1,,8,,CHE,DE MINAS,91690,BOISSY-LA-RIVIERE,,,91079,,,,,,,,,,,,,,,,,,,2010-05-29,A,,,,,68.20B,NAFRev2,N,2.146226,48.38641,0.68,street,Chemin de Minas 91690 Boissy-la-Rivière,91079_0005,G,CHEMIN DE MINAS,
349295550,00025,34929555000025,O,1991-12-02,NN,,,2019-11-14T14:01:05,true,1,,3,,,MONTOIR DE MESNIL GIRAULT,91690,BOISSY-LA-RIVIERE,,,91079,,,,,,,,,,,,,,,,,,,2000-09-11,F,,,,,74.1G,NAF1993,O,2.156962,48.374795,0.89,housenumber,3 Voie Communale Montoir de Mesnil Girault 91690 Boissy-la-Rivière,91079_0055_00003,G,3 VOIE C MONTOIR MESNIL GIRAULT,
349485151,00048,34948515100048,O,2001-01-01,,,,2019-11-14T14:01:05,false,4,,,,,MESNIL GIRAULT,91690,BOISSY-LA-RIVIERE,,,91079,,,,,,,,,,,,,,,,,,,2012-02-29,F,,,,,43.21A,NAFRev2,O,2.202418,48.389182,0.94,street,Mesnil Girault 91690 Boissy-la-Rivière,91079_B032,G,MESNIL GIRAULT,
351344817,00017,35134481700017,O,1989-06-30,NN,,,2019-11-14T14:01:05,true,3,,,,,MESNIL GIRAULT,91690,BOISSY-LA-RIVIERE,,,91079,,,,,,,,,,,,,,,,,,,2008-01-01,A,,,,,01.11Z,NAFRev2,N,2.202418,48.389182,0.94,street,Mesnil Girault 91690 Boissy-la-Rivière,91079_B032,G,MESNIL GIRAULT,
352069207,00012,35206920700012,O,1989-10-02,NN,,,2019-11-14T14:01:05,true,1,,2,,RUE,DE LA MAIRIE,91690,BOISSY-LA-RIVIERE,,,91079,,,,,,,,,,,,,,,,,,,1998-07-05,F,,,,,67.1E,NAF1993,N,2.154557,48.374475,0.94,housenumber,2 Rue de la Mairie 91690 Boissy-la-Rivière,91079_0019_00002,G,2 RUE DE LA MAIRIE,
352250328,00015,35225032800015,O,1989-10-09,,,,2019-11-14T14:01:05,false,4,,14,,RUE,DE LA DEMOCRATIE,91690,BOISSY-LA-RIVIERE,,,91079,,,,,,,,,,,,,,,,,,,1993-12-25,F,,,,,45.4H,NAF1993,N,2.153193,48.379247,0.95,housenumber,14 Rue de la Démocratie 91690 Boissy-la-Rivière,91079_0010_00014,G,14 RUE DE LA DEMOCRATIE,
352316640,00015,35231664000015,O,1989-11-01,,,,2019-11-14T14:01:05,true,4,,,,HAM,DE MESNIL GIRAULT,91690,BOISSY-LA-RIVIERE,,,91079,,,,,,,,,,,,,,,,,,,1993-02-08,F,,,,,74.1G,NAF1993,N,2.159655,48.37575,0.91,street,Voie Communale Montoir de Mesnil Girault 91690 Boissy-la-Rivière,91079_0055,G,VOIE C MONTOIR DE MESNIL GIRAULT,
352378921,00014,35237892100014,O,1900-01-01,NN,,,2019-11-14T14:01:05,false,4,,3,,CHE,DES CLERCS,91690,BOISSY-LA-RIVIERE,,,91079,,,,,,,,,,,,,,,,,,,1992-12-25,F,,,,,74.4A,NAF1993,N,2.144481,48.385189,0.84,housenumber,3 Chemin des Clercs 91690 Boissy-la-Rivière,91079_0007_00003,G,3 CHEMIN DES CLERCS,
380439570,00017,38043957000017,O,1991-01-01,NN,,,2019-11-14T14:01:05,true,3,,34,,,MONTOIR DES GRANDS REBORDS,91690,BOISSY-LA-RIVIERE,,,91079,,,,,,,,,,,,,,,,,,,1993-01-01,F,,,,,74.8K,NAF1993,N,2.162332,48.373158,0.9,housenumber,34 Voie Communale Montoir des Grands Rebords 91690 Boissy-la-Rivière,91079_0053_00034,G,34 VOIE C MONTOIR GDS REBORDS,
380651281,00012,38065128100012,O,1991-01-01,NN,,,2019-11-14T14:01:05,false,4,,,,,HAMEAU DE MESNIL GIRAULT,91690,BOISSY-LA-RIVIERE,,,91079,,,,,,,,,,,,,,,,,,,2000-01-03,F,,,,,60.2L,NAF1993,O,2.159655,48.37575,0.68,street,Voie Communale Montoir de Mesnil Girault 91690 Boissy-la-Rivière,91079_0055,G,VOIE C MONTOIR DE MESNIL GIRAULT,
382197689,00039,38219768900039,O,1997-03-20,NN,,,2019-11-14T14:01:05,false,3,,28,,RUE,REPUBLIQUE,91690,BOISSY-LA-RIVIERE,,,91079,,,,,,,,,,,,,,,,,,,2004-09-30,F,GERANT DE BATIMENT RENOVATION DECORATION,,,,74.1J,NAFRev1,N,2.153381,48.373299,0.89,housenumber,28 Rue de la République 91690 Boissy-la-Rivière,91079_0032_00028,G,28 RUE DE LA REPUBLIQUE,
382197689,00047,38219768900047,O,2005-01-01,,,4399CZ,2019-11-14T14:01:05,true,3,,28,B,RUE,DE LA REPUBLIQUE,91690,BOISSY-LA-RIVIERE,,,91079,,,,,,,,,,,,,,,,,,,2014-05-31,F,,,,,43.99C,NAFRev2,N,2.152945,48.372704,0.95,housenumber,28b Rue de la République 91690 Boissy-la-Rivière,91079_0032_00028_b,G,28B RUE DE LA REPUBLIQUE,
382218048,00033,38221804800033,O,2001-04-02,,,,2019-11-14T14:01:05,false,4,,2,,RTE,DES NATIONS,91690,BOISSY-LA-RIVIERE,,,91079,,,,,,,,,,,,,,,,,,,2006-11-29,F,,,,,45.4C,NAFRev1,O,2.151499,48.376864,0.85,housenumber,2 Route des Nations 91690 Boissy-la-Rivière,91079_0027_00002,G,2 ROUTE DES NATIONS,
383194826,00038,38319482600038,O,,NN,,,2019-11-14T14:01:05,true,1,,,,,MONTOIR DE LA ROBINETTE,91690,BOISSY-LA-RIVIERE,,,91079,,,,,,,,,,,,,,,,,,,1996-12-31,F,,,,,01.4D,NAF1993,N,2.147253,48.383977,0.92,locality,Voie Communale Montoir de la Robinette 91690 Boissy-la-Rivière,91079_0056,G,VOIE C MONTOIR DE LA ROBINETTE,
383645850,00025,38364585000025,O,1991-11-06,NN,,,2021-08-18T03:43:57,false,4,,4,,RUE,DE LA REPUBLIQUE,91690,BOISSY-LA-RIVIERE,,,91079,,,,,,,,,,,,,,,,,,,2021-08-17,F,,,,,68.20B,NAFRev2,N,2.15463,48.375198,0.95,housenumber,4 Rue de la République 91690 Boissy-la-Rivière,91079_0032_00004,G,4 RUE DE LA REPUBLIQUE,
384792750,00018,38479275000018,O,,NN,,,2019-11-14T14:01:05,true,1,,15,,RUE,DE LA REPUBLIQUE,91690,BOISSY-LA-RIVIERE,,,91079,,,,,,,,,,,,,,,,,,,1994-12-31,F,,,,,45.1A,NAF1993,N,2.152316,48.371736,0.95,housenumber,15 Rue de la République 91690 Boissy-la-Rivière,91079_0032_00015,G,15 RUE DE LA REPUBLIQUE,
388919391,00010,38891939100010,O,1992-10-05,01,2019,8121ZZ,2021-10-27T08:16:24,true,5,MESNIL GIRAULT,,,RTE,DE GUIGNONVILLE,91690,BOISSY-LA-RIVIERE,,,91079,,,,,,,,,,,,,,,,,,,2010-08-23,A,LE MARQUIS DE CARABAS,,,,81.21Z,NAFRev2,O,2.200752,48.388872,0.32,street,Route de Marolles 91690 Boissy-la-Rivière,91079_0058,G,ROUTE DE MAROLLES,
390648301,00021,39064830100021,O,2021-04-28,,,,2021-07-09T08:56:36,true,1,,8,,CHE,DE MINAS,91690,BOISSY-LA-RIVIERE,,,91079,,,,,,,,,,,,,,,,,,,2021-04-28,A,,,,,68.20B,NAFRev2,N,2.146226,48.38641,0.68,street,Chemin de Minas 91690 Boissy-la-Rivière,91079_0005,G,CHEMIN DE MINAS,
390831857,00011,39083185700011,O,1993-04-01,NN,,,2021-11-19T03:36:43,true,4,,,,HAM,DE MESNIL GIRAULT,91690,BOISSY-LA-RIVIERE,,,91079,,,,,,,,,,,,,,,,,,,2021-08-18,F,,,,,68.20B,NAFRev2,N,2.159655,48.37575,0.91,street,Voie Communale Montoir de Mesnil Girault 91690 Boissy-la-Rivière,91079_0055,G,VOIE C MONTOIR DE MESNIL GIRAULT,
397539958,00025,39753995800025,O,1996-12-31,NN,,,2019-11-14T14:01:05,true,3,,28,,RUE,DE LA REPUBLIQUE,91690,BOISSY-LA-RIVIERE,,,91079,,,,,,,,,,,,,,,,,,,2005-12-31,F,,,,,45.2V,NAFRev1,N,2.153381,48.373299,0.95,housenumber,28 Rue de la République 91690 Boissy-la-Rivière,91079_0032_00028,G,28 RUE DE LA REPUBLIQUE,
397709874,00010,39770987400010,O,1994-05-31,,,,2019-11-14T14:01:05,false,4,,,,,MESNIL-GIRAULT,91690,BOISSY-LA-RIVIERE,,,91079,,,,,,,,,,,,,,,,,,,2001-01-06,F,,,,,74.2C,NAF1993,N,2.202418,48.389182,0.94,street,Mesnil Girault 91690 Boissy-la-Rivière,91079_B032,G,MESNIL GIRAULT,
400470696,00024,40047069600024,O,1995-04-22,,,,2019-11-14T14:01:05,true,4,,2,,RUE,DE LA REPUBLIQUE,91690,BOISSY-LA-RIVIERE,,,91079,,,,,,,,,,,,,,,,,,,2005-03-31,F,,,,,55.3A,NAFRev1,N,2.154708,48.375323,0.95,housenumber,2 Rue de la République 91690 Boissy-la-Rivière,91079_0032_00002,G,2 RUE DE LA REPUBLIQUE,
400663670,00018,40066367000018,O,,NN,,,2019-11-14T14:01:05,true,1,,4,,,MONTOIR DES GRANDS REBORDS,91690,BOISSY-LA-RIVIERE,,,91079,,,,,,,,,,,,,,,,,,,1997-03-31,F,,,,,01.4A,NAF1993,N,2.161603,48.373352,0.93,street,Voie Communale Montoir des Grands Rebords 91690 Boissy-la-Rivière,91079_0053,G,VOIE C MONTOIR DES GDS REBORDS,
400664348,00010,40066434800010,O,,NN,,,2019-11-14T14:01:05,true,1,,4,,,MONTOIR DES GRANDS REBORDS,91690,BOISSY-LA-RIVIERE,,,91079,,,,,,,,,,,,,,,,,,,1997-03-31,F,,,,,01.4A,NAF1993,N,2.161603,48.373352,0.93,street,Voie Communale Montoir des Grands Rebords 91690 Boissy-la-Rivière,91079_0053,G,VOIE C MONTOIR DES GDS REBORDS,
400664488,00014,40066448800014,O,,NN,,,2019-11-14T14:01:05,true,1,,4,,,MONTOIR DES GRANDS ARBRES,91690,BOISSY-LA-RIVIERE,,,91079,,,,,,,,,,,,,,,,,,,1997-03-31,F,,,,,01.4A,NAF1993,N,2.161603,48.373352,0.72,street,Voie Communale Montoir des Grands Rebords 91690 Boissy-la-Rivière,91079_0053,G,VOIE C MONTOIR DES GDS REBORDS,
401491915,00013,40149191500013,O,1995-04-01,NN,,,2019-11-14T14:01:05,false,4,,5,,CHE,DES CLERCS,91690,BOISSY-LA-RIVIERE,,,91079,,,,,,,,,,,,,,,,,,,1999-06-01,F,,,,,60.2L,NAF1993,O,2.141166,48.384878,0.84,housenumber,5 Chemin des Clercs 91690 Boissy-la-Rivière,91079_0007_00005,G,5 CHEMIN DES CLERCS,
402881015,00018,40288101500018,O,1995-10-17,NN,,,2019-11-14T14:01:05,false,4,,18,,RUE,DE LA DEMOCRATIE,91690,BOISSY-LA-RIVIERE,,,91079,,,,,,,,,,,,,,,,,,,1996-12-31,F,,,,,50.1Z,NAF1993,O,2.152626,48.3799,0.95,housenumber,18 Rue de la Démocratie 91690 Boissy-la-Rivière,91079_0010_00018,G,18 RUE DE LA DEMOCRATIE,
403035157,00037,40303515700037,O,2002-05-15,NN,,,2019-11-14T14:01:05,false,3,,,,RTE,D'ORMOY,91690,BOISSY-LA-RIVIERE,,,91079,,,,,,,,,,,,,,,,,,,2003-05-02,F,,,,,74.1E,NAFRev1,N,2.9770042,49.1984287,0.75,poi.track,Route d'Ormoy (Chemin) Coyolles,https://osm.org/way/119138363,G,,
403217938,00014,40321793800014,O,1996-01-04,NN,,,2019-11-14T14:01:05,true,4,,4,,CHE,DES CLERC,91690,BOISSY-LA-RIVIERE,,,91079,,,,,,,,,,,,,,,,,,,2011-01-12,F,,,,,49.32Z,NAFRev2,N,2.144722,48.385173,0.77,housenumber,4 Chemin des Clercs 91690 Boissy-la-Rivière,91079_0007_00004,G,4 CHEMIN DES CLERCS,
405004961,00018,40500496100018,O,1996-04-24,,,,2019-11-14T14:01:05,true,4,,,,,,91690,BOISSY-LA-RIVIERE,,,91079,,,,,,,,,,,,,,,,,,,1999-05-03,F,,,,,74.2C,NAF1993,N,,,0,,,,,,
405125659,00012,40512565900012,O,1985-12-31,NN,,,2019-11-14T14:01:05,true,3,LE MESNIL GIRAULT,,,,,91690,BOISSY-LA-RIVIERE,,,91079,,,,,,,,,,,,,,,,,,,2004-09-16,F,,,,,01.1A,NAFRev1,N,2.159655,48.37575,0.87,street,Voie Communale Montoir de Mesnil Girault 91690 Boissy-la-Rivière,91079_0055,D,VOIE C MONTOIR DE MESNIL GIRAULT,
408300911,00018,40830091100018,O,1996-07-16,,,,2019-11-14T14:01:05,false,4,,4,,,MONTOIR DES GRANDS REBORDS,91690,BOISSY-LA-RIVIERE,,,91079,,,,,,,,,,,,,,,,,,,2003-01-10,F,,,,,74.1J,NAFRev1,N,2.161603,48.373352,0.93,street,Voie Communale Montoir des Grands Rebords 91690 Boissy-la-Rivière,91079_0053,G,VOIE C MONTOIR DES GDS REBORDS,
408300911,00034,40830091100034,O,2003-01-10,02,2019,,2021-10-27T08:31:59,true,4,,,,RTE,DE MESNIL GIRAULT,91690,BOISSY-LA-RIVIERE,,,91079,,,,,,,,,,,,,,,,,,,2010-12-31,A,,,,,01.61Z,NAFRev2,O,2.159655,48.37575,0.76,street,Voie Communale Montoir de Mesnil Girault 91690 Boissy-la-Rivière,91079_0055,G,VOIE C MONTOIR DE MESNIL GIRAULT,