siren,nic,siret,statutDiffusionEtablissement,dateCreationEtablissement,trancheEffectifsEtablissement,anneeEffectifsEtablissement,activitePrincipaleRegistreMetiersEtablissement,dateDernierTraitementEtablissement,etablissementSiege,nombrePeriodesEtablissement,complementAdresseEtablissement,numeroVoieEtablissement,indiceRepetitionEtablissement,typeVoieEtablissement,libelleVoieEtablissement,codePostalEtablissement,libelleCommuneEtablissement,libelleCommuneEtrangerEtablissement,distributionSpecialeEtablissement,codeCommuneEtablissement,codeCedexEtablissement,libelleCedexEtablissement,codePaysEtrangerEtablissement,libellePaysEtrangerEtablissement,complementAdresse2Etablissement,numeroVoie2Etablissement,indiceRepetition2Etablissement,typeVoie2Etablissement,libelleVoie2Etablissement,codePostal2Etablissement,libelleCommune2Etablissement,libelleCommuneEtranger2Etablissement,distributionSpeciale2Etablissement,codeCommune2Etablissement,codeCedex2Etablissement,libelleCedex2Etablissement,codePaysEtranger2Etablissement,libellePaysEtranger2Etablissement,dateDebut,etatAdministratifEtablissement,enseigne1Etablissement,enseigne2Etablissement,enseigne3Etablissement,denominationUsuelleEtablissement,activitePrincipaleEtablissement,nomenclatureActivitePrincipaleEtablissement,caractereEmployeurEtablissement,longitude,latitude,geo_score,geo_type,geo_adresse,geo_id,geo_ligne,geo_l4,geo_l5
021500079,00013,02150007900013,O,1994-12-25,,,,2008-01-04T17:55:28,true,2,107 LES TERRASSES BAT 12,,,ALL,DES GENTIANES,13140,MIRAMAS,,,13063,,,,,,,,,,,,,,,,,,,2008-01-01,A,,,,,81.10Z,NAFRev2,N,5.007827,43.596409,0.85,street,Allee des Gentianes 13140 Miramas,13063_0402,G,ALLEE DES GENTIANES,
021519749,00010,02151974900010,O,1994-12-25,,,,2008-01-04T17:55:34,true,2,BAT CYTISE,,,RES,FONTLONGUE,13140,MIRAMAS,,,13063,,,,,,,,,,,,,,,,,,,2008-01-01,A,,,,,81.10Z,NAFRev2,N,5.003321,43.596319,0.35,street,Rue de Fontanié 13140 Miramas,13063_0242,G,RUE DE FONTANIE,
021522966,00015,02152296600015,O,1994-12-25,NN,,,2010-06-09T08:54:44,true,3,R DE VERDUN,,,RES,ESPIGUETTE,13140,MIRAMAS,,,13063,,,,,,,,,,,,,,,,,,,2008-12-31,A,,,,,81.10Z,NAFRev2,N,5.004373,43.58604,0.44,street,Rue de Verdun 13140 Miramas,13063_0850,D,RUE DE VERDUN,
054807904,00104,05480790400104,O,2000-06-19,NN,,,2008-04-26T08:10:08,false,3,QUA LES TERRES DE MAULIERE,,,BD,D ESPAGNE,13140,MIRAMAS,,,13063,,,,,,,,,,,,,,,,,,,2006-12-30,F,,,,,51.5F,NAFRev1,O,4.99503,43.595584,0.81,street,Boulevard d’Espagne 13140 Miramas,13063_0453,G,BOULEVARD D ESPAGNE,
056502958,00186,05650295800186,O,2020-09-23,,,,2020-10-19T08:32:19,false,1,VGE DE LA PERONNE,,,,ZAC DE LA PERONNE,13140,MIRAMAS,,,13063,,,,,,,,,,,,,,,,,,,2020-09-23,A,ROSSIGNOL,,,ROSSIGNOL,47.64Z,NAFRev2,O,4.994594,43.583692,0.75,street,Chemin de la Peronne 13140 Miramas,13063_0324,G,CHEMIN DE LA PERONNE,
056802820,00078,05680282000078,O,1995-03-01,NN,,,,false,4,DEPOT ALAMBIC ZA CARAIRE,,,AV,DES SALADELLES,13140,MIRAMAS,,,13063,,,,,,,,,,,,,,,,,,,1996-12-25,F,,,,,51.3J,NAF1993,O,5.007309,43.575687,0.85,street,Avenue des Saladelles 13140 Miramas,13063_0357,G,AVENUE DES SALADELLES,
056804412,00262,05680441200262,O,2004-03-01,,,,2006-10-26T23:35:59,false,3,,1,B,AV,JEAN MERMOZ,13140,MIRAMAS,,,13063,,,,,,,,,,,,,,,,,,,2004-12-25,F,,,,,70.2A,NAFRev1,O,5.006306,43.587031,0.76,housenumber,1bis Avenue Jean Mermoz 13140 Miramas,13063_0446_00001_bis,G,1BIS AVENUE JEAN MERMOZ,
057802357,00681,05780235700681,O,2008-09-29,,,,2009-01-16T16:44:42,false,2,,34,,AV,CHARLES DE GAULLE,13140,MIRAMAS,,,13063,,,,,,,,,,,,,,,,,,,2008-12-31,F,,,,,64.19Z,NAFRev2,O,5.001445,43.582705,0.89,housenumber,34 Avenue Charles de Gaulle 13140 Miramas,13063_0196_00034,G,34 AVENUE CHARLES DE GAULLE,
057802753,00574,05780275300574,O,1997-02-03,03,2019,,2021-10-27T08:03:10,false,3,,2,,RUE,DE VERDUN,13140,MIRAMAS,,,13063,,,,,,,,,,,,,,,,,,,2008-01-01,A,,,,,46.73A,NAFRev2,O,5.004445,43.585942,0.96,housenumber,2 Rue de Verdun 13140 Miramas,13063_0850_00002,G,2 RUE DE VERDUN,
058801481,00886,05880148100886,O,2002-12-18,02,2019,,2021-10-27T08:03:11,false,3,,,,AV,CHARLES DE GAULLE,13140,MIRAMAS,,,13063,,,,,,,,,,,,,,,,,,,2008-01-01,A,B.P.P.C.,,,,64.19Z,NAFRev2,O,5.001922,43.584256,0.88,street,Avenue Charles de Gaulle 13140 Miramas,13063_0196,G,AVENUE CHARLES DE GAULLE,
058811670,00130,05881167000130,O,1900-01-01,01,2019,,2021-10-27T08:03:12,false,3,HLM PROVENCE LOGIS,,,CITE,MOLIERE,13140,MIRAMAS,,,13063,,,,,,,,,,,,,,,,,,,2008-01-01,A,,,,,68.20A,NAFRev2,O,5.00341,43.595493,0.61,street,Les Demeures de Molieres 13140 Miramas,13063_t79h2k,G,LES DEMEURES DE MOLIERES,
062501275,00184,06250127500184,O,2017-02-27,,,,2017-03-06T14:11:08,false,1,VILLAGE DE MARQUE DE MIRAMAS LOCAL 66,,,CHE,DE LA PERONNE,13140,MIRAMAS,,,13063,,,,,,,,,,,,,,,,,,,2017-02-27,A,,,,,46.49Z,NAFRev2,O,4.994594,43.583692,0.85,street,Chemin de la Peronne 13140 Miramas,13063_0324,G,CHEMIN DE LA PERONNE,
072403348,00039,07240334800039,O,2013-04-01,,,,2016-05-20T03:44:27,true,2,LA ROUSSE,7,,PL,DES BALADINS,13140,MIRAMAS,,,13063,,,,,,,,,,,,,,,,,,,2016-02-01,F,,,,,62.09Z,NAFRev2,N,5.009163,43.593597,0.85,housenumber,7 Place des Baladins 13140 Miramas,13063_0095_00007,G,7 PLACE DES BALADINS,
072800691,00080,07280069100080,O,1993-01-01,12,2019,,2021-10-27T08:03:21,false,4,ZAC DES MOLIERES,,,RUE,DES PAYS BAS,13140,MIRAMAS,,,13063,,,,,,,,,,,,,,,,,,,2008-01-01,A,,,,,38.11Z,NAFRev2,O,4.995791,43.598156,0.96,street,Rue des Pays-Bas 13140 Miramas,13063_0594,G,RUE DES PAYS BAS,
073712861,00027,07371286100027,O,1976-06-01,,,,2008-11-07T00:16:21,false,4,,,,RUE,DU GENERAL LECLERC,13140,MIRAMAS,,,13063,,,,,,,,,,,,,,,,,,,2005-12-20,F,,,,,70.2C,NAFRev1,N,5.003024,43.58644,0.96,street,Rue du Général Leclerc 13140 Miramas,13063_0386,G,RUE DU GENERAL LECLERC,
073712861,00035,07371286100035,O,1999-05-01,NN,,,2008-01-04T18:10:11,true,3,PONT DE LA LEVEE,,,CHE,DE SERVICE,13140,MIRAMAS,,,13063,,,,,,,,,,,,,,,,,,,2008-01-01,A,,,,,68.20A,NAFRev2,N,5.004592,43.580453,0.83,street,Chemin de Service 13140 Miramas,13063_0790,G,CHEMIN DE SERVICE,
130005481,18079,13000548118079,O,2010-06-01,00,2019,,2021-10-27T08:03:40,false,3,,48,,AV,MARIUS CHALVE,13140,MIRAMAS,,,13063,,,,,,,,,,,,,,,,,,,2019-06-01,F,POLE EMPLOI MIRAMAS,,,,84.13Z,NAFRev2,O,4.997861,43.577379,0.88,housenumber,48 Avenue Marius Chalve 13140 Miramas,13063_0194_00048,G,48 AVENUE MARIUS CHALVE,
130005481,18343,13000548118343,O,2010-08-01,NN,,,2015-05-14T03:12:51,false,3,ESPACE BELEY,2,,AV,G FALABREGUES,13140,MIRAMAS,,,13063,,,,,,,,,,,,,,,,,,,2013-06-01,F,SITE MIRAMAS,,,,84.13Z,NAFRev2,O,4.998864,43.580421,0.77,housenumber,2 Avenue Falabregues 13140 Miramas,13063_0321_00002,G,2 AVENUE FALABREGUES,
130005481,25827,13000548125827,O,2018-09-01,,,,2018-08-27T11:01:11,false,1,,4,,BD,DOCTEUR JACQUES MINET,13140,MIRAMAS,,,13063,,,,,,,,,,,,,,,,,,,2018-09-01,A,POLE EMPLOI MIRAMAS,,,,84.13Z,NAFRev2,O,4.99803,43.576025,0.59,housenumber,4 Boulevard Jacques Minet 13140 Miramas,13063_0424_00004,G,4 BOULEVARD JACQUES MINET,
130013030,00478,13001303000478,O,2010-12-01,02,2019,,2021-10-27T08:03:56,false,2,,,,PL,JEAN JAURES,13140,MIRAMAS,,,13063,,,,,,,,,,,,,,,,,,,2021-01-01,F,TRESORERIE MIRAMAS,,,,84.11Z,NAFRev2,N,5.000434,43.579978,0.84,street,Place Jean Jaures 13140 Miramas,13063_0440,G,PLACE JEAN JAURES,
130022494,00509,13002249400509,O,2018-01-15,,,,2018-10-08T14:01:34,false,3,,14,,AV,MARIUS CHALVE,13140,MIRAMAS,,,13063,,,,,,,,,,,,,,,,,,,2018-10-08,F,CNPC,,,,85.42Z,NAFRev2,O,4.999851,43.579363,0.88,housenumber,14 Avenue Marius Chalve 13140 Miramas,13063_0194_00014,G,14 AVENUE MARIUS CHALVE,
130022494,00517,13002249400517,O,2018-10-08,,,,2019-04-04T14:16:51,false,1,,48,,AV,MARIUS CHALVE,13140,MIRAMAS,,,13063,,,,,,,,,,,,,,,,,,,2018-10-08,A,CNPC,,,,85.42Z,NAFRev2,N,4.997861,43.577379,0.88,housenumber,48 Avenue Marius Chalve 13140 Miramas,13063_0194_00048,G,48 AVENUE MARIUS CHALVE,
171302110,00712,17130211000712,O,2001-01-01,,,,2013-04-29T22:35:58,false,4,,,,PL,JEAN JAURES,13140,MIRAMAS,,,13063,,,,,,,,,,,,,,,,,,,2010-12-01,F,TRESORERIE DE MIRAMAS,,,,84.11Z,NAFRev2,N,5.000434,43.579978,0.84,street,Place Jean Jaures 13140 Miramas,13063_0440,G,PLACE JEAN JAURES,
171304314,00551,17130431400551,O,1985-01-01,NN,,,2008-01-04T18:14:29,false,3,,,,RUE,HENRI LANG,13140,MIRAMAS,,,13063,,,,,,,,,,,,,,,,,,,2008-01-01,A,COMMISSION CIRC PRESCOL ELEM,,,,84.12Z,NAFRev2,N,4.999547,43.587125,0.78,street,Rue Henry Lang 13140 Miramas,13063_0410,G,RUE HENRY LANG,
171304314,00569,17130431400569,O,1985-01-01,NN,,,,false,3,,,,PL,JEAN JAURES,13140,MIRAMAS,,,13063,,,,,,,,,,,,,,,,,,,1993-10-07,F,CIRC DE MIRAMAS,,,,75.1C,NAF1993,N,5.000434,43.579978,0.84,street,Place Jean Jaures 13140 Miramas,13063_0440,G,PLACE JEAN JAURES,
171304314,00940,17130431400940,O,2001-06-01,03,2019,,2021-10-27T08:04:09,false,3,BD A MAZET,,,ALL,DES LILAS,13140,MIRAMAS,,,13063,,,,,,,,,,,,,,,,,,,2008-01-01,A,CIRC 1 DEGRE IEN MIRAMAS,,,,84.12Z,NAFRev2,N,5.008957,43.596113,0.83,street,Allee des Lilas 13140 Miramas,13063_0432,G,ALLEE DES LILAS,
186400024,00169,18640002400169,O,2018-01-15,,,,2018-09-14T16:20:34,false,2,,14,,AV,MARIUS CHALVE,13140,MIRAMAS,,,13063,,,,,,,,,,,,,,,,,,,2018-09-17,F,CNPC,,,,85.42Z,NAFRev2,N,4.999851,43.579363,0.88,housenumber,14 Avenue Marius Chalve 13140 Miramas,13063_0194_00014,G,14 AVENUE MARIUS CHALVE,
186400024,00177,18640002400177,O,2018-09-17,,,,2018-09-14T16:20:34,false,1,,48,,AV,MARIUS CHALVE,13140,MIRAMAS,,,13063,,,,,,,,,,,,,,,,,,,2018-09-17,A,CNPC,,,,85.42Z,NAFRev2,N,4.997861,43.577379,0.88,housenumber,48 Avenue Marius Chalve 13140 Miramas,13063_0194_00048,G,48 AVENUE MARIUS CHALVE,
191301464,00019,19130146400019,O,1983-03-01,22,2019,,2021-10-27T08:04:43,true,3,,,,,MOLIERES,13140,MIRAMAS,,,13063,,,,,,,,,,,,,,,,,,,2008-01-01,A,,,,,85.32Z,NAFRev2,N,5.00341,43.595493,0.94,street,Les Demeures de Molieres 13140 Miramas,13063_t79h2k,G,LES DEMEURES DE MOLIERES,
191323260,00015,19132326000015,O,1983-03-01,21,2019,,2021-10-27T08:04:43,true,3,,,,BD,GUY DE MAUPASSANT,13140,MIRAMAS,,,13063,,,,,,,,,,,,,,,,,,,2008-01-01,A,CLG,,,,85.31Z,NAFRev2,N,-1.4547438,47.3995693,0.78,poi.school,École Guy de Maupassant Petit-Mars,https://osm.org/way/242997688,G,,
191323278,00017,19132327800017,O,1983-03-01,21,2019,,2021-10-27T08:04:43,true,3,,,,AV,DU LEVANT,13140,MIRAMAS,,,13063,,,,,,,,,,,,,,,,,,,2008-01-01,A,,,,,85.31Z,NAFRev2,N,5.010507,43.593758,0.81,street,Avenue du Levant 13140 Miramas,13063_0482,G,AVENUE DU LEVANT,
191324979,00019,19132497900019,O,1983-03-01,21,2019,,2021-10-27T08:04:43,true,3,,,,RUE,CARNOT,13140,MIRAMAS,,BP 21,13063,,,,,,,,,,,,,,,,,,,2008-01-01,A,,,,,85.31Z,NAFRev2,N,5.002881,43.582373,0.97,street,Rue Carnot 13140 Miramas,13063_0180,G,RUE CARNOT,
191331958,00014,19133195800014,O,1985-10-28,22,2019,,2021-10-27T08:04:43,true,3,,,,AV,JEAN COCTEAU,13140,MIRAMAS,,BP 33,13063,13141,MIRAMAS CEDEX,,,,,,,,,,,,,,,,,2008-01-01,A,,,,,85.31Z,NAFRev2,N,5.010176,43.587092,0.84,street,Avenue Jean Cocteau 13140 Miramas,13063_0131,G,AVENUE JEAN COCTEAU,
200033314,00036,20003331400036,O,2012-10-01,,,,2017-05-03T00:10:24,false,1,,,,AV,D ARLES,13140,MIRAMAS,,BP 121,13063,13148,MIRAMAS CEDEX,,,,,,,,,,,,,,,,,2012-10-01,A,ANTENNE MIRAMAS,,,,56.29B,NAFRev2,O,4.99552,43.583002,0.78,street,Avenue d’Arles 13140 Miramas,13063_0070,G,AVENUE D ARLES,
211300637,00017,21130063700017,O,1983-03-01,41,2019,,2021-10-27T08:06:51,true,4,,,,RUE,PIERRE TRISTANI,13140,MIRAMAS,,,13063,13148,MIRAMAS CEDEX,,,,,,,,,,,,,,,,,2008-01-01,A,MAIRIE,,,,84.11Z,NAFRev2,O,5.001925,43.58002,0.96,street,Rue Pierre Tristani 13140 Miramas,13063_0133,G,RUE PIERRE TRISTANI,
211300637,00033,21130063700033,O,1983-03-16,02,2019,,2021-10-27T08:06:51,false,3,ANNEXE ESPIGUETTE,,,AV,DE LA REPUBLIQUE,13140,MIRAMAS,,,13063,,,,,,,,,,,,,,,,,,,2008-01-01,A,COLONIE VACANCES VILLE MIRAMAS,,,,55.20Z,NAFRev2,N,5.003688,43.583234,0.88,street,Avenue de la République 13140 Miramas,13063_0710,G,AVENUE DE LA REPUBLIQUE,
211300637,00041,21130063700041,O,1983-12-21,11,2019,,2021-10-27T08:06:51,false,3,,,,PL,DES BALADINS,13140,MIRAMAS,,,13063,,,,,,,,,,,,,,,,,,,2008-01-01,A,ECOL PRIM GIONO (JEAN),,,,85.20Z,NAFRev2,N,5.009466,43.593757,0.84,street,Place des Baladins 13140 Miramas,13063_0095,G,PLACE DES BALADINS,
211300637,00058,21130063700058,O,1983-12-21,11,2019,,2021-10-27T08:06:51,false,3,,,,PL,DES BALADINS,13140,MIRAMAS,,,13063,,,,,,,,,,,,,,,,,,,2008-01-01,A,ECOL MATE GIONO (JEAN),,,,85.10Z,NAFRev2,N,5.009466,43.593757,0.84,street,Place des Baladins 13140 Miramas,13063_0095,G,PLACE DES BALADINS,
211300637,00066,21130063700066,O,1983-12-21,11,2019,,2021-10-27T08:06:51,false,3,,,,RUE,ALBERT CAMUS,13140,MIRAMAS,,,13063,,,,,,,,,,,,,,,,,,,2008-01-01,A,ECOL MATE MOLIERES (LES),,,,85.10Z,NAFRev2,N,5.005469,43.589494,0.96,street,Rue Albert Camus 13140 Miramas,13063_0042,G,RUE ALBERT CAMUS,
211300637,00074,21130063700074,O,1983-12-21,11,2019,,2021-10-27T08:06:51,false,3,,,,PL,DU FOIRAIL,13140,MIRAMAS,,,13063,,,,,,,,,,,,,,,,,,,2008-01-01,A,ECOL MATE CARRAIRE (LA),,,,85.10Z,NAFRev2,N,5.005162,43.57647,0.83,street,Place du Foirail 13140 Miramas,13063_0241,G,PLACE DU FOIRAIL,
211300637,00082,21130063700082,O,1983-12-21,11,2019,,2021-10-27T08:06:51,false,3,,,,PL,DU FOIRAIL,13140,MIRAMAS,,,13063,,,,,,,,,,,,,,,,,,,2008-01-01,A,ECOL PRIM CARRAIRE (LA),,,,85.20Z,NAFRev2,N,5.005162,43.57647,0.83,street,Place du Foirail 13140 Miramas,13063_0241,G,PLACE DU FOIRAIL,
211300637,00090,21130063700090,O,1983-12-21,11,2019,,2021-10-27T08:06:51,false,4,,,,AV,DE LA CAMARGUE,13140,MIRAMAS,,,13063,,,,,,,,,,,,,,,,,,,2008-02-07,A,ECOLE PRIMAIRE CHNATEGRIVE,,,,85.20Z,NAFRev2,N,4.997132,43.589507,0.86,street,Avenue de la Camargue 13140 Miramas,13063_0155,G,AVENUE DE LA CAMARGUE,
211300637,00108,21130063700108,O,1983-12-21,01,2019,,2021-10-27T08:06:51,false,3,,,,,LES 4 CHEMINS,13140,MIRAMAS,,,13063,,,,,,,,,,,,,,,,,,,2008-01-01,A,ECOL MATE CITE GAROUVIN,,,,85.10Z,NAFRev2,N,5.019154,43.571774,0.94,street,Rond Point les 4 Chemins 13140 Miramas,13063_4gcy8u,G,ROND POINT LES 4 CHEMINS,
211300637,00116,21130063700116,O,1983-12-21,11,2019,,2021-10-27T08:06:51,false,3,,,,RUE,SIMIAN JAUFFRET,13140,MIRAMAS,,,13063,,,,,,,,,,,,,,,,,,,2008-01-01,A,ECOL PRIM MACE (JEAN),,,,85.20Z,NAFRev2,N,5.002441,43.583209,0.96,street,Rue Simian Jauffret 13140 Miramas,13063_0800,G,RUE SIMIAN JAUFFRET,
211300637,00124,21130063700124,O,1983-12-21,11,2019,,2021-10-27T08:06:51,false,3,,22,,RUE,JOURDAN,13140,MIRAMAS,,,13063,,,,,,,,,,,,,,,,,,,2008-01-01,A,E.M. PU JOURDAN,,,,85.10Z,NAFRev2,N,4.99873,43.581987,0.97,housenumber,22 Rue Jourdan 13140 Miramas,13063_0460_00022,G,22 RUE JOURDAN,
211300637,00132,21130063700132,O,1983-12-21,11,2019,,2021-10-27T08:06:51,false,3,,,,RUE,HENRI LANG,13140,MIRAMAS,,,13063,,,,,,,,,,,,,,,,,,,2008-01-01,A,ECOL PRIM FERRY (JULES),,,,85.20Z,NAFRev2,N,4.999547,43.587125,0.78,street,Rue Henry Lang 13140 Miramas,13063_0410,G,RUE HENRY LANG,
211300637,00140,21130063700140,O,1983-12-21,11,2019,,2021-10-27T08:06:51,false,3,,,,AV,JEAN MOULIN,13140,MIRAMAS,,,13063,,,,,,,,,,,,,,,,,,,2008-01-01,A,ECOL PRIM MOULIN (JEAN),,,,85.20Z,NAFRev2,N,5.006677,43.578574,0.85,street,Avenue Jean Moulin 13140 Miramas,13063_0449,G,AVENUE JEAN MOULIN,
211300637,00157,21130063700157,O,1983-12-21,NN,,,,false,4,PL,,,PL,DE L AVENIR,13140,MIRAMAS,,,13063,,,,,,,,,,,,,,,,,,,1998-08-31,F,ECOL MATE GRESSET (MARCEL),,,,80.1Z,NAF1993,N,5.002435,43.588921,0.83,street,Place de l’Avenir 13140 Miramas,13063_0077,G,PLACE DE L AVENIR,
211300637,00165,21130063700165,O,1983-12-21,12,2019,,2021-10-27T08:06:51,false,3,,,,AV,AUGUSTE PONS,13140,MIRAMAS,,,13063,,,,,,,,,,,,,,,,,,,2008-01-01,A,ECOL PRIM PHILIPPE (GERARD),,,,85.20Z,NAFRev2,N,4.996005,43.577046,0.84,street,Avenue Auguste Pons 13140 Miramas,13063_0093,G,AVENUE AUGUSTE PONS,
211300637,00173,21130063700173,O,1983-12-21,03,2019,,2021-10-27T08:06:51,false,3,,,,AV,DE LA CAMARGUE,13140,MIRAMAS,,,13063,,,,,,,,,,,,,,,,,,,2008-01-01,A,ECOL MATE CHANTEGRIVE,,,,85.10Z,NAFRev2,N,4.997132,43.589507,0.86,street,Avenue de la Camargue 13140 Miramas,13063_0155,G,AVENUE DE LA CAMARGUE,
211300637,00181,21130063700181,O,1983-12-21,11,2019,,2021-10-27T08:06:51,false,3,,,,AV,DU PONANT,13140,MIRAMAS,,,13063,,,,,,,,,,,,,,,,,,,2008-01-01,A,ECOL PRIM ROUSSE-LES-MOLIERES,,,,85.20Z,NAFRev2,N,5.00626,43.592674,0.81,street,Avenue du Ponant 13140 Miramas,13063_0631,G,AVENUE DU PONANT,
211300637,00199,21130063700199,O,1983-12-21,11,2019,,2021-10-27T08:06:51,false,3,,,,AV,DU PONANT,13140,MIRAMAS,,,13063,,,,,,,,,,,,,,,,,,,2008-01-01,A,ECOL MATE ROUSSE-LES-MOLIERES,,,,85.10Z,NAFRev2,N,5.00626,43.592674,0.81,street,Avenue du Ponant 13140 Miramas,13063_0631,G,AVENUE DU PONANT,
211300637,00207,21130063700207,O,1983-12-21,NN,,,2007-05-19T08:13:22,false,3,,,,AV,AUGUSTE PONS,13140,MIRAMAS,,,13063,,,,,,,,,,,,,,,,,,,2006-05-18,F,ECOL MATE PHILIPPE (GERARD),,,,80.1Z,NAFRev1,N,4.996005,43.577046,0.84,street,Avenue Auguste Pons 13140 Miramas,13063_0093,G,AVENUE AUGUSTE PONS,
211300637,00215,21130063700215,O,1983-12-21,11,2019,,2021-10-27T08:06:51,false,3,,,,PL,DES JONQUILLES,13140,MIRAMAS,,,13063,,,,,,,,,,,,,,,,,,,2008-01-01,A,ECOL PRIM CEZANNE (PAUL),,,,85.20Z,NAFRev2,N,5.009099,43.59739,0.84,street,Place des Jonquilles 13140 Miramas,13063_0434,G,PLACE DES JONQUILLES,
211300637,00223,21130063700223,O,1983-12-21,02,2019,,2021-10-27T08:06:51,false,3,,,,PL,DES JONQUILLES,13140,MIRAMAS,,,13063,,,,,,,,,,,,,,,,,,,2008-01-01,A,ECOL MATE CEZANNE (PAUL),,,,85.10Z,NAFRev2,N,5.009099,43.59739,0.84,street,Place des Jonquilles 13140 Miramas,13063_0434,G,PLACE DES JONQUILLES,
211300637,00231,21130063700231,O,1983-12-21,11,2019,,2021-10-27T08:06:51,false,3,,,,PL,DE L AVENIR,13140,MIRAMAS,,,13063,,,,,,,,,,,,,,,,,,,2008-01-01,A,ECOL PRIM GRESSET (MARCEL),,,,85.20Z,NAFRev2,N,5.002435,43.588921,0.83,street,Place de l’Avenir 13140 Miramas,13063_0077,G,PLACE DE L AVENIR,
211300637,00249,21130063700249,O,1983-12-21,01,2019,,2021-10-27T08:06:51,false,3,,,,LD,MIRAMAS VILLAGE,13140,MIRAMAS,,,13063,,,,,,,,,,,,,,,,,,,2008-01-01,A,ECOL PRIM VILLAGE,,,,85.20Z,NAFRev2,N,5.002278,43.581838,0.61,street,Rue Paul Vaillant Couturier 13140 Miramas,13063_0840,G,RUE PAUL VAILLANT COUTURIER,
211300637,00256,21130063700256,O,1984-08-20,11,2019,,2021-10-27T08:06:51,false,3,,,,,ZAC LA ROUSSE,13140,MIRAMAS,,,13063,,,,,,,,,,,,,,,,,,,2008-01-01,A,ECOLE PRIMAIRE PUBLIQUE LA MAILLE 3,,,,85.20Z,NAFRev2,N,3.6124268,46.2456261,0.7,poi.retail,ZAC Les Prés de la Grande Route (Zone commerciale) Lapalisse,https://osm.org/way/95867684,G,,
211300637,00272,21130063700272,O,1986-01-01,01,2019,,2021-10-27T08:06:51,false,3,,,,AV,JEAN MOULIN,13140,MIRAMAS,,,13063,,,,,,,,,,,,,,,,,,,2008-01-01,A,ECOLE PRIM J MOULIN QU SUD,,,,85.20Z,NAFRev2,N,5.006677,43.578574,0.85,street,Avenue Jean Moulin 13140 Miramas,13063_0449,G,AVENUE JEAN MOULIN,
211300637,00280,21130063700280,O,2001-01-15,03,2019,,2021-10-27T08:06:51,false,3,HOTEL DE VILLE,,,RUE,PIERRE TRISTANI,13140,MIRAMAS,,,13063,,,,,,,,,,,,,,,,,,,2008-01-01,A,SERVICE FUNERAIRE,,,,96.03Z,NAFRev2,N,5.001925,43.58002,0.96,street,Rue Pierre Tristani 13140 Miramas,13063_0133,G,RUE PIERRE TRISTANI,
221300015,01310,22130001501310,O,1983-01-01,NN,,,2021-10-08T13:58:07,false,4,ZAC LA ROUSSE,1,,PL,DES BALADINS,13140,MIRAMAS,,,13063,,,,,,,,,,,,,,,,,,,2020-12-25,A,CENTRE PMI LA ROUSSE,,,,86.22C,NAFRev2,N,5.009466,43.593757,0.74,street,Place des Baladins 13140 Miramas,13063_0095,G,PLACE DES BALADINS,
221300015,01583,22130001501583,O,1983-01-01,NN,,,2008-01-04T18:46:16,false,3,ZAC LA CARRAIRE,,,PL,DU FOIRAIL,13140,MIRAMAS,,,13063,,,,,,,,,,,,,,,,,,,2008-01-01,A,CTRE MEDICO SOCIAL LA CARRAIRE,,,,86.21Z,NAFRev2,N,5.005162,43.57647,0.83,street,Place du Foirail 13140 Miramas,13063_0241,G,PLACE DU FOIRAIL,
251301545,00041,25130154500041,O,2015-06-18,11,2019,,2021-10-27T08:11:58,true,1,,1,,AV,MARCO POLO,13140,MIRAMAS,,CS 20100,13063,,,,,,,,,,,,,,,,,,,2015-06-18,A,,,,,84.13Z,NAFRev2,O,5.000879,43.609365,0.84,housenumber,1 Avenue Marco Polo 13140 Miramas,13063_0526_00001,G,1 AVENUE MARCO POLO,
251301719,00034,25130171900034,O,2002-06-18,NN,,,2018-09-29T12:07:37,true,4,CLESUD GIRAT TOUPIGUIERE,,,,MOLIERES,13140,MIRAMAS,,BP 44,13063,13142,MIRAMAS CEDEX,,,,,,,,,,,,,,,,,2016-12-27,F,,,,,42.99Z,NAFRev2,O,5.00341,43.595493,0.94,street,Les Demeures de Molieres 13140 Miramas,13063_t79h2k,G,LES DEMEURES DE MOLIERES,
251302162,00010,25130216200010,O,1999-02-01,01,2019,,2021-10-27T08:11:58,true,5,MAIRIE,,,RUE,PIERRE TRISTANI,13140,MIRAMAS,,,13063,,,,,,,,PL,JEAN JAURES,13140,MIRAMAS,,,13063,,,,,2008-01-01,A,,,,,84.13Z,NAFRev2,O,5.001925,43.58002,0.96,street,Rue Pierre Tristani 13140 Miramas,13063_0133,G,RUE PIERRE TRISTANI,
261300115,00365,26130011500365,O,1983-03-01,12,2019,,2021-10-27T08:12:38,false,4,ZAC DE LA ROUSSE,,,PL,DES VENTS PROVENCAUX,13140,MIRAMAS,,,13063,,,,,,,,,,,,,,,,,,,2008-01-01,A,CATTP DE MIRAMAS,,,,88.99B,NAFRev2,O,5.008894,43.592654,0.88,street,Place des Vents Provencaux 13140 Miramas,13063_0846,G,PLACE DES VENTS PROVENCAUX,
261300198,00080,26130019800080,O,1983-03-01,NN,,,2009-06-27T03:30:27,false,3,BAT LE TRIDENT ZAC LA RO,1,,RUE,DE LA GIROUETTE,13140,MIRAMAS,,,13063,,,,,,,,,,,,,,,,,,,2008-01-01,A,CMP DE MIRAMAS,,,,86.21Z,NAFRev2,N,5.009728,43.593092,0.88,street,Rue de la Girouette 13140 Miramas,13063_0396,G,RUE DE LA GIROUETTE,
261301352,00017,26130135200017,O,1983-03-01,NN,,,2010-06-26T03:04:47,true,3,,,,RUE,FREDERIC MISTRAL,13140,MIRAMAS,,,13063,,,,,,,,,,,,,,,,,,,2008-01-01,A,CDE,,,,88.99B,NAFRev2,N,5.024433,43.563446,0.96,street,Rue Frederic Mistral 13140 Miramas,13063_0350,G,RUE FREDERIC MISTRAL,
261301360,00010,26130136000010,O,1983-03-01,NN,,,2020-08-25T10:20:48,false,5,,,,RUE,FREDERIC MISTRAL,13140,MIRAMAS,,,13063,,,,,,,,,,,,,,,,,,,2018-09-03,F,CCAS,,,,88.99B,NAFRev2,O,5.024433,43.563446,0.96,street,Rue Frederic Mistral 13140 Miramas,13063_0350,G,RUE FREDERIC MISTRAL,
261301360,00028,26130136000028,O,2018-09-03,21,2019,,2021-10-27T08:12:38,true,1,,4,,BD,DOCTEUR JACQUES MINET,13140,MIRAMAS,,,13063,,,,,,,,,,,,,,,,,,,2018-09-03,A,,,,,88.99B,NAFRev2,O,4.99803,43.576025,0.59,housenumber,4 Boulevard Jacques Minet 13140 Miramas,13063_0424_00004,G,4 BOULEVARD JACQUES MINET,
291301067,00018,29130106700018,O,1983-08-10,NN,,,2014-02-04T11:25:33,true,4,,,,RUE,DU 4 SEPTEMBRE,13140,MIRAMAS,,,13063,,,,,,,,,,,,,,,,,,,1993-10-07,F,,,,,70.1C,NAF1993,N,2.5079894,49.9093395,0.9,poi,Rue du 4 Septembre (Pont) Corbie,https://osm.org/way/90447692,G,,
291303261,00015,29130326100015,O,1983-01-01,,,,2021-02-08T11:16:23,true,3,MAIRIE,,,RUE,PIERRE TRISTANI,13140,MIRAMAS,,,13063,,,,,,,,,,,,,,,,,,,2003-12-25,F,,,,,70.1C,NAFRev1,N,5.001925,43.58002,0.96,street,Rue Pierre Tristani 13140 Miramas,13063_0133,G,RUE PIERRE TRISTANI,
300440039,00018,30044003900018,O,,,,,,true,1,,,,AV,CHARLES DE GAULLE,13140,MIRAMAS,,,13063,,,,,,,,,,,,,,,,,,,1984-12-25,F,,,,,,,N,5.001922,43.584256,0.88,street,Avenue Charles de Gaulle 13140 Miramas,13063_0196,G,AVENUE CHARLES DE GAULLE,
300462686,00027,30046268600027,O,1900-01-01,02,2019,4332BB,2021-10-27T08:13:44,true,4,,,,,PICHOLINY,13140,MIRAMAS,,,13063,,,,,,,,,,,,,,,,,,,2008-01-01,A,,,,,43.32B,NAFRev2,O,5.013444,43.558746,0.95,street,Picholiny 13140 Miramas,13063_a3adtv,G,PICHOLINY,
300466158,00015,30046615800015,O,,,,,,true,1,,10,,AV,CHARLES DE GAULLE,13140,MIRAMAS,,,13063,,,,,,,,,,,,,,,,,,,1987-05-13,F,,,,,55.3A,NAF1993,N,5.000964,43.581194,0.89,housenumber,10 Avenue Charles de Gaulle 13140 Miramas,13063_0196_00010,G,10 AVENUE CHARLES DE GAULLE,
300477460,00038,30047746000038,O,1984-11-01,NN,,,2008-01-04T19:10:27,true,3,,72,,AV,CHARLES DE GAULLE,13140,MIRAMAS,,,13063,,,,,,,,,,,,,,,,,,,2008-01-01,A,,,,,68.20B,NAFRev2,N,5.002439,43.586191,0.89,housenumber,72 Avenue Charles de Gaulle 13140 Miramas,13063_0196_00072,G,72 AVENUE CHARLES DE GAULLE,
300538717,00046,30053871700046,O,2009-06-01,,,,2012-11-09T00:11:16,true,2,,6,,AV,JEAN MOULIN,13140,MIRAMAS,,,13063,,,,,,,,,,,,,,,,,,,2009-09-07,F,,,,,47.89Z,NAFRev2,N,5.001878,43.579463,0.86,housenumber,6 Avenue Jean Moulin 13140 Miramas,13063_0449_00006,G,6 AVENUE JEAN MOULIN,