siren,nic,siret,statutDiffusionEtablissement,dateCreationEtablissement,trancheEffectifsEtablissement,anneeEffectifsEtablissement,activitePrincipaleRegistreMetiersEtablissement,dateDernierTraitementEtablissement,etablissementSiege,nombrePeriodesEtablissement,complementAdresseEtablissement,numeroVoieEtablissement,indiceRepetitionEtablissement,typeVoieEtablissement,libelleVoieEtablissement,codePostalEtablissement,libelleCommuneEtablissement,libelleCommuneEtrangerEtablissement,distributionSpecialeEtablissement,codeCommuneEtablissement,codeCedexEtablissement,libelleCedexEtablissement,codePaysEtrangerEtablissement,libellePaysEtrangerEtablissement,complementAdresse2Etablissement,numeroVoie2Etablissement,indiceRepetition2Etablissement,typeVoie2Etablissement,libelleVoie2Etablissement,codePostal2Etablissement,libelleCommune2Etablissement,libelleCommuneEtranger2Etablissement,distributionSpeciale2Etablissement,codeCommune2Etablissement,codeCedex2Etablissement,libelleCedex2Etablissement,codePaysEtranger2Etablissement,libellePaysEtranger2Etablissement,dateDebut,etatAdministratifEtablissement,enseigne1Etablissement,enseigne2Etablissement,enseigne3Etablissement,denominationUsuelleEtablissement,activitePrincipaleEtablissement,nomenclatureActivitePrincipaleEtablissement,caractereEmployeurEtablissement,longitude,latitude,geo_score,geo_type,geo_adresse,geo_id,geo_ligne,geo_l4,geo_l5
212311203,00013,21231120300013,O,1983-03-01,11,2019,,2021-10-27T08:07:20,true,4,,,,PL,DE L'EGLISE,23360,LOURDOUEIX-SAINT-PIERRE,,,23112,,,,,,,,,,,,,,,,,,,2008-01-01,A,MAIRIE,,,,84.11Z,NAFRev2,O,1.821838,46.408961,0.82,street,Place de l’Eglise 23360 Lourdoueix-Saint-Pierre,23112_0150,G,PLACE DE L EGLISE,
212311203,00047,21231120300047,O,1983-12-21,01,2019,,2021-10-27T08:07:20,false,3,,,,PL,DE L'EGLISE,23360,LOURDOUEIX-SAINT-PIERRE,,,23112,,,,,,,,,,,,,,,,,,,2008-01-01,A,ECOLE PRIMAIRE PUBLIQUE,,,,85.20Z,NAFRev2,N,1.821838,46.408961,0.82,street,Place de l’Eglise 23360 Lourdoueix-Saint-Pierre,23112_0150,G,PLACE DE L EGLISE,
212311203,00054,21231120300054,O,1983-12-21,NN,,,2019-11-14T14:00:24,false,4,,,,,HAMEAU LE LIGNAUD,23360,LOURDOUEIX-SAINT-PIERRE,,,23112,,,,,,,,,,,,,,,,,,,1997-12-31,F,ECOLE PRIMAIRE PUBLIQUE,,,,80.1Z,NAF1993,N,1.772878,46.377435,0.5,street,Lignaud 23360 Lourdoueix-Saint-Pierre,23112_w54eao,G,LIGNAUD,
212311203,00062,21231120300062,O,1997-01-01,NN,,,2019-11-14T14:00:24,false,3,MAIRIE,,,PL,DE L'EGLISE,23360,LOURDOUEIX-SAINT-PIERRE,,,23112,,,,,,,,,,,,,,,,,,,2008-01-01,A,SERVICE D'EAU,,,,36.00Z,NAFRev2,N,1.821838,46.408961,0.82,street,Place de l’Eglise 23360 Lourdoueix-Saint-Pierre,23112_0150,G,PLACE DE L EGLISE,
212311203,00070,21231120300070,O,1995-12-25,NN,,,2019-11-14T14:00:24,false,4,MAIRIE,,,PL,DE L'EGLISE,23360,LOURDOUEIX-SAINT-PIERRE,,,23112,,,,,,,,,,,,,,,,,,,2008-01-01,F,SERVICE DE TRANSPORT SCOLAIRE,,,,49.39A,NAFRev2,N,1.821838,46.408961,0.82,street,Place de l’Eglise 23360 Lourdoueix-Saint-Pierre,23112_0150,G,PLACE DE L EGLISE,
212326656,00015,21232665600015,O,2002-12-25,,,,2019-11-14T14:00:24,true,2,MAIRIE,,,PL,DE L'EGLISE,23360,LOURDOUEIX-SAINT-PIERRE,,,23112,,,,,,,,,,,,,,,,,,,2008-01-01,A,,,,,84.11Z,NAFRev2,N,1.821838,46.408961,0.82,street,Place de l’Eglise 23360 Lourdoueix-Saint-Pierre,23112_0150,G,PLACE DE L EGLISE,
262311202,00010,26231120200010,O,1983-03-01,NN,,,2019-11-14T14:00:24,true,4,MAIRIE,,,PL,DE L'EGLISE,23360,LOURDOUEIX-SAINT-PIERRE,,,23112,,,,,,,,,,,,,,,,,,,2016-01-01,F,CCAS,,,,88.99B,NAFRev2,N,1.821838,46.408961,0.82,street,Place de l’Eglise 23360 Lourdoueix-Saint-Pierre,23112_0150,G,PLACE DE L EGLISE,
262311210,00013,26231121000013,O,1983-03-01,NN,,,2019-11-14T14:00:24,true,3,MAIRIE,,,PL,DE L'EGLISE,23360,LOURDOUEIX-SAINT-PIERRE,,,23112,,,,,,,,,,,,,,,,,,,2006-12-25,F,CDE,,,,85.3K,NAFRev1,N,1.821838,46.408961,0.82,street,Place de l’Eglise 23360 Lourdoueix-Saint-Pierre,23112_0150,G,PLACE DE L EGLISE,
301577722,00012,30157772200012,O,1975-01-01,NN,,,2019-11-14T14:00:24,true,3,,,,LD,LES SIGNOLLES,23360,LOURDOUEIX-SAINT-PIERRE,,,23112,,,,,,,,,,,,,,,,,,,2006-12-31,F,,,,,01.4A,NAFRev1,N,1.845301,46.39763,0.95,street,Les Signolles 23360 Lourdoueix-Saint-Pierre,23112_h3t03k,G,LES SIGNOLLES,
302020144,00184,30202014400184,O,1997-09-30,,,,2019-11-14T14:00:24,false,4,,,,LD,LIGNAUD,23360,LOURDOUEIX-SAINT-PIERRE,,,23112,,,,,,,,,,,,,,,,,,,2012-11-01,F,,,,,08.12Z,NAFRev2,N,1.772878,46.377435,0.95,street,Lignaud 23360 Lourdoueix-Saint-Pierre,23112_w54eao,G,LIGNAUD,
306585902,00019,30658590200019,O,,,,,2019-11-14T14:00:24,true,1,,,,,LE MERSOLLE,23360,LOURDOUEIX-SAINT-PIERRE,,,23112,,,,,,,,,,,,,,,,,,,1985-12-25,F,,,,,67.01,NAP,N,1.845301,46.39763,0.35,street,Les Signolles 23360 Lourdoueix-Saint-Pierre,23112_h3t03k,G,LES SIGNOLLES,
306594128,00010,30659412800010,O,,NN,,,2019-11-14T14:00:24,true,1,,,,,MAIRIE,23360,LOURDOUEIX-SAINT-PIERRE,,,23112,,,,,,,,,,,,,,,,,,,,F,,,,,97.23,NAP,N,1.817464,46.405237,0.38,street,La Vacherie 23360 Lourdoueix-Saint-Pierre,23112_5vlm1v,G,LA VACHERIE,
307164111,00014,30716411100014,O,1964-01-01,,,,2019-11-14T14:00:24,true,1,,,,LD,MA CHAUMIERE,23360,LOURDOUEIX-SAINT-PIERRE,,,23112,,,,,,,,,,,,,,,,,,,2000-06-30,F,,,,,45.4C,NAF1993,N,6.078011,44.560816,0.9,poi.hotel,Hôtel Ma Chaumière Gap,https://osm.org/node/1055061310,G,,
308712520,00011,30871252000011,O,1900-01-01,NN,,,2019-11-14T14:00:24,true,3,,,,,,23360,LOURDOUEIX-SAINT-PIERRE,,,23112,,,,,,,,,,,,,,,,,,,2008-01-01,A,,,,,93.12Z,NAFRev2,N,,,0,,,,,,
311269310,00018,31126931000018,O,,,,,2019-11-14T14:00:24,true,1,,,,LD,AUX ROCHELAS,23360,LOURDOUEIX-SAINT-PIERRE,,,23112,,,,,,,,,,,,,,,,,,,1984-12-25,F,,,,,67.04,NAP,N,1.855778,46.396401,0.65,street,Les Rochelas 23360 Lourdoueix-Saint-Pierre,23112_xt5wlo,G,LES ROCHELAS,
312875867,00011,31287586700011,O,1978-01-01,NN,,,2019-11-14T14:00:24,true,3,,,,,SANCY,23360,LOURDOUEIX-SAINT-PIERRE,,,23112,,,,,,,,,,,,,,,,,,,2008-01-01,A,,,,,68.20B,NAFRev2,N,1.816376,46.381419,0.43,locality,La Chaume Blanche 23360 Lourdoueix-Saint-Pierre,23112_B266,G,LA CHAUME BLANCHE,
313122749,00028,31312274900028,O,1994-01-01,NN,,,2019-11-14T14:00:24,true,1,,,,,LA MERSOLLE,23360,LOURDOUEIX-SAINT-PIERRE,,,23112,,,,,,,,,,,,,,,,,,,2002-06-30,F,,,,,45.2V,NAF1993,N,1.848677,46.431869,0.4,locality,La Taille du Bourliat 23360 Lourdoueix-Saint-Pierre,23112_B226,G,LA TAILLE DU BOURLIAT,
313213282,00012,31321328200012,O,,NN,,,2019-11-14T14:00:24,true,1,,,,,LE BOURLIAT,23360,LOURDOUEIX-SAINT-PIERRE,,,23112,,,,,,,,,,,,,,,,,,,,F,,,,,01.50,NAP,N,1.860963,46.42853,0.94,street,Le Bourliat 23360 Lourdoueix-Saint-Pierre,23112_udiq4a,G,LE BOURLIAT,
314931098,00029,31493109800029,O,1982-12-31,NN,,,2021-02-23T10:40:56,true,3,,,,,MA CHAUMIERE,23360,LOURDOUEIX-SAINT-PIERRE,,,23112,,,,,,,,,,,,,,,,,,,2008-01-01,A,,,,,01.42Z,NAFRev2,N,6.078011,44.560816,0.9,poi.hotel,Hôtel Ma Chaumière Gap,https://osm.org/node/1055061310,G,,
317878783,00016,31787878300016,O,1980-01-01,NN,,,2019-11-14T14:00:24,true,4,,,,,AIGUDE HAUT,23360,LOURDOUEIX-SAINT-PIERRE,,,23112,,,,,,,,,,,,,,,,,,,2002-12-31,F,,,,,67.2Z,NAF1993,N,1.803437,46.402122,0.94,street,Aigude Haut 23360 Lourdoueix-Saint-Pierre,23112_B003,G,AIGUDE HAUT,
319186672,00022,31918667200022,O,,NN,,,2019-11-14T14:00:24,true,1,,,,,CHOUEIX,23360,LOURDOUEIX-SAINT-PIERRE,,,23112,,,,,,,,,,,,,,,,,,,,F,,,,,55.10,NAP,N,1.859334,46.405369,0.95,street,Choueix 23360 Lourdoueix-Saint-Pierre,23112_6qk2me,G,CHOUEIX,
320145147,00015,32014514700015,O,,NN,,,2019-11-14T14:00:24,true,1,,,,CHE,DE VOST,23360,LOURDOUEIX-SAINT-PIERRE,,,23112,,,,,,,,,,,,,,,,,,,,F,,,,,60.09,NAP,N,1.84892,46.40351,0.71,locality,Chateau de Vost 23360 Lourdoueix-Saint-Pierre,23112_B062,G,CHATEAU DE VOST,
320643646,00013,32064364600013,O,,NN,,,2019-11-14T14:00:24,true,1,,,,,LA BRANDE DU BOURLIAT,23360,LOURDOUEIX-SAINT-PIERRE,,,23112,,,,,,,,,,,,,,,,,,,1994-12-31,F,,,,,29.3D,NAF1993,N,1.855158,46.43351,0.94,locality,La Brande du Bourliat 23360 Lourdoueix-Saint-Pierre,23112_B035,G,LA BRANDE DU BOURLIAT,
320878499,00013,32087849900013,O,1981-01-05,NN,,,2019-11-14T14:00:24,false,7,,,,,LE BOURG,23360,LOURDOUEIX-SAINT-PIERRE,,,23112,,,,,,,,,,,,,,,,,,,2012-12-29,F,,,,,68.20B,NAFRev2,N,1.860963,46.42853,0.72,street,Le Bourliat 23360 Lourdoueix-Saint-Pierre,23112_udiq4a,G,LE BOURLIAT,
321006314,00017,32100631400017,O,,NN,,,2019-11-14T14:00:24,true,1,,,,,VILLECHIRON,23360,LOURDOUEIX-SAINT-PIERRE,,,23112,,,,,,,,,,,,,,,,,,,1992-12-16,F,,,,,01.1A,NAF1993,N,1.79383,46.36526,0.95,street,Villechiron 23360 Lourdoueix-Saint-Pierre,23112_xod649,G,VILLECHIRON,
321294894,00019,32129489400019,O,,,,,2019-11-14T14:00:24,true,1,,,,,LE BOURLIAT,23360,LOURDOUEIX-SAINT-PIERRE,,,23112,,,,,,,,,,,,,,,,,,,1984-12-25,F,,,,,55.73,NAP,N,1.860963,46.42853,0.94,street,Le Bourliat 23360 Lourdoueix-Saint-Pierre,23112_udiq4a,G,LE BOURLIAT,
322865940,00025,32286594000025,O,1991-04-01,NN,,,2019-11-14T14:00:24,false,4,RTE DE DUN LE PALESTEL,,,,LE SANCY,23360,LOURDOUEIX-SAINT-PIERRE,,,23112,,,,,,,,,,,,,,,,,,,1994-12-25,F,SNT GENTAL,,,,60.2M,NAF1993,O,1.849005,46.398102,0.51,locality,Le Pâtural de Saint Jean 23360 Lourdoueix-Saint-Pierre,23112_B171,G,LE PATURAL DE SAINT JEAN,
324226174,00039,32422617400039,O,2005-06-01,NN,,,2019-11-14T14:00:24,false,3,,,,,LES PIERRES BURES,23360,LOURDOUEIX-SAINT-PIERRE,,,23112,,,,,,,,,,,,,,,,,,,2011-12-28,F,,,,,33.12Z,NAFRev2,O,1.821465,46.429515,0.94,locality,Les Pierres Bures 23360 Lourdoueix-Saint-Pierre,23112_B263,G,LES PIERRES BURES,
327184735,00014,32718473500014,O,,,,,2019-11-14T14:00:24,true,1,,,,,LES CHAUMES,23360,LOURDOUEIX-SAINT-PIERRE,,,23112,,,,,,,,,,,,,,,,,,,1987-03-31,F,,,,,69.23,NAP,N,1.836815,46.421013,0.95,street,Les Chaumes 23360 Lourdoueix-Saint-Pierre,23112_1zjd2h,G,LES CHAUMES,
327677480,00011,32767748000011,O,1983-07-04,NN,,,2019-11-14T14:00:24,true,1,,,,,LES CHAUMES,23360,LOURDOUEIX-SAINT-PIERRE,,,23112,,,,,,,,,,,,,,,,,,,2000-09-30,F,,,,,45.3E,NAF1993,N,1.836815,46.421013,0.95,street,Les Chaumes 23360 Lourdoueix-Saint-Pierre,23112_1zjd2h,G,LES CHAUMES,
329176580,00010,32917658000010,O,1984-02-02,NN,,,2021-05-27T03:50:18,true,4,,,,,MAIRIE,23360,LOURDOUEIX-SAINT-PIERRE,,,23112,,,,,,,,,,,,,,,,,,,2008-01-01,A,,,,,01.61Z,NAFRev2,N,1.817464,46.405237,0.38,street,La Vacherie 23360 Lourdoueix-Saint-Pierre,23112_5vlm1v,G,LA VACHERIE,
330479650,00013,33047965000013,O,,NN,,,2019-11-14T14:00:24,true,1,,,,,MONTMARTIN,23360,LOURDOUEIX-SAINT-PIERRE,,,23112,,,,,,,,,,,,,,,,,,,1992-08-12,F,,,,,01.1A,NAF1993,N,1.87464,46.419185,0.95,street,Montmartin 23360 Lourdoueix-Saint-Pierre,23112_w97su8,G,MONTMARTIN,
330577909,00014,33057790900014,O,1984-08-16,NN,,,2019-11-14T14:00:24,true,4,,,,,,23360,LOURDOUEIX-SAINT-PIERRE,,,23112,,,,,,,,,,,,,,,,,,,2013-06-30,F,,,,,96.02A,NAFRev2,N,,,0,,,,,,
330653569,00013,33065356900013,O,1984-09-01,NN,,,2019-11-14T14:00:24,true,4,,,,,LA GILLETTE,23360,LOURDOUEIX-SAINT-PIERRE,,,23112,,,,,,,,,,,,,,,,,,,2013-12-17,F,,,,,01.42Z,NAFRev2,N,1.845257,46.386012,0.47,locality,La Grange de l’Aiguille 23360 Lourdoueix-Saint-Pierre,23112_B122,G,LA GRANGE DE L AIGUILLE,
331196857,00014,33119685700014,O,,NN,,,2019-11-14T14:00:24,true,1,,,,,LA BERNARDIERE,23360,LOURDOUEIX-SAINT-PIERRE,,,23112,,,,,,,,,,,,,,,,,,,1995-07-21,F,,,,,01.1A,NAF1993,N,1.83358,46.406154,0.95,street,La Bernardiere 23360 Lourdoueix-Saint-Pierre,23112_5bb8qm,G,LA BERNARDIERE,
331585117,00012,33158511700012,O,1985-01-02,NN,,,2019-11-14T14:00:24,true,4,,,,,LA MITAINE,23360,LOURDOUEIX-SAINT-PIERRE,,,23112,,,,,,,,,,,,,,,,,,,2012-12-31,F,,,,,01.42Z,NAFRev2,N,1.872282,46.397793,0.92,locality,La Mitaine Basse 23360 Lourdoueix-Saint-Pierre,23112_B153,G,LA MITAINE BASSE,
331777813,00014,33177781300014,O,1984-09-01,NN,,,2019-11-14T14:00:24,true,3,,,,,RICHEMONT,23360,LOURDOUEIX-SAINT-PIERRE,,,23112,,,,,,,,,,,,,,,,,,,1993-12-25,F,,,,,01.2A,NAF1993,N,1.829147,46.391382,0.92,locality,Bois de Richemont 23360 Lourdoueix-Saint-Pierre,23112_B018,G,BOIS DE RICHEMONT,
332269273,00014,33226927300014,O,1983-01-01,NN,,,2019-11-14T14:00:24,true,3,,,,,VOST,23360,LOURDOUEIX-SAINT-PIERRE,,,23112,,,,,,,,,,,,,,,,,,,1999-12-31,F,,,,,01.2E,NAF1993,N,1.851725,46.402537,0.91,locality,Moulin de Vost 23360 Lourdoueix-Saint-Pierre,23112_B159,G,MOULIN DE VOST,
332506484,00010,33250648400010,O,,NN,,,2019-11-14T14:00:24,true,1,,,,,LA BRODIERE,23360,LOURDOUEIX-SAINT-PIERRE,,,23112,,,,,,,,,,,,,,,,,,,1995-12-31,F,,,,,01.1A,NAF1993,N,1.815968,46.423218,0.94,street,La Brodière 23360 Lourdoueix-Saint-Pierre,23112_e2tnvg,G,LA BRODIERE,
333484392,00019,33348439200019,O,1985-09-01,NN,,,2019-11-14T14:00:24,true,1,,,,,CADRIX,23360,LOURDOUEIX-SAINT-PIERRE,,,23112,,,,,,,,,,,,,,,,,,,1998-09-30,F,,,,,74.8F,NAF1993,O,1.891035,46.4306,0.95,street,Cadrix 23360 Lourdoueix-Saint-Pierre,23112_df9ynl,G,CADRIX,
333595064,00010,33359506400010,O,1985-09-01,NN,,,2019-11-14T14:00:24,true,4,,,,,LES GOURDES,23360,LOURDOUEIX-SAINT-PIERRE,,,23112,,,,,,,,,,,,,,,,,,,2015-12-31,F,,,,,01.42Z,NAFRev2,N,1.836815,46.421013,0.53,street,Les Chaumes 23360 Lourdoueix-Saint-Pierre,23112_1zjd2h,G,LES CHAUMES,
334402963,00014,33440296300014,O,1986-01-07,NN,,,2019-11-14T14:00:24,true,4,,,,,ETIGNIERES,23360,LOURDOUEIX-SAINT-PIERRE,,,23112,,,,,,,,,,,,,,,,,,,2009-12-31,F,,,,,01.42Z,NAFRev2,N,1.857513,46.41434,0.74,locality,Etigneres Bas 23360 Lourdoueix-Saint-Pierre,23112_B091,G,ETIGNERES BAS,
334402971,00017,33440297100017,O,1986-01-07,NN,,,2019-11-14T14:00:24,true,4,,,,,PRAVEIX,23360,LOURDOUEIX-SAINT-PIERRE,,,23112,,,,,,,,,,,,,,,,,,,2017-12-31,F,,,,,01.42Z,NAFRev2,N,,,0,,,,,,
334616273,00010,33461627300010,O,1986-01-22,NN,,,2019-11-14T14:00:24,true,3,,,,,CHAMPVILLANT,23360,LOURDOUEIX-SAINT-PIERRE,,,23112,,,,,,,,,,,,,,,,,,,2008-01-01,A,,,,,01.42Z,NAFRev2,N,,,0,,,,,,
337624217,00010,33762421700010,O,,NN,,,2019-11-14T14:00:24,true,1,,,,LD,LES CHAUMES,23360,LOURDOUEIX-SAINT-PIERRE,,,23112,,,,,,,,,,,,,,,,,,,1990-06-30,F,,,,,55.71,NAP,N,1.836815,46.421013,0.95,street,Les Chaumes 23360 Lourdoueix-Saint-Pierre,23112_1zjd2h,G,LES CHAUMES,
337700561,00026,33770056100026,O,1987-02-16,NN,,,2019-11-14T14:00:24,true,4,,5,,,BELLEVUE,23360,LOURDOUEIX-SAINT-PIERRE,,,23112,,,,,,,,,,,,,,,,,,,2016-07-16,F,,,,,46.71Z,NAFRev2,N,1.829796,46.427156,0.95,housenumber,5 Bellevue 23360 Lourdoueix-Saint-Pierre,23112_6w3mha_00005,G,5 BELLEVUE,
338268238,00015,33826823800015,O,,NN,,,2019-11-14T14:00:24,true,1,,,,LD,LES MARLIERES,23360,LOURDOUEIX-SAINT-PIERRE,,,23112,,,,,,,,,,,,,,,,,,,1996-04-27,F,,,,,01.3Z,NAF1993,N,1.886048,46.41862,0.95,street,Les Marlieres 23360 Lourdoueix-Saint-Pierre,23112_oof0vu,G,LES MARLIERES,
338481526,00014,33848152600014,O,1986-08-04,NN,,,2019-11-14T14:00:24,true,1,,,,,,23360,LOURDOUEIX-SAINT-PIERRE,,,23112,,,,,,,,,,,,,,,,,,,2002-07-01,F,,,,,85.1G,NAF1993,O,,,0,,,,,,
338857840,00015,33885784000015,O,,,,,2019-11-14T14:00:24,true,1,,,,LD,BOIS BOULET,23360,LOURDOUEIX-SAINT-PIERRE,,,23112,,,,,,,,,,,,,,,,,,,1997-06-01,F,,,,,01.3Z,NAF1993,N,1.863459,46.399438,0.93,locality,Le Bois Boulet 23360 Lourdoueix-Saint-Pierre,23112_B016,G,LE BOIS BOULET,
339124356,00017,33912435600017,O,,NN,,,2019-11-14T14:00:24,true,1,,,,LD,PETIT CHATELUS,23360,LOURDOUEIX-SAINT-PIERRE,,,23112,,,,,,,,,,,,,,,,,,,1994-12-31,F,,,,,01.3Z,NAF1993,N,1.795228,46.383481,0.94,street,Le Petit Chatelus 23360 Lourdoueix-Saint-Pierre,23112_B176,G,LE PETIT CHATELUS,
340450659,00016,34045065900016,O,,NN,,,2019-11-14T14:00:24,true,1,,,,,LIGNAUD,23360,LOURDOUEIX-SAINT-PIERRE,,,23112,,,,,,,,,,,,,,,,,,,1992-12-31,F,,,,,55.4B,NAF1993,N,1.772878,46.377435,0.95,street,Lignaud 23360 Lourdoueix-Saint-Pierre,23112_w54eao,G,LIGNAUD,
340743384,00018,34074338400018,O,1900-01-01,NN,,,2019-11-14T14:00:24,false,4,,,,LOT,LE BERNIQUET,23360,LOURDOUEIX-SAINT-PIERRE,,,23112,,,,,,,,,,,,,,,,,,,1988-12-25,F,,,,,69.23,NAP,N,1.814137,46.413057,0.64,street,Le Berniguet 23360 Lourdoueix-Saint-Pierre,23112_17x9da,G,LE BERNIGUET,
340743384,00026,34074338400026,O,2013-01-10,,,,2019-11-14T14:00:24,true,2,,50,,,LES CHAUMES,23360,LOURDOUEIX-SAINT-PIERRE,,,23112,,,,,,,,,,,,,,,,,,,2018-03-31,F,,,,,47.89Z,NAFRev2,N,1.836506,46.422052,0.95,housenumber,50 Les Chaumes 23360 Lourdoueix-Saint-Pierre,23112_1zjd2h_00050,G,50 LES CHAUMES,
342345055,00020,34234505500020,O,1987-07-01,NN,,,2019-11-14T14:00:24,true,4,,25,,RUE,PRINCIPALE,23360,LOURDOUEIX-SAINT-PIERRE,,,23112,,,,,,,,,,,,,,,,,,,2013-09-30,F,,,,,56.10A,NAFRev2,N,1.824055,46.409616,0.95,housenumber,25 Rue Principale 23360 Lourdoueix-Saint-Pierre,23112_0350_00025,G,25 RUE PRINCIPALE,
342755105,00018,34275510500018,O,1987-10-01,NN,,,2019-11-14T14:00:24,true,4,,,,,AIGUDE HAUT,23360,LOURDOUEIX-SAINT-PIERRE,,,23112,,,,,,,,,,,,,,,,,,,2011-04-14,F,,,,,01.42Z,NAFRev2,N,1.803437,46.402122,0.94,street,Aigude Haut 23360 Lourdoueix-Saint-Pierre,23112_B003,G,AIGUDE HAUT,
343698445,00016,34369844500016,O,1988-01-01,,,,2019-11-14T14:00:24,true,5,,,,,LE BOURG,23360,LOURDOUEIX-SAINT-PIERRE,,,23112,,,,,,,,,,,,,,,,,,,2009-05-31,F,,,,,02.20Z,NAFRev2,N,1.860963,46.42853,0.72,street,Le Bourliat 23360 Lourdoueix-Saint-Pierre,23112_udiq4a,G,LE BOURLIAT,
343894093,00016,34389409300016,O,1988-01-01,NN,,,2019-11-14T14:00:24,true,1,,,,LD,BOURLIAT,23360,LOURDOUEIX-SAINT-PIERRE,,,23112,,,,,,,,,,,,,,,,,,,1998-02-01,F,,,,,01.2A,NAF1993,N,1.860963,46.42853,0.93,street,Le Bourliat 23360 Lourdoueix-Saint-Pierre,23112_udiq4a,G,LE BOURLIAT,
344539499,00014,34453949900014,O,1988-01-01,,,,2019-11-14T14:00:24,true,1,,,,,LA FAYE,23360,LOURDOUEIX-SAINT-PIERRE,,,23112,,,,,,,,,,,,,,,,,,,1999-09-29,F,,,,,01.2E,NAF1993,N,1.83358,46.406154,0.35,street,La Bernardiere 23360 Lourdoueix-Saint-Pierre,23112_5bb8qm,G,LA BERNARDIERE,
345138945,00026,34513894500026,O,1991-03-15,NN,,,2019-11-14T14:00:24,false,4,,9,,RUE,PRINCIPAL,23360,LOURDOUEIX-SAINT-PIERRE,,,23112,,,,,,,,,,,,,,,,,,,1999-04-27,F,,,,,55.4B,NAF1993,N,1.82212,46.409316,0.89,housenumber,9 Rue Principale 23360 Lourdoueix-Saint-Pierre,23112_0350_00009,G,9 RUE PRINCIPALE,
345138945,00034,34513894500034,O,1998-09-04,NN,,,2019-11-14T14:00:24,false,4,,9,,RUE,PRINCIPALE,23360,LOURDOUEIX-SAINT-PIERRE,,,23112,,,,,,,,,,,,,,,,,,,2003-07-01,F,,,,,01.4B,NAFRev1,N,1.82212,46.409316,0.95,housenumber,9 Rue Principale 23360 Lourdoueix-Saint-Pierre,23112_0350_00009,G,9 RUE PRINCIPALE,
345138945,00042,34513894500042,O,2003-07-01,NN,,4339ZZ,2019-11-14T14:00:24,true,7,,29,,,VILLECHIRON,23360,LOURDOUEIX-SAINT-PIERRE,,,23112,,,,,,,,,,,,,,,,,,,2017-12-01,A,,,,NICOLE BERNARD,81.30Z,NAFRev2,N,1.794212,46.364359,0.95,housenumber,29 Villechiron 23360 Lourdoueix-Saint-Pierre,23112_xod649_00029,G,29 VILLECHIRON,
345375802,00021,34537580200021,O,1989-06-01,,,,2019-11-14T14:00:24,false,3,,,,,,23360,LOURDOUEIX-SAINT-PIERRE,,,23112,,,,,,,,,,,,,,,,,,,2000-05-31,F,,,,,29.3D,NAF1993,N,,,0,,,,,,
345409072,00021,34540907200021,O,1994-06-28,NN,,,2019-11-14T14:00:24,false,4,,,,,CHATEAU DE VOST,23360,LOURDOUEIX-SAINT-PIERRE,,,23112,,,,,,,,,,,,,,,,,,,2008-01-01,F,,,,,47.62Z,NAFRev2,N,1.84892,46.40351,0.94,locality,Chateau de Vost 23360 Lourdoueix-Saint-Pierre,23112_B062,G,CHATEAU DE VOST,
349168096,00015,34916809600015,O,1989-01-01,NN,,,2019-11-14T14:00:24,true,8,,,,,,23360,LOURDOUEIX-SAINT-PIERRE,,,23112,,,,,,,,,,,,,,,,,,,2013-07-31,F,,,,,68.20B,NAFRev2,N,,,0,,,,,,
349733469,00010,34973346900010,O,1900-01-01,,,,2019-11-14T14:00:24,true,5,,,,,MOULIN RICHEMONT,23360,LOURDOUEIX-SAINT-PIERRE,,,23112,,,,,,,,,,,,,,,,,,,2017-12-31,F,,,,,01.42Z,NAFRev2,N,1.836272,46.384728,0.88,locality,Moulin de Richemont 23360 Lourdoueix-Saint-Pierre,23112_B158,G,MOULIN DE RICHEMONT,
349736694,00028,34973669400028,O,1990-01-01,NN,,,2019-11-14T14:00:24,true,4,,,,,RICHEMONT,23360,LOURDOUEIX-SAINT-PIERRE,,,23112,,,,,,,,,,,,,,,,,,,2008-01-01,A,,,,,01.45Z,NAFRev2,N,1.829147,46.391382,0.92,locality,Bois de Richemont 23360 Lourdoueix-Saint-Pierre,23112_B018,G,BOIS DE RICHEMONT,
349751958,00019,34975195800019,O,,NN,,,2019-11-14T14:00:24,true,1,,,,,,23360,LOURDOUEIX-SAINT-PIERRE,,,23112,,,,,,,,,,,,,,,,,,,1993-01-01,F,,,,,01.1A,NAF1993,N,,,0,,,,,,
353459720,00010,35345972000010,O,1990-01-01,NN,,,2019-11-14T14:00:24,true,4,,,,,MONTMARTIN,23360,LOURDOUEIX-SAINT-PIERRE,,,23112,,,,,,,,,,,,,,,,,,,2007-10-31,F,,,,,01.1A,NAFRev1,N,1.87464,46.419185,0.95,street,Montmartin 23360 Lourdoueix-Saint-Pierre,23112_w97su8,G,MONTMARTIN,
353464373,00011,35346437300011,O,1990-01-01,NN,,,2019-11-14T14:00:24,true,4,,,,,CHOUEIX,23360,LOURDOUEIX-SAINT-PIERRE,,,23112,,,,,,,,,,,,,,,,,,,2018-12-31,F,,,,,01.42Z,NAFRev2,N,1.859334,46.405369,0.95,street,Choueix 23360 Lourdoueix-Saint-Pierre,23112_6qk2me,G,CHOUEIX,
353464563,00017,35346456300017,O,1990-01-01,NN,,,2019-11-14T14:00:24,true,4,,,,,MONTMARTIN,23360,LOURDOUEIX-SAINT-PIERRE,,,23112,,,,,,,,,,,,,,,,,,,2015-12-31,F,,,,,01.42Z,NAFRev2,N,1.87464,46.419185,0.95,street,Montmartin 23360 Lourdoueix-Saint-Pierre,23112_w97su8,G,MONTMARTIN,
356000000,01500,35600000001500,O,2012-01-01,,,,2019-11-14T14:00:24,false,2,,6,,PL,DE L EGLISE,23360,LOURDOUEIX-SAINT-PIERRE,,,23112,,,,,,,,,,,,,,,,,,,2014-01-10,A,LA POSTE,,,,53.10Z,NAFRev2,N,1.821818,46.408867,0.84,housenumber,6 Place de l’Eglise 23360 Lourdoueix-Saint-Pierre,23112_0150_00006,G,6 PLACE DE L EGLISE,
356000745,01301,35600074501301,O,1991-01-01,NN,,,2019-11-14T14:00:24,false,4,,6,,PL,MAIRIE,23360,LOURDOUEIX-SAINT-PIERRE,,,23112,,,,,,,,,,,,,,,,,,,2009-03-18,F,BUREAU DE POSTE,,,,53.10Z,NAFRev2,O,1.821818,46.408867,0.34,housenumber,6 Place de l’Eglise 23360 Lourdoueix-Saint-Pierre,23112_0150_00006,G,6 PLACE DE L EGLISE,
356000745,05377,35600074505377,O,2004-05-18,,,,2019-11-14T14:00:24,false,5,,,,PL,MAIRIE,23360,LOURDOUEIX-SAINT-PIERRE,,,23112,,,,,,,,,,,,,,,,,,,2011-12-31,F,EQUIPE AGENT ROULEUR RESEAU GD PUBLIC,,,,53.10Z,NAFRev2,O,3.0709671,50.6304695,0.92,poi.townhall,Hôtel de Ville Lille,https://osm.org/way/40917078,G,,
356000745,07191,35600074507191,O,2005-10-25,NN,,,2019-11-14T14:00:24,false,4,,,,PL,DE LA MAIRIE,23360,LOURDOUEIX-SAINT-PIERRE,,,23112,,,,,,,,,,,,,,,,,,,2009-03-18,F,CENTRE COURRIER,,,,53.10Z,NAFRev2,O,1.818661,46.412608,0.38,street,Chemin de la Gravade 23360 Lourdoueix-Saint-Pierre,23112_0180,G,CHEMIN DE LA GRAVADE,
381840982,00015,38184098200015,O,,NN,,,2019-11-14T14:00:24,true,1,,,,,BOIS DU BOUCHET,23360,LOURDOUEIX-SAINT-PIERRE,,,23112,,,,,,,,,,,,,,,,,,,1994-05-01,F,,,,,01.3Z,NAF1993,N,1.762319,46.387299,0.93,locality,Le Bois du Bouchet 23360 Lourdoueix-Saint-Pierre,23112_B021,G,LE BOIS DU BOUCHET,
381842525,00010,38184252500010,O,1991-01-01,NN,,,2019-11-14T14:00:24,true,3,,,,,PUN,23360,LOURDOUEIX-SAINT-PIERRE,,,23112,,,,,,,,,,,,,,,,,,,2008-01-01,A,,,,,01.42Z,NAFRev2,N,1.875779,46.407459,0.95,street,Pun 23360 Lourdoueix-Saint-Pierre,23112_3zkz2v,G,PUN,
383664315,00017,38366431500017,O,1991-11-01,NN,,,2019-11-14T14:00:24,true,3,,,,,LES SIGNOLLES,23360,LOURDOUEIX-SAINT-PIERRE,,,23112,,,,,,,,,,,,,,,,,,,2008-01-01,A,,,,,01.50Z,NAFRev2,N,1.845301,46.39763,0.95,street,Les Signolles 23360 Lourdoueix-Saint-Pierre,23112_h3t03k,G,LES SIGNOLLES,
383905320,00016,38390532000016,O,1991-12-01,NN,,,2019-11-14T14:00:24,true,3,,,,,MONTMARTIN,23360,LOURDOUEIX-SAINT-PIERRE,,,23112,,,,,,,,,,,,,,,,,,,2008-01-01,A,,,,,01.42Z,NAFRev2,N,1.87464,46.419185,0.95,street,Montmartin 23360 Lourdoueix-Saint-Pierre,23112_w97su8,G,MONTMARTIN,
384386553,00018,38438655300018,O,,NN,,,2019-11-14T14:00:24,true,1,,,,,LA BERNARDIERE,23360,LOURDOUEIX-SAINT-PIERRE,,,23112,,,,,,,,,,,,,,,,,,,1993-01-01,F,,,,,01.3Z,NAF1993,N,1.83358,46.406154,0.95,street,La Bernardiere 23360 Lourdoueix-Saint-Pierre,23112_5bb8qm,G,LA BERNARDIERE,
385119441,00041,38511944100041,O,2010-09-01,,,,2019-11-14T14:00:24,true,2,,43,,LD,LIGNAUD,23360,LOURDOUEIX-SAINT-PIERRE,,,23112,,,,,,,,,,,,,,,,,,,2012-08-01,F,,,,,96.09Z,NAFRev2,N,1.776335,46.377447,0.95,housenumber,43 Lignaud 23360 Lourdoueix-Saint-Pierre,23112_w54eao_00043,G,43 LIGNAUD,
387896533,00016,38789653300016,O,1900-01-01,NN,,,2019-11-14T14:00:24,false,3,,,,LD,BESSOLLES,23360,LOURDOUEIX-SAINT-PIERRE,,,23112,,,,,,,,,,,,,,,,,,,1993-12-31,F,,,,,52.6E,NAF1993,N,1.808612,46.384349,0.77,street,Bessoles 23360 Lourdoueix-Saint-Pierre,23112_p4qny0,G,BESSOLES,