siren,nic,siret,statutDiffusionEtablissement,dateCreationEtablissement,trancheEffectifsEtablissement,anneeEffectifsEtablissement,activitePrincipaleRegistreMetiersEtablissement,dateDernierTraitementEtablissement,etablissementSiege,nombrePeriodesEtablissement,complementAdresseEtablissement,numeroVoieEtablissement,indiceRepetitionEtablissement,typeVoieEtablissement,libelleVoieEtablissement,codePostalEtablissement,libelleCommuneEtablissement,libelleCommuneEtrangerEtablissement,distributionSpecialeEtablissement,codeCommuneEtablissement,codeCedexEtablissement,libelleCedexEtablissement,codePaysEtrangerEtablissement,libellePaysEtrangerEtablissement,complementAdresse2Etablissement,numeroVoie2Etablissement,indiceRepetition2Etablissement,typeVoie2Etablissement,libelleVoie2Etablissement,codePostal2Etablissement,libelleCommune2Etablissement,libelleCommuneEtranger2Etablissement,distributionSpeciale2Etablissement,codeCommune2Etablissement,codeCedex2Etablissement,libelleCedex2Etablissement,codePaysEtranger2Etablissement,libellePaysEtranger2Etablissement,dateDebut,etatAdministratifEtablissement,enseigne1Etablissement,enseigne2Etablissement,enseigne3Etablissement,denominationUsuelleEtablissement,activitePrincipaleEtablissement,nomenclatureActivitePrincipaleEtablissement,caractereEmployeurEtablissement,longitude,latitude,geo_score,geo_type,geo_adresse,geo_id,geo_ligne,geo_l4,geo_l5
212601900,00013,21260190000013,O,1983-03-01,01,2019,,2021-10-27T08:07:30,true,3,HOTEL DE VILLE,,,,,26110,MONTAULIEU,,,26190,,,,,,,,,,,,,,,,,,,2008-01-01,A,MAIRIE,,,,84.11Z,NAFRev2,N,5.224055,44.35832,0.38,street,Le Village 26110 Montaulieu,26190_4g7z11,D,LE VILLAGE,
212601900,00021,21260190000021,O,1994-12-25,NN,,,2008-01-04T18:29:28,false,2,MAIRIE,,,,,26110,MONTAULIEU,,,26190,,,,,,,,,,,,,,,,,,,2008-01-01,A,SCE DES EAUX,,,,36.00Z,NAFRev2,N,5.223992,44.35808,0.9,street,Place de la Mairie 26110 Montaulieu,26190_hqr3ph,D,PLACE DE LA MAIRIE,
262600984,00013,26260098400013,O,1993-01-01,NN,,,2006-10-26T23:45:02,true,3,,,,,MAIRIE,26110,MONTAULIEU,,,26190,,,,,,,,,,,,,,,,,,,2004-04-01,F,CCAS,,,,85.3K,NAFRev1,N,5.223992,44.35808,0.9,street,Place de la Mairie 26110 Montaulieu,26190_hqr3ph,G,PLACE DE LA MAIRIE,
272601741,00015,27260174100015,O,,NN,,,,true,1,,,,,MAIRIE,26110,MONTAULIEU,,,26190,,,,,,,,,,,,,,,,,,,1995-12-25,F,,,,,41.0Z,NAF1993,N,5.223992,44.35808,0.9,street,Place de la Mairie 26110 Montaulieu,26190_hqr3ph,G,PLACE DE LA MAIRIE,
318984903,00043,31898490300043,O,1900-01-01,NN,,,2011-04-28T00:17:38,false,3,,,,,LES FERRIERES,26110,MONTAULIEU,,,26190,,,,,,,,,,,,,,,,,,,1992-12-31,F,,,,,15.8C,NAF1993,N,5.211257,44.382965,0.36,street,Chemin des Tuilieres 26110 Montaulieu,26190_xkbtxd,G,CHEMIN DES TUILIERES,
322383720,00024,32238372000024,O,2006-05-01,,,,2016-01-13T10:56:44,true,2,,,,,LE VILLAGE,26110,MONTAULIEU,,,26190,,,,,,,,,,,,,,,,,,,2008-01-01,A,,,,,68.20A,NAFRev2,N,5.224055,44.35832,0.93,street,Le Village 26110 Montaulieu,26190_4g7z11,G,LE VILLAGE,
323205062,00025,32320506200025,O,2018-04-01,,,,2019-01-02T12:15:41,true,2,,3,,PL,DE LA CHAPELLE,26110,MONTAULIEU,,,26190,,,,,,,,,,,,,,,,,,,2019-01-01,F,,,,,55.20Z,NAFRev2,N,5.223857,44.35821,0.84,housenumber,3 Place de la Chapelle 26110 Montaulieu,26190_fidit6_00003,G,3 PLACE DE LA CHAPELLE,
332801489,00011,33280148900011,O,1985-06-01,NN,,,2008-11-07T00:52:17,false,3,,,,,LES FERRIERES,26110,MONTAULIEU,,,26190,,,,,,,,,,,,,,,,,,,2004-12-21,F,,,,,15.8C,NAFRev1,N,5.211257,44.382965,0.36,street,Chemin des Tuilieres 26110 Montaulieu,26190_xkbtxd,G,CHEMIN DES TUILIERES,
334666500,00015,33466650000015,O,1986-01-01,NN,,,2008-04-05T00:37:51,true,3,,,,,LES FERRIERES,26110,MONTAULIEU,,,26190,,,,,,,,,,,,,,,,,,,2008-01-01,A,,,,,68.20B,NAFRev2,N,5.211257,44.382965,0.36,street,Chemin des Tuilieres 26110 Montaulieu,26190_xkbtxd,G,CHEMIN DES TUILIERES,
338471352,00017,33847135200017,O,1986-06-23,NN,,,2008-01-05T19:30:46,true,3,,,,,,26110,MONTAULIEU,,,26190,,,,,,,,,,,,,,,,,,,2008-01-01,A,,,,,68.20B,NAFRev2,N,,,0,,,,,,
343426672,00014,34342667200014,O,1988-01-07,NN,,,2017-05-16T03:12:55,true,3,,,,,,26110,MONTAULIEU,,,26190,,,,,,,,,,,,,,,,,,,2008-01-01,A,,,,,68.20B,NAFRev2,N,,,0,,,,,,
344550348,00017,34455034800017,O,1988-01-01,NN,,,2020-08-25T10:42:05,true,4,,,,,LES AYGUES,26110,MONTAULIEU,,,26190,,,,,,,,,,,,,,,,,,,2019-12-31,F,,,,,01.24Z,NAFRev2,N,5.218417,44.357007,0.65,street,Les Aigues 26110 Montaulieu,26190_gxo9p2,G,LES AIGUES,
377583281,00011,37758328100011,O,1990-03-06,NN,,,,false,4,,,,,LE SERRE DU MARTIN,26110,MONTAULIEU,,,26190,,,,,,,,,,,,,,,,,,,2001-01-01,F,,,,,45.2P,NAF1993,N,5.225613,44.362804,0.51,street,Le Serre Dinas 26110 Montaulieu,26190_B065,G,LE SERRE DINAS,
383086345,00014,38308634500014,O,1991-10-07,NN,,,2009-12-16T06:34:50,true,1,,,,,GRANGE VIEILLE,26110,MONTAULIEU,,,26190,,,,,,,,,,,,,,,,,,,2002-09-30,F,,,,,52.4W,NAF1993,N,5.220582,44.359657,0.93,street,Grange Vieille 26110 Montaulieu,26190_B035,G,GRANGE VIEILLE,
395179484,00013,39517948400013,O,1994-06-01,NN,,,2006-10-28T02:18:33,true,3,,,,,LES MOLLIERES,26110,MONTAULIEU,,,26190,,,,,,,,,,,,,,,,,,,2005-11-27,F,,,,,01.4B,NAFRev1,N,5.211257,44.382965,0.56,street,Chemin des Tuilieres 26110 Montaulieu,26190_xkbtxd,G,CHEMIN DES TUILIERES,
407855303,00019,40785530300019,O,1980-12-31,NN,,,2022-01-03T20:07:08,true,4,,,,,,26110,MONTAULIEU,,,26190,,,,,,,,,,,,,,,,,,,2013-06-26,F,,,,,01.43Z,NAFRev2,N,,,0,,,,,,
407855311,00012,40785531100012,O,1981-01-01,NN,,,2008-01-04T21:00:46,true,3,,,,,,26110,MONTAULIEU,,,26190,,,,,,,,,,,,,,,,,,,2008-01-01,A,,,,,01.42Z,NAFRev2,N,,,0,,,,,,
407855329,00014,40785532900014,O,1980-12-31,NN,,,2008-01-04T21:00:46,true,3,,,,,,26110,MONTAULIEU,,,26190,,,,,,,,,,,,,,,,,,,2008-01-01,A,,,,,01.11Z,NAFRev2,N,,,0,,,,,,
408581718,00017,40858171800017,O,1996-08-06,NN,,,2017-04-04T15:17:48,true,3,,,,,GRANGE VIEILLE,26110,MONTAULIEU,,,26190,,,,,,,,,,,,,,,,,,,2008-01-01,A,,,,,68.20B,NAFRev2,N,5.220582,44.359657,0.93,street,Grange Vieille 26110 Montaulieu,26190_B035,G,GRANGE VIEILLE,
409971785,00038,40997178500038,O,2021-08-09,,,,2021-09-04T11:54:24,true,1,,11,T,RUE,CHEMIN DES AIGUES,26110,MONTAULIEU,,,26190,,,,,,,,,,,,,,,,,,,2021-08-09,A,,,,,96.09Z,NAFRev2,N,5.214014,44.349717,0.76,interpolation,11 Chemin des Aigues 26110 Montaulieu,,G,9 CHEMIN DES AIGUES,
410173991,00010,41017399100010,O,1996-12-13,NN,,,2008-01-04T21:38:38,true,3,M. LOSSOS JUTTA,,,,LES FOUGERES,26110,MONTAULIEU,,,26190,,,,,,,,,,,,,,,,,,,2008-01-01,A,,,,,94.99Z,NAFRev2,N,5.223308,44.367103,0.38,street,Les Freyssinas 26110 Montaulieu,26190_029fia,G,LES FREYSSINAS,
410373732,00016,41037373200016,O,1980-12-31,NN,,,2008-01-04T21:42:22,true,3,,,,,,26110,MONTAULIEU,,,26190,,,,,,,,,,,,,,,,,,,2008-01-01,A,,,,,01.11Z,NAFRev2,N,,,0,,,,,,
413653437,00017,41365343700017,O,1997-01-01,NN,,,2014-09-30T08:08:34,false,3,,,,,COMBE DE BARON,26110,MONTAULIEU,,,26190,,,,,,,,,,,,,,,,,,,2005-12-20,F,,,,,01.1F,NAFRev1,N,5.222368,44.365405,0.9,street,Ferme de Combe Baron 26110 Montaulieu,26190_z7ydsj,G,FERME DE COMBE BARON,
413653437,00025,41365343700025,O,2014-08-01,,,,2021-02-23T11:35:59,true,1,,,,,LE VILLAGE,26110,MONTAULIEU,,,26190,,,,,,,,,,,,,,,,,,,2014-08-01,A,,,,,01.13Z,NAFRev2,N,5.224055,44.35832,0.93,street,Le Village 26110 Montaulieu,26190_4g7z11,G,LE VILLAGE,
413653437,00033,41365343700033,O,2020-01-01,,,,2021-02-23T11:35:59,false,1,,2,,CHE,DES AIGUES,26110,MONTAULIEU,,,26190,,,,,,,,,,,,,,,,,,,2020-01-01,A,,,,,35.11Z,NAFRev2,N,5.222562,44.364634,0.82,housenumber,2 Chemin des Aigues 26110 Montaulieu,26190_18uzcg_00002,G,2 CHEMIN DES AIGUES,
413653437,00041,41365343700041,O,2020-01-01,,,,2022-02-09T07:38:58,false,1,,2,,CHE,DES AIGUES,26110,MONTAULIEU,,,26190,,,,,,,,,,,,,,,,,,,2020-01-01,A,,,,,68.20A,NAFRev2,N,5.222562,44.364634,0.82,housenumber,2 Chemin des Aigues 26110 Montaulieu,26190_18uzcg_00002,G,2 CHEMIN DES AIGUES,
413975400,00016,41397540000016,O,1997-06-05,NN,,,2022-04-22T04:05:21,true,3,,,,,,26110,MONTAULIEU,,,26190,,,,,,,,,,,,,,,,,,,2008-01-01,A,,,,,01.24Z,NAFRev2,N,,,0,,,,,,
418743407,00029,41874340700029,O,2000-04-17,NN,,,2008-10-29T20:05:11,true,4,LES MOURINAS,,,,LE VILLAGE,26110,MONTAULIEU,,,26190,,,,,,,,,,,,,,,,,,,2008-06-30,F,,,,,82.99Z,NAFRev2,N,5.224055,44.35832,0.93,street,Le Village 26110 Montaulieu,26190_4g7z11,G,LE VILLAGE,
420387524,00010,42038752400010,O,1998-10-01,NN,,,2019-01-25T04:20:46,true,6,,,,,GRANGE VIEILLE,26110,MONTAULIEU,,,26190,,,,,,,,,,,,,,,,,,,2018-12-31,F,,,,,71.12B,NAFRev2,N,5.220582,44.359657,0.93,street,Grange Vieille 26110 Montaulieu,26190_B035,G,GRANGE VIEILLE,
423236249,00029,42323624900029,O,2005-02-01,,,,2018-01-17T04:07:48,false,4,,,,,LE VILLARD,26110,MONTAULIEU,,,26190,,,,,,,,,,,,,,,,,,,2017-07-01,F,LA FERME DU ROCHER FLORIN,,,,01.45Z,NAFRev2,N,5.213176,44.334029,0.93,street,Le Villard 26110 Montaulieu,26190_ng4pds,G,LE VILLARD,
427473160,00013,42747316000013,O,1987-02-12,NN,,,2008-01-05T01:16:42,true,3,,,,,,26110,MONTAULIEU,,,26190,,,,,,,,,,,,,,,,,,,2008-01-01,A,,,,,94.99Z,NAFRev2,N,,,0,,,,,,
427544820,00017,42754482000017,O,1980-01-01,NN,,,2012-07-28T12:04:15,true,4,,,,,,26110,MONTAULIEU,,,26190,,,,,,,,,,,,,,,,,,,2009-12-25,F,,,,,90.01Z,NAFRev2,N,,,0,,,,,,
428639504,00011,42863950400011,O,2000-01-01,NN,,,2018-09-29T12:09:05,true,3,,,,,,26110,MONTAULIEU,,,26190,,,,,,,,,,,,,,,,,,,2008-01-01,A,,,,,01.24Z,NAFRev2,N,,,0,,,,,,
438187239,00035,43818723900035,O,2008-05-02,,,1629ZA,2021-02-23T13:18:32,true,2,,,,QUA,LES MOLLIERES,26110,MONTAULIEU,,,26190,,,,,,,,,,,,,,,,,,,2009-03-16,A,,,,,16.29Z,NAFRev2,N,,,0,,,,,,
444651392,00011,44465139200011,O,2002-10-22,NN,,,2008-01-04T22:33:58,true,3,,,,,LE VILLAGE,26110,MONTAULIEU,,,26190,,,,,,,,,,,,,,,,,,,2008-01-01,A,,,,,68.20A,NAFRev2,N,5.224055,44.35832,0.93,street,Le Village 26110 Montaulieu,26190_4g7z11,G,LE VILLAGE,
447894460,00016,44789446000016,O,2003-01-01,NN,,,2011-12-22T13:50:41,false,4,,,,,LE VILLAGE,26110,MONTAULIEU,,,26190,,,,,,,,,,,,,,,,,,,2011-06-01,F,,,,,58.14Z,NAFRev2,N,5.224055,44.35832,0.93,street,Le Village 26110 Montaulieu,26190_4g7z11,G,LE VILLAGE,
482277340,00014,48227734000014,O,2005-05-17,,,,2008-06-13T15:49:02,false,6,,,,,LE BATEAU,26110,MONTAULIEU,,,26190,,,,,,,,,,,,,,,,,,,2007-10-23,F,,,,,92.6C,NAFRev1,N,-0.9957408,45.9480854,0.89,poi.camp_site,Camping Le Bateau Rochefort,https://osm.org/way/377507628,G,,
483831335,00029,48383133500029,O,2007-07-12,,,,2015-06-03T09:59:14,false,3,,,,,FERME DES AYGUES,26110,MONTAULIEU,,,26190,,,,,,,,,,,,,,,,,,,2008-01-01,F,,,,,47.81Z,NAFRev2,N,5.222368,44.365405,0.47,street,Ferme de Combe Baron 26110 Montaulieu,26190_z7ydsj,G,FERME DE COMBE BARON,
502045453,00029,50204545300029,O,2008-09-01,,,,2020-07-21T04:12:54,false,2,,,,,LE BATEAU,26110,MONTAULIEU,,,26190,,,,,,,,,,,,,,,,,,,2020-07-20,F,,,,,90.03A,NAFRev2,N,-0.9957408,45.9480854,0.89,poi.camp_site,Camping Le Bateau Rochefort,https://osm.org/way/377507628,G,,
503555641,00011,50355564100011,O,2008-03-30,,,,2019-07-27T03:46:12,true,2,,,,QUA,AUTUCHE,26110,MONTAULIEU,,,26190,,,,,,,,,,,,,,,,,,,2019-09-01,A,,,,,01.45Z,NAFRev2,N,5.202777,44.349738,0.65,street,Autuche 26110 Montaulieu,26190_5t2oli,G,AUTUCHE,
505005017,00015,50500501700015,O,2008-06-12,,,,2011-05-12T03:58:08,true,1,LES MOLLIERES,,,,,26110,MONTAULIEU,,,26190,,,,,,,,,,,,,,,,,,,2008-06-12,F,,,,,90.03A,NAFRev2,N,5.211257,44.382965,0.56,street,Chemin des Tuilieres 26110 Montaulieu,26190_xkbtxd,D,CHEMIN DES TUILIERES,
510191232,00014,51019123200014,O,2008-12-04,,,,2009-01-30T15:06:43,true,1,,,,,FERME DES AYGUES,26110,MONTAULIEU,,,26190,,,,,,,,,,,,,,,,,,,2008-12-04,A,,,,,68.20B,NAFRev2,N,5.222368,44.365405,0.47,street,Ferme de Combe Baron 26110 Montaulieu,26190_z7ydsj,G,FERME DE COMBE BARON,
524093564,00028,52409356400028,O,2011-04-20,,,,2018-05-28T15:43:05,false,2,,,,,LES SERRES DES GRANGES,26110,MONTAULIEU,,,26190,,,,,,,,,,,,,,,,,,,2018-04-20,F,,,,,96.04Z,NAFRev2,N,5.225613,44.362804,0.32,street,Le Serre Dinas 26110 Montaulieu,26190_B065,G,LE SERRE DINAS,
524367711,00016,52436771100016,O,2010-07-18,,,,2012-11-10T02:24:26,false,2,,,,,LE VIGIE,26110,MONTAULIEU,,,26190,,,,,,,,,,,,,,,,,,,2012-10-15,F,,,,,96.09Z,NAFRev2,N,5.224055,44.35832,0.5,street,Le Village 26110 Montaulieu,26190_4g7z11,G,LE VILLAGE,
524367711,00032,52436771100032,O,2018-08-01,,,,2019-10-11T03:49:08,true,2,,,,,QUARTIER AUTRUCHE,26110,MONTAULIEU,,,26190,,,,,,,,,,,,,,,,,,,2019-09-01,F,,,,,01.45Z,NAFRev2,N,3.1379083,49.438593,0.7,poi.community_centre,(Salle des fêtes) Autrêches,https://osm.org/node/5324481438,G,,
530831932,00013,53083193200013,O,2011-02-07,,,,2013-06-19T19:30:46,false,2,,,,,LE VILLARD,26110,MONTAULIEU,,,26190,,,,,,,,,,,,,,,,,,,2013-06-18,F,,,,,47.82Z,NAFRev2,N,5.213176,44.334029,0.93,street,Le Villard 26110 Montaulieu,26190_ng4pds,G,LE VILLARD,
533157129,00016,53315712900016,O,2011-07-01,,,1413ZA,2015-03-18T00:37:37,true,1,,,,,QUARTIER POUSSARAS,26110,MONTAULIEU,,,26190,,,,,,,,,,,,,,,,,,,2011-07-01,A,BARONNELETH,,,,14.13Z,NAFRev2,N,,,0,,,,,,
537642720,00016,53764272000016,O,2011-05-12,,,,2011-11-03T14:24:08,true,1,,,,,LES FERRIERES,26110,MONTAULIEU,,,26190,,,,,,,,,,,,,,,,,,,2011-05-12,A,,,,,94.99Z,NAFRev2,N,5.211257,44.382965,0.36,street,Chemin des Tuilieres 26110 Montaulieu,26190_xkbtxd,G,CHEMIN DES TUILIERES,
753093384,00018,75309338400018,O,2012-07-06,,,,2012-08-03T10:41:34,true,2,,,,,LE VILLARD,26110,MONTAULIEU,,,26190,,,,,,,,,,,,,,,,,,,2012-08-03,A,,,,,94.99Z,NAFRev2,N,5.213176,44.334029,0.93,street,Le Villard 26110 Montaulieu,26190_ng4pds,G,LE VILLARD,
789072519,00026,78907251900026,O,2019-07-01,,,,2021-11-04T09:13:33,true,1,,,,,LE VILLARD,26110,MONTAULIEU,,,26190,,,,,,,,,,,,,,,,,,,2019-07-01,A,,,,,70.10Z,NAFRev2,O,5.213176,44.334029,0.93,street,Le Villard 26110 Montaulieu,26190_ng4pds,G,LE VILLARD,
790167944,00012,79016794400012,O,2012-12-10,,,,2021-11-09T11:35:54,true,2,,,,,LE SERRE DES GRANGES,26110,MONTAULIEU,,,26190,,,,,,,,,,,,,,,,,,,2021-11-08,F,,,,,68.20B,NAFRev2,N,5.225613,44.362804,0.5,street,Le Serre Dinas 26110 Montaulieu,26190_B065,G,LE SERRE DINAS,
794162321,00010,79416232100010,O,2013-06-26,,,,2020-02-03T10:50:00,false,2,,,,,,26110,MONTAULIEU,,,26190,,,,,,,,,,,,,,,,,,,2020-01-01,F,PETITS FRUITS ET COMPAGNIE,,,,01.25Z,NAFRev2,N,,,0,,,,,,
799655535,00034,79965553500034,O,2021-04-01,,,,2021-12-04T13:52:16,true,1,,,,,LE VILLARD,26110,MONTAULIEU,,,26190,,,,,,,,,,,,,,,,,,,2021-04-01,A,,,,,01.42Z,NAFRev2,N,5.213176,44.334029,0.93,street,Le Villard 26110 Montaulieu,26190_ng4pds,G,LE VILLARD,
803254564,00013,80325456400013,O,2014-07-26,,,,2014-11-20T20:45:40,true,1,,,,,MAIRIE DE MONTAULIEU,26110,MONTAULIEU,,,26190,,,,,,,,,,,,,,,,,,,2014-07-26,A,,,,,94.99Z,NAFRev2,N,5.223992,44.35808,0.9,street,Place de la Mairie 26110 Montaulieu,26190_hqr3ph,G,PLACE DE LA MAIRIE,
804190312,00012,80419031200012,O,2014-08-05,,,,2014-08-25T15:05:28,true,1,,,,,MAIRIE,26110,MONTAULIEU,,,26190,,,,,,,,,,,,,,,,,,,2014-08-05,A,,,,,94.99Z,NAFRev2,N,5.223992,44.35808,0.9,street,Place de la Mairie 26110 Montaulieu,26190_hqr3ph,G,PLACE DE LA MAIRIE,
813625605,00015,81362560500015,O,2015-09-17,,,,2018-12-25T03:39:07,true,2,,,,,LE SERRE DES GRANGES,26110,MONTAULIEU,,,26190,,,,,,,,,,,,,,,,,,,2018-12-17,F,,,,,71.12B,NAFRev2,N,5.225613,44.362804,0.5,street,Le Serre Dinas 26110 Montaulieu,26190_B065,G,LE SERRE DINAS,
818716250,00019,81871625000019,O,2016-03-01,,,,2016-02-28T03:42:05,true,1,,,,,LE VIGIER,26110,MONTAULIEU,,,26190,,,,,,,,,,,,,,,,,,,2016-03-01,A,CENDRILLON ET SES SHIH SHIH,,,,01.49Z,NAFRev2,O,5.224055,44.35832,0.46,street,Le Village 26110 Montaulieu,26190_4g7z11,G,LE VILLAGE,
821826211,00012,82182621100012,O,2016-07-31,,,,2016-08-02T03:26:55,true,1,,,,RUE,SAINT AUBANET,26110,MONTAULIEU,,,26190,,,,,,,,,,,,,,,,,,,2016-07-31,A,,,,,93.19Z,NAFRev2,N,5.223273,44.371754,0.77,street,Chemin de Saint Aubanet 26110 Montaulieu,26190_95zmdz,G,CHEMIN DE SAINT AUBANET,
828593855,00020,82859385500020,O,2019-07-01,,,,2021-02-23T17:47:46,true,1,,,,,LE VILLARD,26110,MONTAULIEU,,,26190,,,,,,,,,,,,,,,,,,,2019-07-01,A,,,,,64.20Z,NAFRev2,N,5.213176,44.334029,0.93,street,Le Villard 26110 Montaulieu,26190_ng4pds,G,LE VILLARD,
828786384,00028,82878638400028,O,2019-07-01,,,,2021-02-23T17:48:01,true,1,,,,,LE VILLARD,26110,MONTAULIEU,,,26190,,,,,,,,,,,,,,,,,,,2019-07-01,A,,,,,68.20B,NAFRev2,N,5.213176,44.334029,0.93,street,Le Villard 26110 Montaulieu,26190_ng4pds,G,LE VILLARD,
838306843,00015,83830684300015,O,2018-02-01,,,,2018-03-20T14:53:17,true,1,,2,,CHE,DES AIGUES,26110,MONTAULIEU,,,26190,,,,,,,,,,,,,,,,,,,2018-02-01,A,,,,,88.99B,NAFRev2,N,5.222562,44.364634,0.82,housenumber,2 Chemin des Aigues 26110 Montaulieu,26190_18uzcg_00002,G,2 CHEMIN DES AIGUES,
847539558,00019,84753955800019,O,2018-10-01,,,,2019-01-24T04:02:00,true,1,,,,,LES FREYSSINAS,26110,MONTAULIEU,,,26190,,,,,,,,,,,,,,,,,,,2018-10-01,A,,,,,01.49Z,NAFRev2,N,5.223308,44.367103,0.93,street,Les Freyssinas 26110 Montaulieu,26190_029fia,G,LES FREYSSINAS,
880245584,00011,88024558400011,O,2020-01-01,,,,2020-01-03T03:58:53,true,1,LE MOULIN,,,,,26110,MONTAULIEU,,,26190,,,,,,,,,,,,,,,,,,,2020-01-01,A,LA FERME DES AYGUES,,,,01.26Z,NAFRev2,N,5.224055,44.35832,0.55,street,Le Village 26110 Montaulieu,26190_4g7z11,D,LE VILLAGE,
894619444,00017,89461944400017,O,2021-01-04,,,4391AZ,2021-03-01T19:32:53,true,1,CHEZ M GREZAT JACQUES,4,,CHE,DES AIGUES,26110,MONTAULIEU,,,26190,,,,,,,,,,,,,,,,,,,2021-01-04,A,,,,XYLO COPEAUX,43.91A,NAFRev2,N,5.22236,44.363809,0.82,housenumber,4 Chemin des Aigues 26110 Montaulieu,26190_18uzcg_00004,G,4 CHEMIN DES AIGUES,
900153396,00016,90015339600016,O,2021-06-06,,,,2021-06-11T09:25:44,true,1,,6,,CHE,DE SAINT AUBANET,26110,MONTAULIEU,,,26190,,,,,,,,,,,,,,,,,,,2021-06-06,A,,,,,68.20B,NAFRev2,N,5.223533,44.371798,0.85,housenumber,6 Chemin de Saint Aubanet 26110 Montaulieu,26190_95zmdz_00006,G,6 CHEMIN DE SAINT AUBANET,
902193044,00010,90219304400010,O,2021-08-09,,,,2021-08-11T08:36:05,true,1,,11,,RUE,TER CHEMIN DES AIGUES,26110,MONTAULIEU,,,26190,,,,,,,,,,,,,,,,,,,2021-08-09,A,,,,,96.09Z,NAFRev2,N,5.215343,44.349917,0.68,housenumber,11 Chemin des Aigues 26110 Montaulieu,26190_18uzcg_00011,G,11 CHEMIN DES AIGUES,
909371056,00021,90937105600021,O,2022-01-30,,,,2022-02-14T09:39:07,true,1,1 LE VILLAGE,,,CHE,DES AIGUES,26110,MONTAULIEU,,,26190,,,,,,,,,,,,,,,,,,,2022-01-30,A,,,,LESCOUTEAUXDELAFORGE,47.91B,NAFRev2,N,5.218163,44.356289,0.8,street,Chemin des Aigues 26110 Montaulieu,26190_18uzcg,G,CHEMIN DES AIGUES,
