siren,nic,siret,statutDiffusionEtablissement,dateCreationEtablissement,trancheEffectifsEtablissement,anneeEffectifsEtablissement,activitePrincipaleRegistreMetiersEtablissement,dateDernierTraitementEtablissement,etablissementSiege,nombrePeriodesEtablissement,complementAdresseEtablissement,numeroVoieEtablissement,indiceRepetitionEtablissement,typeVoieEtablissement,libelleVoieEtablissement,codePostalEtablissement,libelleCommuneEtablissement,libelleCommuneEtrangerEtablissement,distributionSpecialeEtablissement,codeCommuneEtablissement,codeCedexEtablissement,libelleCedexEtablissement,codePaysEtrangerEtablissement,libellePaysEtrangerEtablissement,complementAdresse2Etablissement,numeroVoie2Etablissement,indiceRepetition2Etablissement,typeVoie2Etablissement,libelleVoie2Etablissement,codePostal2Etablissement,libelleCommune2Etablissement,libelleCommuneEtranger2Etablissement,distributionSpeciale2Etablissement,codeCommune2Etablissement,codeCedex2Etablissement,libelleCedex2Etablissement,codePaysEtranger2Etablissement,libellePaysEtranger2Etablissement,dateDebut,etatAdministratifEtablissement,enseigne1Etablissement,enseigne2Etablissement,enseigne3Etablissement,denominationUsuelleEtablissement,activitePrincipaleEtablissement,nomenclatureActivitePrincipaleEtablissement,caractereEmployeurEtablissement,longitude,latitude,geo_score,geo_type,geo_adresse,geo_id,geo_ligne,geo_l4,geo_l5
213900814,00012,21390081400012,O,1983-03-01,01,2019,,2021-10-27T08:08:14,true,3,,,,,,39800,BUVILLY,,,39081,,,,,,,,,,,,,,,,,,,2008-01-01,A,MAIRIE,,,,84.11Z,NAFRev2,O,,,0,,,,,,
213900814,00020,21390081400020,O,1983-12-21,NN,,,,false,4,,,,,,39800,BUVILLY,,,39081,,,,,,,,,,,,,,,,,,,1996-12-25,F,ECOLE PRIMAIRE PUBLIQUE,,,,80.1Z,NAF1993,N,,,0,,,,,,
213900814,00038,21390081400038,O,1996-01-01,NN,,,2016-02-01T09:27:59,false,4,MAIRIE,,,,,39800,BUVILLY,,,39081,,,,,,,,,,,,,,,,,,,2016-01-01,F,SERVICE ASSAINISSEMENT DE BUVILLY,,,,37.00Z,NAFRev2,N,5.719343,46.867225,0.92,street,Rue de la Mairie 39800 Buvilly,39081_0016,D,RUE DE LA MAIRIE,
263900813,00019,26390081300019,O,1983-03-01,NN,,,2016-07-23T12:09:53,true,4,,,,,MAIRIE,39800,BUVILLY,,,39081,,,,,,,,,,,,,,,,,,,2016-01-01,F,CCAS,,,,88.99B,NAFRev2,N,5.719343,46.867225,0.92,street,Rue de la Mairie 39800 Buvilly,39081_0016,G,RUE DE LA MAIRIE,
293907770,00011,29390777000011,O,2001-10-11,,,,2008-01-04T19:06:37,true,3,MAIRIE,,,,,39800,BUVILLY,,,39081,,,,,,,,,,,,,,,,,,,2008-01-01,A,,,,,42.99Z,NAFRev2,N,5.719343,46.867225,0.92,street,Rue de la Mairie 39800 Buvilly,39081_0016,D,RUE DE LA MAIRIE,
302835582,00016,30283558200016,O,,,,,,true,1,,,,,,39800,BUVILLY,,,39081,,,,,,,,,,,,,,,,,,,1997-12-25,F,,,,,91.3E,NAF1993,N,,,0,,,,,,
304411663,00038,30441166300038,O,2005-06-15,,,,2018-04-26T15:14:52,true,3,,,,RUE,DE LA CROIX D OR,39800,BUVILLY,,,39081,,,,,,,,,,,,,,,,,,,2017-12-31,F,,,,,68.20A,NAFRev2,N,5.72104,46.865238,0.94,street,Rue de la Croix d’Or 39800 Buvilly,39081_0007,G,RUE DE LA CROIX D OR,
312306327,00015,31230632700015,O,1978-01-01,NN,,,2006-12-15T00:17:38,false,4,,,,,,39800,BUVILLY,,,39081,,,,,,,,,,,,,,,,,,,2000-06-30,F,,,,,70.2C,NAF1993,N,,,0,,,,,,
315997080,00017,31599708000017,O,1992-06-15,NN,,,,false,3,,,,,,39800,BUVILLY,,,39081,,,,,,,,,,,,,,,,,,,1992-12-25,F,RELAIS RESTAURANT,,,,55.3A,NAF1993,N,,,0,,,,,,
316443530,00019,31644353000019,O,,NN,,,,true,1,,,,LD,LA COLOMBIERE,39800,BUVILLY,,,39081,,,,,,,,,,,,,,,,,,,1993-08-31,F,,,,,52.4V,NAF1993,N,5.719219,46.866497,0.92,street,Rue de la Colombière 39800 Buvilly,39081_0004,G,RUE DE LA COLOMBIERE,
326134897,00023,32613489700023,O,,NN,,,2013-11-29T03:45:45,true,1,,,,LD,EN DRON,39800,BUVILLY,,,39081,,,,,,,,,,,,,,,,,,,1986-06-13,F,,,,,69.11,NAP,N,,,0,,,,,,
330060666,00014,33006066600014,O,,NN,,,,true,1,,,,,,39800,BUVILLY,,,39081,,,,,,,,,,,,,,,,,,,,F,,,,,00.10,NAP,N,,,0,,,,,,
330064031,00017,33006403100017,O,1984-07-01,NN,,,,true,3,,,,,,39800,BUVILLY,,,39081,,,,,,,,,,,,,,,,,,,1998-12-25,F,,,,,92.7C,NAF1993,N,,,0,,,,,,
331435834,00030,33143583400030,O,2010-04-15,,,2042ZZ,2020-01-10T04:13:28,true,3,,18,,RUE,DE LA CROIX BAPTISTE,39800,BUVILLY,,,39081,,,,,,,,,,,,,,,,,,,2017-12-31,F,,,,KARITE ET CIE,47.78C,NAFRev2,N,5.718318,46.871547,0.95,housenumber,18 Rue de la Croix Baptiste 39800 Buvilly,39081_0006_00018,G,18 RUE DE LA CROIX BAPTISTE,
334772340,00017,33477234000017,O,,,,,,true,1,,,,,,39800,BUVILLY,,,39081,,,,,,,,,,,,,,,,,,,,F,,,,,59.13,NAP,N,,,0,,,,,,
381133107,00023,38113310700023,O,1991-10-01,,,,2010-08-09T15:04:31,false,3,,,,,,39800,BUVILLY,,,39081,,,,,,,,,,,,,,,,,,,1993-08-25,F,,,,,02.0B,NAF1993,N,,,0,,,,,,
384833349,00010,38483334900010,O,1989-01-01,NN,,,2012-09-11T09:22:54,true,4,,,,,,39800,BUVILLY,,,39081,,,,,,,,,,,,,,,,,,,2012-07-31,F,,,,,01.21Z,NAFRev2,N,,,0,,,,,,
388275703,00014,38827570300014,O,1992-08-01,NN,,,,true,1,,,,RTE,N 83,39800,BUVILLY,,,39081,,,,,,,,,,,,,,,,,,,2000-07-01,F,,,,,52.2J,NAF1993,N,,,0,,,,,,
393116579,00011,39311657900011,O,1976-01-01,NN,,,,true,1,,,,,,39800,BUVILLY,,,39081,,,,,,,,,,,,,,,,,,,2001-12-31,F,,,,,01.1G,NAF1993,N,,,0,,,,,,
400462511,00017,40046251100017,O,,NN,,,,true,1,,,,,,39800,BUVILLY,,,39081,,,,,,,,,,,,,,,,,,,1993-01-01,F,,,,,01.1G,NAF1993,N,,,0,,,,,,
400462685,00019,40046268500019,O,,NN,,,,true,1,,,,,,39800,BUVILLY,,,39081,,,,,,,,,,,,,,,,,,,1993-01-01,F,,,,,01.1A,NAF1993,N,,,0,,,,,,
400462941,00016,40046294100016,O,1993-01-01,NN,,,2008-01-04T19:29:10,true,3,,,,,,39800,BUVILLY,,,39081,,,,,,,,,,,,,,,,,,,2008-01-01,A,,,,,01.11Z,NAFRev2,N,,,0,,,,,,
400463220,00014,40046322000014,O,1993-01-01,NN,,,2010-05-02T05:36:54,true,4,,,,,,39800,BUVILLY,,,39081,,,,,,,,,,,,,,,,,,,2009-12-31,F,,,,,01.21Z,NAFRev2,N,,,0,,,,,,
411334881,00017,41133488100017,O,1994-05-01,NN,,,2006-10-28T03:54:48,true,3,,,,,,39800,BUVILLY,,,39081,,,,,,,,,,,,,,,,,,,2005-10-31,F,,,,,01.1G,NAFRev1,N,,,0,,,,,,
411732852,00024,41173285200024,O,2013-06-01,NN,,,2019-01-25T04:19:07,true,2,,6,,,RUE DU REVERMONT,39800,BUVILLY,,,39081,,,,,,,,,,,,,,,,,,,2017-10-30,F,,,,,66.22Z,NAFRev2,N,5.721534,46.867426,0.94,housenumber,6 Rue du Revermont 39800 Buvilly,39081_0024_00006,G,6 RUE DU REVERMONT,
415013325,00014,41501332500014,O,1998-01-06,NN,,,2012-11-09T01:08:41,true,4,,,,LOT,LABORDE,39800,BUVILLY,,,39081,,,,,,,,,,,,,,,,,,,2009-12-31,F,,,,,43.32A,NAFRev2,N,5.722969,46.867169,0.62,street,Rue Laborde 39800 Buvilly,39081_0014,G,RUE LABORDE,
418233706,00013,41823370600013,O,1994-01-01,,,,,false,3,,,,,GRANDE RUE,39800,BUVILLY,,,39081,,,,,,,,,,,,,,,,,,,1998-07-31,F,,,,,01.1G,NAF1993,N,5.719507,46.868733,0.95,street,Grande Rue 39800 Buvilly,39081_0010,G,GRANDE RUE,
422426692,00014,42242669200014,O,1997-04-01,NN,,,2013-05-18T02:19:07,true,4,,,,RTE,DE PUPILLIN,39800,BUVILLY,,,39081,,,,,,,,,,,,,,,,,,,2012-03-31,A,,,,,68.20B,NAFRev2,N,5.722246,46.866191,0.76,street,Rue de Pupillin 39800 Buvilly,39081_0019,G,RUE DE PUPILLIN,
423125665,00012,42312566500012,O,1998-01-01,NN,,,2013-05-22T05:19:34,true,3,,,,RUE,ST ANTOINE,39800,BUVILLY,,,39081,,,,,,,,,,,,,,,,,,,2008-01-01,A,,,,,01.21Z,NAFRev2,N,5.720123,46.867363,0.81,street,Rue Saint Antoine 39800 Buvilly,39081_0020,G,RUE SAINT ANTOINE,
424854834,00019,42485483400019,O,1999-09-01,NN,,,2016-04-26T01:56:23,true,3,,,,,,39800,BUVILLY,,,39081,,,,,,,,,,,,,,,,,,,2008-01-01,A,,,,,01.21Z,NAFRev2,N,,,0,,,,,,
428026496,00011,42802649600011,O,1995-01-01,NN,,,2008-01-05T01:21:31,true,3,,,,,,39800,BUVILLY,,,39081,,,,,,,,,,,,,,,,,,,2008-01-01,A,,,,,41.10A,NAFRev2,N,,,0,,,,,,
437581218,00017,43758121800017,O,1996-01-01,NN,,,2008-01-04T19:53:17,true,3,,,,RUE,DE LA CROIX D'OR,39800,BUVILLY,,,39081,,,,,,,,,,,,,,,,,,,2008-01-01,A,,,,,66.19A,NAFRev2,N,5.72104,46.865238,0.94,street,Rue de la Croix d’Or 39800 Buvilly,39081_0007,G,RUE DE LA CROIX D OR,
441568169,00029,44156816900029,O,2009-01-01,,,,2017-05-24T04:10:09,true,2,,32,,,GRANDE RUE,39800,BUVILLY,,,39081,,,,,,,,,,,,,,,,,,,2009-12-31,F,,,,,01.11Z,NAFRev2,N,5.721124,46.868364,0.95,housenumber,32 Grande Rue 39800 Buvilly,39081_0010_00032,G,32 GRANDE RUE,
443721527,00028,44372152700028,O,2003-02-10,NN,,,2008-01-04T22:09:58,true,3,,,,RUE,LABORDE,39800,BUVILLY,,,39081,,,,,,,,,,,,,,,,,,,2008-01-01,A,,,,,02.40Z,NAFRev2,N,5.722969,46.867169,0.94,street,Rue Laborde 39800 Buvilly,39081_0014,G,RUE LABORDE,
448339291,00016,44833929100016,O,2003-03-29,NN,,,2018-06-12T04:27:59,true,3,,,,RUE,LABORDE,39800,BUVILLY,,,39081,,,,,,,,,,,,,,,,,,,2008-01-01,A,,,,,68.20B,NAFRev2,N,5.722969,46.867169,0.94,street,Rue Laborde 39800 Buvilly,39081_0014,G,RUE LABORDE,
454058579,00011,45405857900011,O,2004-04-30,NN,,,2012-03-20T12:03:18,false,4,BAUD GHISLAINE,,,RUE,LABORDE,39800,BUVILLY,,,39081,,,,,,,,,,,,,,,,,,,2011-12-31,F,,,,,68.20B,NAFRev2,N,5.722969,46.867169,0.94,street,Rue Laborde 39800 Buvilly,39081_0014,G,RUE LABORDE,
479370108,00017,47937010800017,O,2004-11-01,,,,2008-01-05T04:01:45,true,3,,,,,,39800,BUVILLY,,,39081,,,,,,,,,,,,,,,,,,,2008-01-01,A,,,,,01.50Z,NAFRev2,N,,,0,,,,,,
479917734,00010,47991773400010,O,2005-01-03,,,,2020-01-20T08:24:37,false,2,,,,RUE,DE LA MAIRIE,39800,BUVILLY,,,39081,,,,,,,,,,,,,,,,,,,2006-12-31,F,,,,,72.1Z,NAFRev1,N,5.719343,46.867225,0.94,street,Rue de la Mairie 39800 Buvilly,39081_0016,G,RUE DE LA MAIRIE,
480222587,00028,48022258700028,O,2005-01-17,03,2019,4391AZ,2021-10-27T08:16:04,false,2,,,,RUE,DE LA CROIX BAPTISTE,39800,BUVILLY,,,39081,,,,,,,,,,,,,,,,,,,2008-01-01,A,,,,,43.91A,NAFRev2,O,5.717883,46.870575,0.95,street,Rue de la Croix Baptiste 39800 Buvilly,39081_0006,G,RUE DE LA CROIX BAPTISTE,
482085206,00019,48208520600019,O,2005-04-18,,,8121ZZ,2020-12-24T03:52:15,true,3,,,,RUE,DE LA MAIRIE,39800,BUVILLY,,,39081,,,,,,,,,,,,,,,,,,,2020-10-12,F,,,,,81.29A,NAFRev2,N,5.719343,46.867225,0.94,street,Rue de la Mairie 39800 Buvilly,39081_0016,G,RUE DE LA MAIRIE,
483024709,00014,48302470900014,O,2005-06-10,,,,2008-01-05T21:51:00,true,2,,,,RUE,ST LOUIS,39800,BUVILLY,,,39081,,,,,,,,,,,,,,,,,,,2008-01-01,A,,,,,68.20B,NAFRev2,N,5.716959,46.86887,0.8,street,Rue Saint Louis 39800 Buvilly,39081_0021,G,RUE SAINT LOUIS,
485013502,00011,48501350200011,O,2005-10-15,,,,2009-09-09T04:27:17,false,3,LOTISSEMENT LABORDE,,,,,39800,BUVILLY,,,39081,,,,,,,,,,,,,,,,,,,2009-08-01,F,,,,,68.20B,NAFRev2,N,5.722969,46.867169,0.43,street,Rue Laborde 39800 Buvilly,39081_0014,D,RUE LABORDE,
487568131,00014,48756813100014,O,2006-01-01,NN,,,2013-04-24T13:51:24,false,3,,,,RUE,DES POMMIERS,39800,BUVILLY,,,39081,,,,,,,,,,,,,,,,,,,2012-12-31,F,,,,,01.42Z,NAFRev2,N,5.721308,46.86858,0.94,street,Rue des Pommiers 39800 Buvilly,39081_0017,G,RUE DES POMMIERS,
487568131,00022,48756813100022,O,2006-01-01,,,,2012-12-19T15:27:55,false,3,,,,RUE,DES POMMIERS,39800,BUVILLY,,,39081,,,,,,,,,,,,,,,,,,,2012-12-31,F,,,,,46.23Z,NAFRev2,N,5.721308,46.86858,0.94,street,Rue des Pommiers 39800 Buvilly,39081_0017,G,RUE DES POMMIERS,
487568131,00030,48756813100030,O,2012-04-01,,,,2018-05-15T09:24:53,true,2,,,,RUE,DES POMMIERS,39800,BUVILLY,,,39081,,,,,,,,,,,,,,,,,,,2017-12-31,F,,,,,68.20B,NAFRev2,N,5.721308,46.86858,0.94,street,Rue des Pommiers 39800 Buvilly,39081_0017,G,RUE DES POMMIERS,
489289025,00012,48928902500012,O,2006-03-27,NN,,4312BA,2015-08-26T03:36:44,false,7,,,,LOT,LABORDE,39800,BUVILLY,,,39081,,,,,,,,,,,,,,,,,,,2015-04-01,F,,,,,49.41B,NAFRev2,O,5.722969,46.867169,0.62,street,Rue Laborde 39800 Buvilly,39081_0014,G,RUE LABORDE,
490905072,00016,49090507200016,O,2005-01-01,,,,2015-04-13T08:33:58,true,2,,1,,RUE,SAINT ANTOINE,39800,BUVILLY,,,39081,,,,,,,,,,,,,,,,,,,2008-01-01,A,,,,,01.21Z,NAFRev2,N,5.720123,46.867363,0.86,street,Rue Saint Antoine 39800 Buvilly,39081_0020,G,RUE SAINT ANTOINE,
491038212,00016,49103821200016,O,2006-05-09,NN,,,2013-02-07T03:55:04,true,4,,2,,RUE,DU COMMERCE,39800,BUVILLY,,,39081,,,,,,,,,,,,,,,,,,,2012-10-18,F,,,,,46.18Z,NAFRev2,O,5.719326,46.867685,0.94,housenumber,2 Rue du Commerce 39800 Buvilly,39081_0005_00002,G,2 RUE DU COMMERCE,
493266142,00022,49326614200022,O,2007-09-22,,,,2015-02-24T14:50:59,false,3,,4,,RUE,LABORDE,39800,BUVILLY,,,39081,,,,,,,,,,,,,,,,,,,2011-03-31,F,,,,,43.32A,NAFRev2,N,5.722958,46.867922,0.94,housenumber,4 Rue Laborde 39800 Buvilly,39081_0014_00004,G,4 RUE LABORDE,
497709345,00019,49770934500019,O,2007-04-19,NN,,,2019-06-24T13:31:14,true,4,,5,,RUE,LABORDE,39800,BUVILLY,,,39081,,,,,,,,,,,,,,,,,,,2017-06-30,F,,,,,64.20Z,NAFRev2,O,5.722912,46.867616,0.94,housenumber,5 Rue Laborde 39800 Buvilly,39081_0014_00005,G,5 RUE LABORDE,
500409248,00019,50040924800019,O,2007-10-04,,,,2010-04-09T12:54:36,true,3,,,,,RUE DU REVERMONT,39800,BUVILLY,,,39081,,,,,,,,,,,,,,,,,,,2009-12-31,F,,,,,70.22Z,NAFRev2,N,5.721538,46.867389,0.94,street,Rue du Revermont 39800 Buvilly,39081_0024,G,RUE DU REVERMONT,
501445324,00012,50144532400012,O,2007-12-01,,,,2010-03-26T14:59:18,false,3,,,,RUE,LABORDE,39800,BUVILLY,,,39081,,,,,,,,,,,,,,,,,,,2009-11-01,F,,,,,70.10Z,NAFRev2,N,5.722969,46.867169,0.94,street,Rue Laborde 39800 Buvilly,39081_0014,G,RUE LABORDE,
508044542,00019,50804454200019,O,2008-10-01,,,,2011-12-23T09:47:45,false,2,,11,,RUE,SAINT-VERNIER,39800,BUVILLY,,,39081,,,,,,,,,,,,,,,,,,,2011-10-01,F,,,,,62.01Z,NAFRev2,N,5.71747,46.868374,0.94,housenumber,11 Rue Saint Vernier 39800 Buvilly,39081_0022_00011,G,11 RUE SAINT VERNIER,
510725500,00027,51072550000027,O,2019-10-01,,,,2019-10-23T15:47:49,false,1,,2,,RUE,DES ECOLES,39800,BUVILLY,,,39081,,,,,,,,,,,,,,,,,,,2019-10-01,A,,,,,73.11Z,NAFRev2,N,5.720447,46.867729,0.94,housenumber,2 Rue des Ecoles 39800 Buvilly,39081_0008_00002,G,2 RUE DES ECOLES,
511043143,00011,51104314300011,O,2009-03-12,,,,2013-09-26T03:31:56,true,2,,21,B,,GRANDE RUE,39800,BUVILLY,,,39081,,,,,,,,,,,,,,,,,,,2013-09-30,F,GRIMONT PAYSAGE,,,,81.30Z,NAFRev2,N,5.720131,46.868622,0.83,housenumber,21bis Grande Rue 39800 Buvilly,39081_0010_00021_bis,G,21BIS GRANDE RUE,
511587487,00014,51158748700014,O,2006-01-01,,,,2015-03-23T16:32:11,true,2,,,,,LES SARRES,39800,BUVILLY,,,39081,,,,,,,,,,,,,,,,,,,2012-12-22,F,,,,,01.21Z,NAFRev2,N,3.2591789,50.3769621,0.79,poi.bus_stop,Rieulay Les Sarts (Arrêt de bus) Rieulay,https://osm.org/node/2077975702,G,,
521030601,00012,52103060100012,O,2010-03-05,,,,2011-01-07T04:35:13,true,1,,7,,RUE,DE CHAMOLE,39800,BUVILLY,,,39081,,,,,,,,,,,,,,,,,,,2010-03-05,A,,,,,64.20Z,NAFRev2,N,5.723643,46.86449,0.94,housenumber,7 Rue de Chamole 39800 Buvilly,39081_0003_00007,G,7 RUE DE CHAMOLE,
529620049,00021,52962004900021,O,2014-12-04,,,,2015-05-27T08:36:14,true,2,,7,,RUE,DES ECOLE,39800,BUVILLY,,,39081,,,,,,,,,,,,,,,,,,,2015-04-30,F,,,,,46.17B,NAFRev2,N,5.72101,46.867661,0.89,housenumber,7 Rue des Ecoles 39800 Buvilly,39081_0008_00007,G,7 RUE DES ECOLES,
530827138,00013,53082713800013,O,2010-12-01,NN,,,2014-06-14T07:58:19,false,3,,4,,RUE,DU PRES MILLET,39800,BUVILLY,,,39081,,,,,,,,,,,,,,,,,,,2013-03-26,F,,,,,90.01Z,NAFRev2,O,5.718516,46.867439,0.82,housenumber,4 Rue du Pré Millet 39800 Buvilly,39081_0018_00004,G,4 RUE DU PRE MILLET,
532825106,00018,53282510600018,O,2011-05-26,,,,2017-07-05T04:29:51,false,2,,5,,RUE,LABORDE,39800,BUVILLY,,,39081,,,,,,,,,,,,,,,,,,,2017-06-17,F,,,,,68.32A,NAFRev2,N,5.722912,46.867616,0.94,housenumber,5 Rue Laborde 39800 Buvilly,39081_0014_00005,G,5 RUE LABORDE,
534948682,00024,53494868200024,O,2019-01-01,,,,2018-09-11T09:38:04,false,1,,,,LD,LES SARRES,39800,BUVILLY,,,39081,,,,,,,,,,,,,,,,,,,2019-01-01,A,,,,,01.21Z,NAFRev2,N,3.2591789,50.3769621,0.79,poi.bus_stop,Rieulay Les Sarts (Arrêt de bus) Rieulay,https://osm.org/node/2077975702,G,,
537487654,00023,53748765400023,O,2013-06-07,,,,2014-08-27T14:08:31,false,2,,12,,,LA CROIX BAPTISTE,39800,BUVILLY,,,39081,,,,,,,,,,,,,,,,,,,2014-08-08,F,,,,,64.20Z,NAFRev2,N,5.718093,46.870523,0.89,housenumber,12 Rue de la Croix Baptiste 39800 Buvilly,39081_0006_00012,G,12 RUE DE LA CROIX BAPTISTE,
537495467,00020,53749546700020,O,2013-06-07,,,,2014-07-20T03:18:40,true,2,,12,,,LA CROIX BAPTISTE,39800,BUVILLY,,,39081,,,,,,,,,,,,,,,,,,,2014-07-11,F,,,,,64.20Z,NAFRev2,N,5.718093,46.870523,0.89,housenumber,12 Rue de la Croix Baptiste 39800 Buvilly,39081_0006_00012,G,12 RUE DE LA CROIX BAPTISTE,
538335753,00017,53833575300017,O,2011-01-02,,,,2018-09-15T04:10:45,true,2,CEDEX 601,32,,,GRANDE RUE,39800,BUVILLY,,,39081,,,,,,,,,,,,,,,,,,,2018-07-24,F,,,,,01.21Z,NAFRev2,N,5.721124,46.868364,0.95,housenumber,32 Grande Rue 39800 Buvilly,39081_0010_00032,G,32 GRANDE RUE,
626680078,00021,62668007800021,O,,,,,,true,1,,,,RUE,D'ARBOIS,39800,BUVILLY,,,39081,,,,,,,,,,,,,,,,,,,1993-06-29,F,,,,,45.2V,NAF1993,N,5.716092,46.868165,0.52,street,Rue de la Grange Boisson 39800 Buvilly,39081_0011,G,RUE DE LA GRANGE BOISSON,
626770440,00024,62677044000024,O,1992-06-15,NN,,,2013-05-17T03:24:59,false,5,,,,RTE,NATIONALE 83,39800,BUVILLY,,,39081,,,,,,,,,,,,,,,,,,,2012-07-31,F,,,,,47.25Z,NAFRev2,N,,,0,,,,,,
627070410,00014,62707041000014,O,1994-01-01,NN,,,2012-12-06T09:53:39,true,5,,4,,RUE,DES POMMIERS,39800,BUVILLY,,,39081,,,,,,,,,,,,,,,,,,,2013-01-01,A,,,,,46.11Z,NAFRev2,N,5.721261,46.868734,0.94,housenumber,4 Rue des Pommiers 39800 Buvilly,39081_0017_00004,G,4 RUE DES POMMIERS,
627170236,00012,62717023600012,O,,,,,,true,1,,,,,,39800,BUVILLY,,,39081,,,,,,,,,,,,,,,,,,,1984-12-25,F,,,,,62.11,NAP,N,,,0,,,,,,
751325200,00010,75132520000010,O,2012-04-01,01,2019,,2021-10-27T08:50:58,true,1,,,,RTE,DE PUPILLIN,39800,BUVILLY,,,39081,,,,,,,,,,,,,,,,,,,2012-04-01,A,,,,,01.42Z,NAFRev2,N,5.722246,46.866191,0.76,street,Rue de Pupillin 39800 Buvilly,39081_0019,G,RUE DE PUPILLIN,
753638303,00010,75363830300010,O,2012-09-03,,,,2013-10-16T19:54:37,true,2,,18,,RUE,DE LA MAIRIE,39800,BUVILLY,,,39081,,,,,,,,,,,,,,,,,,,2013-08-23,F,,,,,70.21Z,NAFRev2,N,5.720633,46.866695,0.94,housenumber,18 Rue de la Mairie 39800 Buvilly,39081_0016_00018,G,18 RUE DE LA MAIRIE,
778366047,00018,77836604700018,O,,NN,,,,true,1,,,,,,39800,BUVILLY,,,39081,,,,,,,,,,,,,,,,,,,1987-04-30,F,,,,,01.1G,NAF1993,N,,,0,,,,,,
778366054,00014,77836605400014,O,1900-01-01,NN,,,2008-01-05T03:07:30,true,3,,,,,,39800,BUVILLY,,,39081,,,,,,,,,,,,,,,,,,,2008-01-01,A,,,,,93.12Z,NAFRev2,N,,,0,,,,,,
778366062,00017,77836606200017,O,,,,,,true,1,,,,,,39800,BUVILLY,,,39081,,,,,,,,,,,,,,,,,,,1984-12-25,F,,,,,36.10,NAP,N,,,0,,,,,,
778366096,00015,77836609600015,O,,NN,,,2006-11-25T22:10:12,true,1,,,,,,39800,BUVILLY,,,39081,,,,,,,,,,,,,,,,,,,1998-09-28,F,,,,,91.3A,NAF1993,N,,,0,,,,,,
778366104,00017,77836610400017,O,1900-01-01,NN,,,2008-01-05T03:07:30,true,3,,,,,,39800,BUVILLY,,,39081,,,,,,,,,,,,,,,,,,,2008-01-01,A,,,,,93.12Z,NAFRev2,N,,,0,,,,,,
778366112,00010,77836611200010,O,1900-01-01,NN,,,,true,3,,,,,,39800,BUVILLY,,,39081,,,,,,,,,,,,,,,,,,,1998-12-25,F,,,,,91.3E,NAF1993,N,,,0,,,,,,
781626015,00015,78162601500015,O,1900-01-01,,,,2022-05-25T07:11:39,false,2,,9,,RUE,DE L HOTEL DE VILLE,39800,BUVILLY,,,39081,,,,,,,,,,,,,,,,,,,1984-12-25,F,,,,,67.01,NAP,N,5.718083,46.870082,0.5,housenumber,9 Rue de la Croix Baptiste 39800 Buvilly,39081_0006_00009,G,9 RUE DE LA CROIX BAPTISTE,
791386014,00017,79138601400017,O,2013-03-01,,,,2019-07-03T03:35:44,true,2,,35,,,GRANDE RUE,39800,BUVILLY,,,39081,,,,,,,,,,,,,,,,,,,2019-03-27,A,,,,,86.90F,NAFRev2,N,5.720903,46.8687,0.95,housenumber,35 Grande Rue 39800 Buvilly,39081_0010_00035,G,35 GRANDE RUE,
792284291,00012,79228429100012,O,2013-04-01,,,,2013-04-08T08:04:03,true,1,,5,,RUE,DE CHAMOLE,39800,BUVILLY,,,39081,,,,,,,,,,,,,,,,,,,2013-04-01,A,,,,,01.21Z,NAFRev2,N,5.723244,46.86514,0.94,housenumber,5 Rue de Chamole 39800 Buvilly,39081_0003_00005,G,5 RUE DE CHAMOLE,
792906489,00010,79290648900010,O,2012-12-23,,,,2013-05-13T09:34:11,true,1,,,,,,39800,BUVILLY,,,39081,,,,,,,,,,,,,,,,,,,2012-12-23,A,,,,,01.21Z,NAFRev2,N,,,0,,,,,,
793734591,00019,79373459100019,O,2013-05-31,,,,2013-06-20T04:22:11,true,1,,7,,RUE,DE CHAMOLE,39800,BUVILLY,,,39081,,,,,,,,,,,,,,,,,,,2013-05-31,A,,,,,68.20B,NAFRev2,N,5.723643,46.86449,0.94,housenumber,7 Rue de Chamole 39800 Buvilly,39081_0003_00007,G,7 RUE DE CHAMOLE,
797454246,00019,79745424600019,O,2013-09-09,,,1104ZZ,2015-03-18T00:58:10,true,1,,14,,GR,RUE,39800,BUVILLY,,,39081,,,,,,,,,,,,,,,,,,,2013-09-09,A,,,,LE JECKEL,11.04Z,NAFRev2,N,5.718676,46.868617,0.75,housenumber,14 Grande Rue 39800 Buvilly,39081_0010_00014,G,14 GRANDE RUE,
802226795,00010,80222679500010,O,2014-04-14,,,,2018-04-06T18:01:31,true,1,,,,RUE,DE LA CROIX D'OR,39800,BUVILLY,,,39081,,,,,,,,,,,,,,,,,,,2014-04-14,A,,,,,68.20B,NAFRev2,N,5.72104,46.865238,0.94,street,Rue de la Croix d’Or 39800 Buvilly,39081_0007,G,RUE DE LA CROIX D OR,
804674778,00019,80467477800019,O,2014-09-18,02,2019,1071CB,2021-10-27T09:12:05,true,3,,2,,GR,RUE,39800,BUVILLY,,,39081,,,,,,,,,,,,,,,,,,,2014-11-13,A,,,,,10.71C,NAFRev2,O,5.716802,46.869671,0.73,housenumber,2 Grande Rue 39800 Buvilly,39081_0010_00002,G,2 GRANDE RUE,
804970242,00017,80497024200017,O,2014-09-26,02,2019,4321AB,2021-10-27T09:12:25,true,2,,14,,GR,RUE,39800,BUVILLY,,,39081,,,,,,,,,,,,,,,,,,,2015-01-01,A,,,,,43.21A,NAFRev2,O,5.718676,46.868617,0.75,housenumber,14 Grande Rue 39800 Buvilly,39081_0010_00014,G,14 GRANDE RUE,
808411888,00015,80841188800015,O,2014-10-24,,,,2014-12-16T09:20:40,true,1,,11,,DSC,DE LA MAIRIE,39800,BUVILLY,,,39081,,,,,,,,,,,,,,,,,,,2014-10-24,A,,,,,47.99A,NAFRev2,N,5.720469,46.86675,0.72,housenumber,11 Rue de la Mairie 39800 Buvilly,39081_0016_00011,G,11 RUE DE LA MAIRIE,
810196410,00015,81019641000015,O,2013-01-01,,,,2015-03-15T04:42:03,true,1,,6,,RUE,DE LA MAIRIE,39800,BUVILLY,,,39081,,,,,,,,,,,,,,,,,,,2013-01-01,A,,,,,68.20A,NAFRev2,N,5.719343,46.867225,0.94,housenumber,6 Rue de la Mairie 39800 Buvilly,39081_0016_00006,G,6 RUE DE LA MAIRIE,
810751529,00019,81075152900019,O,2015-04-10,,,,2018-04-10T16:02:36,true,1,,2,,RUE,SAINT ANTOINE,39800,BUVILLY,,,39081,,,,,,,,,,,,,,,,,,,2015-04-10,A,,,,,01.21Z,NAFRev2,N,5.720065,46.867237,0.94,housenumber,2 Rue Saint Antoine 39800 Buvilly,39081_0020_00002,G,2 RUE SAINT ANTOINE,
817798762,00016,81779876200016,O,2015-12-29,,,,2016-01-19T09:44:50,true,1,CHEZ MR ALEXANDRE BEJEAN,14,,,GRANDE RUE,39800,BUVILLY,,,39081,,,,,,,,,,,,,,,,,,,2015-12-29,A,,,,,68.20B,NAFRev2,N,5.718676,46.868617,0.95,housenumber,14 Grande Rue 39800 Buvilly,39081_0010_00014,G,14 GRANDE RUE,
818260630,00012,81826063000012,O,2015-03-01,,,,2017-01-12T09:19:57,true,2,,,,RUE,DE LA CROIX D OR,39800,BUVILLY,,,39081,,,,,,,,,,,,,,,,,,,2016-09-01,F,,,,,47.99A,NAFRev2,N,5.72104,46.865238,0.94,street,Rue de la Croix d’Or 39800 Buvilly,39081_0007,G,RUE DE LA CROIX D OR,
820560415,00011,82056041500011,O,2016-05-03,,,,2018-04-06T18:05:40,true,1,,14,,RUE,DE CHAMOLE,39800,BUVILLY,,,39081,,,,,,,,,,,,,,,,,,,2016-05-03,A,,,,,68.20B,NAFRev2,N,5.724101,46.86323,0.94,housenumber,14 Rue de Chamole 39800 Buvilly,39081_0003_00014,G,14 RUE DE CHAMOLE,
827539230,00017,82753923000017,O,2017-03-01,,,2221ZZ,2017-02-08T08:42:39,true,1,,21,B,,GRANDE RUE,39800,BUVILLY,,,39081,,,,,,,,,,,,,,,,,,,2017-03-01,A,SUR MESURE,,,SUR MESURE,18.12Z,NAFRev2,N,5.720131,46.868622,0.83,housenumber,21bis Grande Rue 39800 Buvilly,39081_0010_00021_bis,G,21BIS GRANDE RUE,
831234414,00017,83123441400017,O,2017-06-29,,,,2021-09-24T14:23:59,false,2,,35,,GR,RUE,39800,BUVILLY,,,39081,,,,,,,,,,,,,,,,,,,2021-01-25,F,,,,,47.99A,NAFRev2,N,5.720903,46.8687,0.75,housenumber,35 Grande Rue 39800 Buvilly,39081_0010_00035,G,35 GRANDE RUE,
832760573,00010,83276057300010,O,2017-10-10,,,,2017-10-20T09:58:53,true,1,,5,,RUE,DE LA CROIX D  OR,39800,BUVILLY,,,39081,,,,,,,,,,,,,,,,,,,2017-10-10,A,APPLIED BIO-MINERALS FRANCE,,,APPLIED BIO-MINERALS FRANCE,47.78C,NAFRev2,N,5.721183,46.865227,0.94,housenumber,5 Rue de la Croix d’Or 39800 Buvilly,39081_0007_00005,G,5 RUE DE LA CROIX D OR,
839846532,00019,83984653200019,O,2018-05-22,,,,2018-05-26T03:38:22,true,1,,11,,RUE,DE LA GRANGE BOISSON,39800,BUVILLY,,,39081,,,,,,,,,,,,,,,,,,,2018-05-22,A,DOMAINE MARCHELLI THIERRY,,,,01.21Z,NAFRev2,N,5.716092,46.868165,0.85,street,Rue de la Grange Boisson 39800 Buvilly,39081_0011,G,RUE DE LA GRANGE BOISSON,