siren,nic,siret,statutDiffusionEtablissement,dateCreationEtablissement,trancheEffectifsEtablissement,anneeEffectifsEtablissement,activitePrincipaleRegistreMetiersEtablissement,dateDernierTraitementEtablissement,etablissementSiege,nombrePeriodesEtablissement,complementAdresseEtablissement,numeroVoieEtablissement,indiceRepetitionEtablissement,typeVoieEtablissement,libelleVoieEtablissement,codePostalEtablissement,libelleCommuneEtablissement,libelleCommuneEtrangerEtablissement,distributionSpecialeEtablissement,codeCommuneEtablissement,codeCedexEtablissement,libelleCedexEtablissement,codePaysEtrangerEtablissement,libellePaysEtrangerEtablissement,complementAdresse2Etablissement,numeroVoie2Etablissement,indiceRepetition2Etablissement,typeVoie2Etablissement,libelleVoie2Etablissement,codePostal2Etablissement,libelleCommune2Etablissement,libelleCommuneEtranger2Etablissement,distributionSpeciale2Etablissement,codeCommune2Etablissement,codeCedex2Etablissement,libelleCedex2Etablissement,codePaysEtranger2Etablissement,libellePaysEtranger2Etablissement,dateDebut,etatAdministratifEtablissement,enseigne1Etablissement,enseigne2Etablissement,enseigne3Etablissement,denominationUsuelleEtablissement,activitePrincipaleEtablissement,nomenclatureActivitePrincipaleEtablissement,caractereEmployeurEtablissement,longitude,latitude,geo_score,geo_type,geo_adresse,geo_id,geo_ligne,geo_l4,geo_l5
216003897,00016,21600389700016,O,1983-03-01,NN,,,2018-09-29T12:05:51,true,4,,,,,,60660,MELLO,,,60393,,,,,,,,,,,,,,,,,,,2008-01-01,A,MAIRIE,,,,84.11Z,NAFRev2,O,,,0,,,,,,
216003897,00024,21600389700024,O,1983-12-21,02,2019,,2021-10-27T08:09:24,false,3,,2,,RUE,GUILLAUME COLE,60660,MELLO,,,60393,,,,,,,,,,,,,,,,,,,2008-01-01,A,ECOLE PRIMAIRE PUBLIQUE,,,,85.20Z,NAFRev2,N,2.364225,49.273372,0.82,housenumber,2 Rue Guillaume Cale 60660 Mello,60393_0110_00002,G,2 RUE GUILLAUME CALE,
216003897,00032,21600389700032,O,1986-03-03,NN,,,2008-01-04T18:37:57,false,3,GROUPE SCOLAIRE,,,,,60660,MELLO,,,60393,,,,,,,,,,,,,,,,,,,2008-01-01,A,JARDIN D ENFANTS,,,,88.91A,NAFRev2,N,,,0,,,,,,
266003912,00018,26600391200018,O,1983-03-01,NN,,,2019-01-10T14:10:01,true,4,,,,,,60660,MELLO,,,60393,,,,,,,,,,,,,,,,,,,2017-12-31,F,CCAS,,,,88.99B,NAFRev2,N,,,0,,,,,,
305419053,00023,30541905300023,O,1900-01-01,NN,,,2018-09-29T12:11:15,false,4,,,,,GRANDE RUE,60660,MELLO,,,60393,,,,,,,,,,,,,,,,,,,2008-01-01,A,,,,,69.10Z,NAFRev2,O,2.364106,49.272223,0.95,street,Grande Rue 60660 Mello,60393_0095,G,GRANDE RUE,
311501167,00010,31150116700010,O,2003-05-15,NN,,,2018-03-13T08:42:00,true,5,,8,,PL,DE L'EGLISE,60660,MELLO,,BP 41,60393,,,,,,,,,,,,,,,,,,,2017-12-31,F,,,,,86.90F,NAFRev2,N,2.363433,49.272957,0.84,housenumber,8 Place de l’Eglise 60660 Mello,60393_0080_00008,G,8 PLACE DE L EGLISE,
312848591,00037,31284859100037,O,1990-04-02,,,,2017-11-10T03:39:17,true,7,HAMEAU DE MARTINCOURT,8,,RUE,DE CLERMONT,60660,MELLO,,,60393,,,,,,,,,,,,,,,,,,,2017-11-02,F,,,,,43.21A,NAFRev2,N,2.367259,49.272628,0.95,housenumber,8 Rue de Clermont 60660 Mello,60393_0056_00008,G,8 RUE DE CLERMONT,
315115410,00021,31511541000021,O,2001-09-20,NN,,,2014-07-01T19:59:41,false,4,,,,,GRANDE RUE,60660,MELLO,,,60393,,,,,,,,,,,,,,,,,,,2013-12-31,F,,,,,69.10Z,NAFRev2,N,2.364106,49.272223,0.95,street,Grande Rue 60660 Mello,60393_0095,G,GRANDE RUE,
315226217,00042,31522621700042,O,1992-01-01,,,,,true,4,,42,,,GRANDE RUE,60660,MELLO,,,60393,,,,,,,,,,,,,,,,,,,1997-12-25,F,,,,,21.1C,NAF1993,N,2.364106,49.272223,0.95,street,Grande Rue 60660 Mello,60393_0095,G,GRANDE RUE,
317612232,00023,31761223200023,O,2005-12-14,,,,2021-02-23T10:42:30,true,2,,8,,PL,DE L'EGLISE,60660,MELLO,,,60393,,,,,,,,,,,,,,,,,,,2008-01-01,A,,,,,42.99Z,NAFRev2,N,2.363433,49.272957,0.84,housenumber,8 Place de l’Eglise 60660 Mello,60393_0080_00008,G,8 PLACE DE L EGLISE,
319171906,00021,31917190600021,O,1982-01-01,01,2019,,2021-10-27T08:21:05,true,5,,,,,,60660,MELLO,,,60393,,,,,,,,,,,,,,,,,,,2012-12-31,A,,,,,02.10Z,NAFRev2,O,,,0,,,,,,
321464562,00016,32146456200016,O,1980-09-23,NN,,,2018-08-06T08:33:15,true,4,,29,,,GRANDE RUE,60660,MELLO,,,60393,,,,,,,,,,,,,,,,,,,2017-12-31,F,,,,,86.21Z,NAFRev2,N,2.363987,49.272288,0.95,housenumber,29 Grande Rue 60660 Mello,60393_0095_00029,G,29 GRANDE RUE,
323902759,00014,32390275900014,O,1982-02-01,NN,,,2017-05-23T03:55:30,true,4,,,,PL,DE L EGLISE,60660,MELLO,,,60393,,,,,,,,,,,,,,,,,,,2008-01-01,A,,,,,68.20A,NAFRev2,N,2.363909,49.272706,0.82,street,Place de l’Eglise 60660 Mello,60393_0080,G,PLACE DE L EGLISE,
323908418,00011,32390841800011,O,,NN,,,,true,1,,5,,RUE,DE SAINT LEU,60660,MELLO,,,60393,,,,,,,,,,,,,,,,,,,,F,,,,,80.04,NAP,N,2.371548,49.266816,0.95,housenumber,5 Rue de Saint-Leu 60660 Mello,60393_0170_00005,G,5 RUE DE SAINT LEU,
324528082,00039,32452808200039,O,,NN,,,,true,1,,3,,RTE,DE MOUY MARTINCOURT,60660,MELLO,,,60393,,,,,,,,,,,,,,,,,,,1993-03-01,F,,,,,45.3E,NAF1993,N,2.374853,49.283718,0.5,housenumber,3 Route de Mouy 60660 Mello,60393_0155_00003,G,3 ROUTE DE MOUY,
324984392,00013,32498439200013,O,1982-06-01,01,2019,4520AB,2021-10-27T08:24:19,true,4,,41,,,GRANDE RUE,60660,MELLO,,,60393,,,,,,,,,,,,,,,,,,,2008-01-01,A,,,,,45.11Z,NAFRev2,O,2.363196,49.272355,0.95,housenumber,41 Grande Rue 60660 Mello,60393_0095_00041,G,41 GRANDE RUE,
325441988,00012,32544198800012,O,,,,,,true,1,,27,,,GRANDE RUE,60660,MELLO,,,60393,,,,,,,,,,,,,,,,,,,1984-12-25,F,,,,,55.60,NAP,N,2.364093,49.272268,0.95,housenumber,27 Grande Rue 60660 Mello,60393_0095_00027,G,27 GRANDE RUE,
328484613,00026,32848461300026,O,1996-10-03,NN,,,2009-06-10T16:36:18,true,4,,6,,RTE,DE SAINT LEU,60660,MELLO,,,60393,,,,,,,,,,,,,,,,,,,2009-03-06,F,,,,,02.20Z,NAFRev2,N,2.370979,49.266484,0.8,housenumber,6 Rue de Saint-Leu 60660 Mello,60393_0170_00006,G,6 RUE DE SAINT LEU,
330920133,00015,33092013300015,O,,,,,,true,1,,31,,RUE,GRANDE,60660,MELLO,,,60393,,,,,,,,,,,,,,,,,,,1984-12-25,F,,,,,77.05,NAP,N,2.363853,49.272311,0.79,housenumber,31 Grande Rue 60660 Mello,60393_0095_00031,G,31 GRANDE RUE,
331547653,00021,33154765300021,O,2016-01-01,,,8219ZP,2019-12-11T03:36:32,false,2,,2,,RUE,GUILBAUT VAILLANT,60660,MELLO,,,60393,,,,,,,,,,,,,,,,,,,2019-02-04,F,,,,,82.19Z,NAFRev2,N,2.365864,49.271886,0.94,housenumber,2 Rue Guilbaut Vaillant 60660 Mello,60393_0100_00002,G,2 RUE GUILBAUT VAILLANT,
332154178,00013,33215417800013,O,,NN,,,,true,1,,21,,,GRANDE RUE,60660,MELLO,,,60393,,,,,,,,,,,,,,,,,,,,F,,,,,62.11,NAP,N,2.364501,49.27216,0.95,housenumber,21 Grande Rue 60660 Mello,60393_0095_00021,G,21 GRANDE RUE,
332434992,00019,33243499200019,O,,NN,,,,true,1,,7,,PL,DU JEU D ARC,60660,MELLO,,,60393,,,,,,,,,,,,,,,,,,,1985-12-25,F,,,,,80.04,NAP,N,2.366152,49.272473,0.84,housenumber,7 Place du Jeu d’Arc 60660 Mello,60393_0120_00007,G,7 PLACE DU JEU D ARC,
333589216,00014,33358921600014,O,,NN,,,,true,1,,18,,RUE,DE CLERMONT,60660,MELLO,,,60393,,,,,,,,,,,,,,,,,,,,F,,,,,00.10,NAP,N,2.368384,49.274264,0.95,housenumber,18 Rue de Clermont 60660 Mello,60393_0056_00018,G,18 RUE DE CLERMONT,
333591774,00018,33359177400018,O,,NN,,,,true,1,,18,,RUE,DE CLERMONT,60660,MELLO,,,60393,,,,,,,,,,,,,,,,,,,,F,,,,,62.41,NAP,N,2.368384,49.274264,0.95,housenumber,18 Rue de Clermont 60660 Mello,60393_0056_00018,G,18 RUE DE CLERMONT,
334082526,00065,33408252600065,O,2001-01-01,NN,,,2010-05-04T16:58:28,false,3,,2,,RUE,DE ST LEU,60660,MELLO,,,60393,,,,,,,,,,,,,,,,,,,2006-12-01,F,,,,,74.2C,NAFRev1,N,2.370302,49.267062,0.83,housenumber,2 Rue de Saint-Leu 60660 Mello,60393_0170_00002,G,2 RUE DE SAINT LEU,
334764750,00025,33476475000025,O,1986-01-01,NN,,2370ZZ,2015-03-17T00:22:48,false,4,,,,,CARRIERES NOTRE DAME,60660,MELLO,,,60393,,,,,,,,,,,,,,,,,,,2010-01-06,F,,,,,23.70Z,NAFRev2,N,2.1765329,48.9167322,0.83,poi.place_of_worship,Église Notre-Dame du Réveil Matin (Lieu de culte) Carrières-sur-Seine,https://osm.org/way/131397138,G,,
335317434,00017,33531743400017,O,,NN,,,,true,1,,4,,RUE,ALBERT MARTIN,60660,MELLO,,,60393,,,,,,,,,,,,,,,,,,,,F,,,,,55.73,NAP,N,2.364122,49.271905,0.95,housenumber,4 Rue Albert Martin 60660 Mello,60393_0020_00004,G,4 RUE ALBERT MARTIN,
340102235,00025,34010223500025,O,2004-01-06,NN,,,2008-12-10T20:06:51,true,4,,3,,,COTE DE BARISSEUSE,60660,MELLO,,,60393,,,,,,,,,,,,,,,,,,,2008-12-30,F,,,,,96.02A,NAFRev2,N,2.368994,49.274247,0.77,housenumber,3 Route de Barisseuse 60660 Mello,60393_0040_00003,G,3 ROUTE DE BARISSEUSE,
341040269,00019,34104026900019,O,,NN,,,,true,1,,21,,,GRANDE RUE,60660,MELLO,,,60393,,,,,,,,,,,,,,,,,,,1993-08-31,F,,,,,52.1B,NAF1993,N,2.364501,49.27216,0.95,housenumber,21 Grande Rue 60660 Mello,60393_0095_00021,G,21 GRANDE RUE,
343246849,00032,34324684900032,O,1997-01-01,,,,2008-11-08T00:17:28,true,2,HAMEAU DE MARTINCOURT,,,RTE,DE MOUY,60660,MELLO,,,60393,,,,,,,,,,,,,,,,,,,1997-12-25,F,,,,,29.3C,NAF1993,N,2.373952,49.283981,0.79,street,Route de Mouy 60660 Mello,60393_0155,G,ROUTE DE MOUY,
349812123,00017,34981212300017,O,1989-03-01,NN,,,,true,4,,8,,RTE,DE ST LEU,60660,MELLO,,,60393,,,,,,,,,,,,,,,,,,,1993-12-25,F,,,,,60.2M,NAF1993,N,2.371173,49.266309,0.66,housenumber,8 Rue de Saint-Leu 60660 Mello,60393_0170_00008,G,8 RUE DE SAINT LEU,
378236624,00011,37823662400011,O,1990-06-01,NN,,,,false,4,,2,,PL,DE L'EGLISE,60660,MELLO,,,60393,,,,,,,,,,,,,,,,,,,1998-03-28,F,,,,,70.2A,NAF1993,N,2.363925,49.272427,0.84,housenumber,2 Place de l’Eglise 60660 Mello,60393_0080_00002,G,2 PLACE DE L EGLISE,
383192747,00020,38319274700020,O,1993-01-01,NN,,,,false,3,,40,,,GRANDE RUE,60660,MELLO,,,60393,,,,,,,,,,,,,,,,,,,1996-05-01,F,,,,,92.3A,NAF1993,N,2.362686,49.272598,0.95,housenumber,40 Grande Rue 60660 Mello,60393_0095_00040,G,40 GRANDE RUE,
383192747,00038,38319274700038,O,1996-05-01,NN,,,,false,4,,1,,RUE,DE L'AVENIR,60660,MELLO,,,60393,,,,,,,,,,,,,,,,,,,2000-05-05,F,LES SPECTACLES LAJOIE,,,,92.3A,NAF1993,O,2.363185,49.274122,0.94,housenumber,1 Rue de l’Avenir 60660 Mello,60393_0030_00001,G,1 RUE DE L AVENIR,
388189581,00019,38818958100019,O,1992-07-01,NN,,,2021-11-10T10:39:17,false,4,,43,,,GRANDE RUE,60660,MELLO,,,60393,,,,,,,,,,,,,,,,,,,2001-12-31,F,,,,,51.1T,NAF1993,N,2.362094,49.272617,0.95,housenumber,43 Grande Rue 60660 Mello,60393_0095_00043,G,43 GRANDE RUE,
389651084,00011,38965108400011,O,1993-01-04,NN,,,2008-01-04T23:27:45,true,3,,25,,,GRANDE RUE,60660,MELLO,,,60393,,,,,,,,,,,,,,,,,,,2008-01-01,A,,,,,68.20A,NAFRev2,N,2.364264,49.272219,0.95,housenumber,25 Grande Rue 60660 Mello,60393_0095_00025,G,25 GRANDE RUE,
391250479,00022,39125047900022,O,1997-09-01,NN,,,2006-11-25T12:05:56,true,3,,42,,,GRANDE RUE,60660,MELLO,,,60393,,,,,,,,,,,,,,,,,,,2004-09-09,F,,,,,52.1C,NAFRev1,N,2.364106,49.272223,0.95,street,Grande Rue 60660 Mello,60393_0095,G,GRANDE RUE,
391999075,00016,39199907500016,O,1993-09-01,NN,,,2019-06-24T13:18:15,true,6,,,,PL,DU JEU D'ARC,60660,MELLO,,,60393,,,,,,,,,,,,,,,,,,,2017-11-30,F,,,,,55.10Z,NAFRev2,N,2.366444,49.272307,0.83,street,Place du Jeu d’Arc 60660 Mello,60393_0120,G,PLACE DU JEU D ARC,
392577045,00017,39257704500017,O,1900-01-01,NN,,,2011-04-28T00:57:08,false,3,,16,,,GRANDE RUE,60660,MELLO,,,60393,,,,,,,,,,,,,,,,,,,1995-12-31,F,,,,,52.6E,NAF1993,N,2.364416,49.272247,0.95,housenumber,16 Grande Rue 60660 Mello,60393_0095_00016,G,16 GRANDE RUE,
392625430,00013,39262543000013,O,,,,,,true,1,,2,,PL,DE L'EGLISE,60660,MELLO,,,60393,,,,,,,,,,,,,,,,,,,1994-06-04,F,,,,,80.4A,NAF1993,N,2.363925,49.272427,0.84,housenumber,2 Place de l’Eglise 60660 Mello,60393_0080_00002,G,2 PLACE DE L EGLISE,
392874046,00015,39287404600015,O,1993-08-15,,,,,true,1,,6,,RUE,DE MOUY,60660,MELLO,,,60393,,,,,,,,,,,,,,,,,,,2001-08-31,F,,,,,01.1C,NAF1993,N,2.373663,49.284157,0.75,housenumber,6 Route de Mouy 60660 Mello,60393_0155_00006,G,6 ROUTE DE MOUY,
393605985,00034,39360598500034,O,1997-01-01,NN,,,2016-01-14T04:24:02,false,4,,42,,,GRANDE RUE,60660,MELLO,,,60393,,,,,,,,,,,,,,,,,,,2015-12-24,F,,,,,46.49Z,NAFRev2,N,2.364106,49.272223,0.95,street,Grande Rue 60660 Mello,60393_0095,G,GRANDE RUE,
393733274,00020,39373327400020,O,1999-01-01,NN,,,2011-04-28T00:58:20,false,4,,23,,,GRANDE RUE,60660,MELLO,,,60393,,,,,,,,,,,,,,,,,,,2001-12-31,F,,,,,74.8A,NAF1993,N,2.364408,49.272184,0.95,housenumber,23 Grande Rue 60660 Mello,60393_0095_00023,G,23 GRANDE RUE,
397815523,00022,39781552300022,O,1994-09-28,NN,,,,false,3,,19,,RTE,DE MOUY MARTINCOURT,60660,MELLO,,,60393,,,,,,,,,,,,,,,,,,,1996-11-15,F,,,,,85.1G,NAF1993,N,2.372297,49.284948,0.52,housenumber,19 Route de Mouy 60660 Mello,60393_0155_00019,G,19 ROUTE DE MOUY,
400989752,00029,40098975200029,O,2012-10-23,,,,2014-11-26T03:50:27,true,2,,51,,,LE CLOS DE LA BOUCLE D'EAU,60660,MELLO,,,60393,,,,,,,,,,,,,,,,,,,2014-11-13,F,,,,,14.19Z,NAFRev2,N,2.361776,49.272971,0.87,housenumber,51 Clos de la Boucle d’Eau 60660 Mello,60393_agpdjs_00051,G,51 CLOS DE LA BOUCLE D EAU,
401783196,00017,40178319600017,O,1995-02-02,NN,,,2008-01-04T19:53:02,true,3,,31,,,GRANDE RUE,60660,MELLO,,,60393,,,,,,,,,,,,,,,,,,,2008-01-01,A,,,,,90.02Z,NAFRev2,N,2.363853,49.272311,0.95,housenumber,31 Grande Rue 60660 Mello,60393_0095_00031,G,31 GRANDE RUE,
402559595,00085,40255959500085,O,2003-03-01,12,2019,,2021-10-27T08:28:50,false,3,CHATEAU DE MELLO,,,RTE,DE CLERMONT,60660,MELLO,,,60393,,,,,,,,,,,,,,,,,,,2008-01-01,A,,,,,82.30Z,NAFRev2,O,2.37542,49.282353,0.83,street,Route de Clermont 60660 Mello,60393_0055,G,ROUTE DE CLERMONT,
403768070,00019,40376807000019,O,1982-12-31,NN,,,2008-01-04T20:28:41,true,3,,2,,RTE,DE MOUY,60660,MELLO,,,60393,,,,,,,,,,,,,,,,,,,2008-01-01,A,,,,,01.11Z,NAFRev2,N,2.375607,49.283069,0.82,housenumber,2 Route de Mouy 60660 Mello,60393_0155_00002,G,2 ROUTE DE MOUY,
408572295,00025,40857229500025,O,1997-08-15,NN,,,,true,1,,42,,,GRANDE RUE,60660,MELLO,,,60393,,,,,,,,,,,,,,,,,,,1999-04-15,F,,,,,45.3A,NAF1993,O,2.364106,49.272223,0.95,street,Grande Rue 60660 Mello,60393_0095,G,GRANDE RUE,
410763866,00010,41076386600010,O,1997-01-02,NN,,,2007-10-27T13:24:16,false,4,,42,,,GRANDE RUE,60660,MELLO,,,60393,,,,,,,,,,,,,,,,,,,2006-01-02,F,,,,,51.8N,NAFRev1,O,2.364106,49.272223,0.95,street,Grande Rue 60660 Mello,60393_0095,G,GRANDE RUE,
413893637,00012,41389363700012,O,1997-10-01,NN,,,,true,4,,,,,VOIRIE DE L'ANGE,60660,MELLO,,,60393,,,,,,,,,,,,,,,,,,,2003-03-31,F,,,,,55.4B,NAFRev1,N,2.369559,49.280204,0.93,street,Cr Voirie de l’Ange 60660 Mello,60393_7ecdhk,G,CR VOIRIE DE L ANGE,
418128104,00027,41812810400027,O,2001-09-20,NN,,,2008-10-23T05:38:52,false,4,,,,,GRANDE RUE,60660,MELLO,,,60393,,,,,,,,,,,,,,,,,,,2008-01-01,F,,,,,69.10Z,NAFRev2,N,2.364106,49.272223,0.95,street,Grande Rue 60660 Mello,60393_0095,G,GRANDE RUE,
418427225,00028,41842722500028,O,1998-08-11,NN,,,2008-01-04T23:20:28,false,3,,42,,,GRANDE RUE,60660,MELLO,,,60393,,,,,,,,,,,,,,,,,,,2008-01-01,A,,,,,45.32Z,NAFRev2,N,2.364106,49.272223,0.95,street,Grande Rue 60660 Mello,60393_0095,G,GRANDE RUE,
418652517,00032,41865251700032,O,2015-10-10,00,2019,,2021-10-27T08:40:10,true,2,MARTINCOURT,10,B,RUE,DE MOUY,60660,MELLO,,,60393,,,,,,,,,,,,,,,,,,,2019-03-31,A,,,,,43.99C,NAFRev2,N,2.373003,49.284579,0.67,housenumber,10bis Route de Mouy 60660 Mello,60393_0155_00010_bis,G,10BIS ROUTE DE MOUY,
418668117,00017,41866811700017,O,1998-04-25,NN,,,2008-01-05T20:35:25,true,3,,3,,RUE,ALBERT MARTIN,60660,MELLO,,,60393,,,,,,,,,,,,,,,,,,,2008-01-01,A,,,,,68.20B,NAFRev2,N,2.364918,49.27172,0.95,housenumber,3 Rue Albert Martin 60660 Mello,60393_0020_00003,G,3 RUE ALBERT MARTIN,
420314338,00054,42031433800054,O,2001-02-28,NN,,,2012-02-20T09:57:43,true,3,,42,,,GRANDE RUE,60660,MELLO,,,60393,,,,,,,,,,,,,,,,,,,2003-11-25,F,,,,,51.5N,NAFRev1,N,2.364106,49.272223,0.95,street,Grande Rue 60660 Mello,60393_0095,G,GRANDE RUE,
422900605,00011,42290060500011,O,1999-05-10,,,,,false,3,,16,,,GRANDE RUE,60660,MELLO,,,60393,,,,,,,,,,,,,,,,,,,2000-03-09,F,,,,,72.3Z,NAF1993,N,2.364416,49.272247,0.95,housenumber,16 Grande Rue 60660 Mello,60393_0095_00016,G,16 GRANDE RUE,
423852789,00019,42385278900019,O,1971-01-01,NN,,,2008-01-05T20:45:42,true,3,,8,,PL,DE L EGLISE,60660,MELLO,,,60393,,,,,,,,,,,,,,,,,,,2008-01-01,A,,,,,68.20B,NAFRev2,N,2.363433,49.272957,0.84,housenumber,8 Place de l’Eglise 60660 Mello,60393_0080_00008,G,8 PLACE DE L EGLISE,
424380509,00010,42438050900010,O,1999-09-08,NN,,,2008-11-08T01:45:44,false,4,,1,B,,RLE CHAMBRELLAN,60660,MELLO,,,60393,,,,,,,,,,,,,,,,,,,2002-08-01,F,,,,,45.4J,NAF1993,O,2.365015,49.272301,0.65,housenumber,1bis Ruelle Chambrelant 60660 Mello,60393_0050_00001_bis,G,1BIS RUELLE CHAMBRELANT,
424380509,00028,42438050900028,O,2002-08-01,NN,,,2014-07-08T02:02:18,true,5,,1,,RUE,ALBERT MARTIN,60660,MELLO,,,60393,,,,,,,,,,,,,,,,,,,2013-08-31,F,,,,,43.34Z,NAFRev2,N,2.364845,49.272007,0.95,housenumber,1 Rue Albert Martin 60660 Mello,60393_0020_00001,G,1 RUE ALBERT MARTIN,
425093945,00011,42509394500011,O,1999-11-19,NN,,,,true,1,,1,,,GRANDE RUE,60660,MELLO,,,60393,,,,,,,,,,,,,,,,,,,2002-09-30,F,,,,,52.5Z,NAF1993,N,2.36639,49.271917,0.95,housenumber,1 Grande Rue 60660 Mello,60393_0095_00001,G,1 GRANDE RUE,
433901055,00015,43390105500015,O,2001-01-02,NN,,,2008-11-08T01:59:35,true,3,MARTINCOURT,8,,RUE,DE CLERMONT,60660,MELLO,,,60393,,,,,,,,,,,,,,,,,,,2004-03-31,F,,,,,45.3A,NAFRev1,N,2.367259,49.272628,0.95,housenumber,8 Rue de Clermont 60660 Mello,60393_0056_00008,G,8 RUE DE CLERMONT,
438198780,00019,43819878000019,O,2001-06-19,NN,,,2011-09-07T05:14:45,false,4,,2,,RUE,SAINT LEU,60660,MELLO,,,60393,,,,,,,,,,,,,,,,,,,2010-03-12,F,,,,,68.20B,NAFRev2,N,2.370302,49.267062,0.94,housenumber,2 Rue de Saint-Leu 60660 Mello,60393_0170_00002,G,2 RUE DE SAINT LEU,
443263355,00010,44326335500010,O,2002-09-02,NN,,,2008-11-08T02:17:50,false,3,,37,,,GRANDE RUE,60660,MELLO,,,60393,,,,,,,,,,,,,,,,,,,2004-04-10,F,DEBOSS IMPACTS 60,,,,50.2Z,NAFRev1,N,2.363464,49.272315,0.95,housenumber,37 Grande Rue 60660 Mello,60393_0095_00037,G,37 GRANDE RUE,
447572629,00023,44757262900023,O,2004-11-01,NN,,,2021-02-23T13:28:49,true,3,,5,,RUE,DE CREIL,60660,MELLO,,,60393,,,,,,,,,,,,,,,,,,,2008-01-01,A,,,,,90.01Z,NAFRev2,N,2.365844,49.269421,0.95,housenumber,5 Rue de Creil 60660 Mello,60393_0060_00005,G,5 RUE DE CREIL,
447684325,00015,44768432500015,O,2003-03-11,NN,,,2019-09-05T03:41:52,true,4,,6,,RUE,DELAMARRE,60660,MELLO,,,60393,,,,,,,,,,,,,,,,,,,2016-12-31,F,,,,,68.20A,NAFRev2,N,2.364583,49.272747,0.87,housenumber,6 Rue Gervais Delamarre 60660 Mello,60393_0090_00006,G,6 RUE GERVAIS DELAMARRE,
452291651,00019,45229165100019,O,2004-03-01,NN,,,2008-01-05T02:41:38,true,3,,,,,VOIRIE DE L'ANGE,60660,MELLO,,,60393,,,,,,,,,,,,,,,,,,,2008-01-01,A,,,,,56.30Z,NAFRev2,N,2.369559,49.280204,0.93,street,Cr Voirie de l’Ange 60660 Mello,60393_7ecdhk,G,CR VOIRIE DE L ANGE,
479066516,00010,47906651600010,O,2004-10-01,,,,2014-09-24T10:25:02,false,2,,1,,RUE,GERVAIS DELAMARRE,60660,MELLO,,,60393,,,,,,,,,,,,,,,,,,,2004-12-25,F,,,,,45.2A,NAFRev1,N,2.364706,49.272651,0.94,housenumber,1 Rue Gervais Delamarre 60660 Mello,60393_0090_00001,G,1 RUE GERVAIS DELAMARRE,
479066516,00028,47906651600028,O,2014-10-01,,,4334ZC,2021-07-19T09:18:47,true,2,,5,,RUE,ALBERT MARTIN,60660,MELLO,,,60393,,,,,,,,,,,,,,,,,,,2020-12-31,F,,,,OISE DECOR,43.34Z,NAFRev2,N,2.364755,49.271953,0.95,housenumber,5 Rue Albert Martin 60660 Mello,60393_0020_00005,G,5 RUE ALBERT MARTIN,
481886604,00018,48188660400018,O,2005-04-16,,,,2008-01-25T05:20:31,true,3,MARTINCOURT,10,B,RUE,DE MOUY,60660,MELLO,,,60393,,,,,,,,,,,,,,,,,,,2008-01-01,F,,,,,47.81Z,NAFRev2,N,2.373003,49.284579,0.67,housenumber,10bis Route de Mouy 60660 Mello,60393_0155_00010_bis,G,10BIS ROUTE DE MOUY,
482286077,00011,48228607700011,O,2005-05-09,,,,2010-03-23T09:57:40,false,2,,8,,,GRANDE RUE,60660,MELLO,,,60393,,,,,,,,,,,,,,,,,,,2008-01-01,A,,,,,68.20B,NAFRev2,N,2.365812,49.272011,0.95,housenumber,8 Grande Rue 60660 Mello,60393_0095_00008,G,8 GRANDE RUE,
482286077,00029,48228607700029,O,2010-04-01,,,,2021-02-23T13:46:23,true,1,,6,,RTE,DE MOUY,60660,MELLO,,,60393,,,,,,,,,,,,,,,,,,,2010-04-01,A,,,,,68.20B,NAFRev2,N,2.373663,49.284157,0.82,housenumber,6 Route de Mouy 60660 Mello,60393_0155_00006,G,6 ROUTE DE MOUY,
482815230,00016,48281523000016,O,2005-05-21,,,,2016-09-09T13:43:34,false,3,,1,,PL,DE LA MAIRIE,60660,MELLO,,,60393,,,,,,,,,,,,,,,,,,,2016-06-02,F,,,,,68.20B,NAFRev2,N,2.365038,49.272338,0.84,housenumber,1 Place de la Mairie 60660 Mello,60393_0150_00001,G,1 PLACE DE LA MAIRIE,
483372926,00020,48337292600020,O,2007-02-15,,,,2008-01-05T01:07:50,true,3,,4,B,PL,DE L EGLISE,60660,MELLO,,,60393,,,,,,,,,,,,,,,,,,,2007-12-11,F,,,,,52.6B,NAFRev1,N,2.364104,49.272612,0.74,housenumber,4bis Place de l’Eglise 60660 Mello,60393_0080_00004_bis,G,4BIS PLACE DE L EGLISE,
483972220,00048,48397222000048,O,2011-01-20,,,,2011-05-26T09:24:13,true,2,,43,,,GRANDE RUE,60660,MELLO,,,60393,,,,,,,,,,,,,,,,,,,2011-04-30,F,,,,,02.40Z,NAFRev2,N,2.362094,49.272617,0.95,housenumber,43 Grande Rue 60660 Mello,60393_0095_00043,G,43 GRANDE RUE,
484516521,00016,48451652100016,O,2005-09-26,NN,,4120AZ,2015-10-02T04:28:06,true,4,,6,,PL,DE L EGLISE,60660,MELLO,,,60393,,,,,,,,,,,,,,,,,,,2011-09-14,F,,,,,43.31Z,NAFRev2,N,2.364488,49.272985,0.84,housenumber,6 Place de l’Eglise 60660 Mello,60393_0080_00006,G,6 PLACE DE L EGLISE,
485195903,00029,48519590300029,O,2008-01-01,,,,2014-06-06T13:49:22,true,2,,15,,RUE,CLOS DE LA BOUCLE D EAU,60660,MELLO,,,60393,,,,,,,,,,,,,,,,,,,2014-02-28,F,,,,,49.32Z,NAFRev2,N,2.362381,49.273504,0.82,housenumber,15 Clos de la Boucle d’Eau 60660 Mello,60393_agpdjs_00015,G,15 CLOS DE LA BOUCLE D EAU,
488497132,00032,48849713200032,O,2008-02-27,,,,2011-11-17T09:29:18,true,2,,4,,RTE,DE SAINT LEU,60660,MELLO,,,60393,,,,,,,,,,,,,,,,,,,2009-02-18,F,,,,,45.11Z,NAFRev2,N,2.370852,49.266954,0.8,housenumber,4 Rue de Saint-Leu 60660 Mello,60393_0170_00004,G,4 RUE DE SAINT LEU,
491276028,00025,49127602800025,O,2010-04-01,,,,2021-02-23T13:57:29,true,1,,6,,PL,DE L'EGLISE,60660,MELLO,,,60393,,,,,,,,,,,,,,,,,,,2010-04-01,A,,,,,62.01Z,NAFRev2,N,2.364488,49.272985,0.84,housenumber,6 Place de l’Eglise 60660 Mello,60393_0080_00006,G,6 PLACE DE L EGLISE,
491420014,00020,49142001400020,O,2020-11-02,,,,2021-02-23T13:57:43,true,1,,,,,7 A ROUTE DE MOUY,60660,MELLO,,,60393,,,,,,,,,,,,,,,,,,,2020-11-02,A,,,,MOVI 60,59.12Z,NAFRev2,N,2.373916,49.283972,0.81,housenumber,7a Route de Mouy 60660 Mello,60393_0155_00007_a,G,7A ROUTE DE MOUY,
494440779,00010,49444077900010,O,2006-12-01,NN,,4120BA,2015-03-17T01:35:04,false,5,,6,,RUE,GERVAIS DELAMARRE,60660,MELLO,,,60393,,,,,,,,,,,,,,,,,,,2013-01-01,F,,,,,43.99C,NAFRev2,O,2.364583,49.272747,0.94,housenumber,6 Rue Gervais Delamarre 60660 Mello,60393_0090_00006,G,6 RUE GERVAIS DELAMARRE,
495067837,00015,49506783700015,O,2007-03-01,NN,,,2014-07-10T00:47:49,false,3,,25,,,GRANDE RUE,60660,MELLO,,,60393,,,,,,,,,,,,,,,,,,,2008-10-01,F,,,,,41.20A,NAFRev2,O,2.364264,49.272219,0.95,housenumber,25 Grande Rue 60660 Mello,60393_0095_00025,G,25 GRANDE RUE,
495093585,00026,49509358500026,O,2018-09-24,,,,2020-01-30T08:33:01,true,2,,1,,RUE,ALBERT MARTIN,60660,MELLO,,,60393,,,,,,,,,,,,,,,,,,,2019-09-01,F,,,,,81.21Z,NAFRev2,N,2.364845,49.272007,0.95,housenumber,1 Rue Albert Martin 60660 Mello,60393_0020_00001,G,1 RUE ALBERT MARTIN,
495113979,00019,49511397900019,O,2007-04-01,,,,2012-02-19T05:34:55,true,3,,33,,,GRANDE RUE,60660,MELLO,,,60393,,,,,,,,,,,,,,,,,,,2011-12-01,F,,,,,47.81Z,NAFRev2,N,2.36368,49.272331,0.95,housenumber,33 Grande Rue 60660 Mello,60393_0095_00033,G,33 GRANDE RUE,
498201375,00017,49820137500017,O,2007-05-24,,,,2013-01-31T05:36:11,true,5,,1,,,GRANDE RUE,60660,MELLO,,,60393,,,,,,,,,,,,,,,,,,,2012-12-31,F,,,,,95.29Z,NAFRev2,N,2.36639,49.271917,0.95,housenumber,1 Grande Rue 60660 Mello,60393_0095_00001,G,1 GRANDE RUE,
501112395,00022,50111239500022,O,2015-11-05,,,,2021-02-23T14:11:05,true,1,,10,B,RUE,DE MOUY MARTINCOURT,60660,MELLO,,,60393,,,,,,,,,,,,,,,,,,,2015-11-05,A,,,,,68.20B,NAFRev2,N,2.373003,49.284579,0.43,housenumber,10bis Route de Mouy 60660 Mello,60393_0155_00010_bis,G,10BIS ROUTE DE MOUY,