siren,nic,siret,statutDiffusionEtablissement,dateCreationEtablissement,trancheEffectifsEtablissement,anneeEffectifsEtablissement,activitePrincipaleRegistreMetiersEtablissement,dateDernierTraitementEtablissement,etablissementSiege,nombrePeriodesEtablissement,complementAdresseEtablissement,numeroVoieEtablissement,indiceRepetitionEtablissement,typeVoieEtablissement,libelleVoieEtablissement,codePostalEtablissement,libelleCommuneEtablissement,libelleCommuneEtrangerEtablissement,distributionSpecialeEtablissement,codeCommuneEtablissement,codeCedexEtablissement,libelleCedexEtablissement,codePaysEtrangerEtablissement,libellePaysEtrangerEtablissement,complementAdresse2Etablissement,numeroVoie2Etablissement,indiceRepetition2Etablissement,typeVoie2Etablissement,libelleVoie2Etablissement,codePostal2Etablissement,libelleCommune2Etablissement,libelleCommuneEtranger2Etablissement,distributionSpeciale2Etablissement,codeCommune2Etablissement,codeCedex2Etablissement,libelleCedex2Etablissement,codePaysEtranger2Etablissement,libellePaysEtranger2Etablissement,dateDebut,etatAdministratifEtablissement,enseigne1Etablissement,enseigne2Etablissement,enseigne3Etablissement,denominationUsuelleEtablissement,activitePrincipaleEtablissement,nomenclatureActivitePrincipaleEtablissement,caractereEmployeurEtablissement,longitude,latitude,geo_score,geo_type,geo_adresse,geo_id,geo_ligne,geo_l4,geo_l5
186703567,00013,18670356700013,O,1985-09-30,01,2019,,2021-10-27T08:04:35,true,3,EGLISE SAINT-JACQUES-LE-MAJEUR,9,,RUE,DU GENERAL DE GAULLE,67590,SCHWEIGHOUSE-SUR-MODER,,,67458,,,,,,,,,,,,,,,,,,,2008-01-01,A,,,,,94.91Z,NAFRev2,N,7.738516,48.820993,0.96,housenumber,9 Rue du General de Gaulle 67590 Schweighouse-sur-Moder,67458_0400_00009,G,9 RUE DU GENERAL DE GAULLE,
186707485,00014,18670748500014,O,1985-12-10,NN,,,2019-11-14T14:00:53,true,3,,12,,RTE,D'OHLUNGEN,67590,SCHWEIGHOUSE-SUR-MODER,,,67458,,,,,,,,,,,,,,,,,,,2008-01-01,A,,,,,94.91Z,NAFRev2,N,7.738231,48.819982,0.86,housenumber,12 Route d’Ohlungen 67590 Schweighouse-sur-Moder,67458_0760_00012,G,12 ROUTE D OHLUNGEN,
196719603,00017,19671960300017,O,1983-03-01,12,2019,,2021-10-27T08:05:06,true,3,,,,RUE,DES SPORTS,67590,SCHWEIGHOUSE-SUR-MODER,,BP 326,67458,,,,,,,,,,,,,,,,,,,2008-01-01,A,,,,,85.31Z,NAFRev2,N,7.729235,48.823583,0.96,street,Rue des Sports 67590 Schweighouse-sur-Moder,67458_0900,G,RUE DES SPORTS,
200030583,00039,20003058300039,O,2012-01-01,NN,,,2019-11-14T14:00:53,false,2,,6,,RUE,MARANO,67590,SCHWEIGHOUSE-SUR-MODER,,,67458,,,,,,,,,,,,,,,,,,,2017-01-01,F,HALTE GARDERIE LES P'TITS LOUPS,,,,88.91A,NAFRev2,N,7.729418,48.817052,0.95,housenumber,6 Rue Marano 67590 Schweighouse-sur-Moder,67458_0535_00006,G,6 RUE MARANO,
200034734,00083,20003473400083,O,2012-12-01,,,,2019-11-14T14:00:53,false,1,QUARTIER ESTIENNE,,,,CAMP D'OBERHOFFEN,67590,SCHWEIGHOUSE-SUR-MODER,,BP 80265,67458,67507,HAGUENAU CEDEX,,,,,,,,,,,,,,,,,2012-12-01,A,ANTENNE OBERHOFFEN,,,,56.29B,NAFRev2,N,7.8455325,48.7917083,0.88,poi.bus_stop,Camp d'Oberhoffen Quartier Estienne (Arrêt de bus) Kaltenhouse,https://osm.org/node/4508780843,G,,
216704585,00019,21670458500019,O,1983-03-01,12,2019,,2021-10-27T08:09:57,true,4,,29,,RUE,DU GENERAL DE GAULLE,67590,SCHWEIGHOUSE-SUR-MODER,,,67458,,,,,,,,,,,,,,,,,,,2008-01-01,A,MAIRIE,,,,84.11Z,NAFRev2,O,7.735867,48.821358,0.96,housenumber,29 Rue du General de Gaulle 67590 Schweighouse-sur-Moder,67458_0400_00029,G,29 RUE DU GENERAL DE GAULLE,
216704585,00027,21670458500027,O,1983-12-21,12,2019,,2021-10-27T08:09:57,false,3,,4,,RUE,DU MOULIN,67590,SCHWEIGHOUSE-SUR-MODER,,,67458,,,,,,,,,,,,,,,,,,,2008-01-01,A,ECOL PRIM ETS INTERCONFESSIONN,,,,85.20Z,NAFRev2,N,7.733728,48.81978,0.96,housenumber,4 Rue du Moulin 67590 Schweighouse-sur-Moder,67458_0620_00004,G,4 RUE DU MOULIN,
216704585,00035,21670458500035,O,1983-12-21,01,2019,,2021-10-27T08:09:57,false,3,,7,,RUE,DES JUIFS,67590,SCHWEIGHOUSE-SUR-MODER,,,67458,,,,,,,,,,,,,,,,,,,2008-01-01,A,ECOLE MATERNELLE PUBLIQUE LA MARELLE,,,,85.10Z,NAFRev2,N,7.735286,48.820221,0.96,housenumber,7 Rue des Juifs 67590 Schweighouse-sur-Moder,67458_0480_00007,G,7 RUE DES JUIFS,
216704585,00043,21670458500043,O,1983-12-21,11,2019,,2021-10-27T08:09:57,false,3,,,,,ROUTE D OHLUNGEN,67590,SCHWEIGHOUSE-SUR-MODER,,,67458,,,,,,,,,,,,,,,,,,,2008-01-01,A,ECOL MATE BOCKSBERG,,,,85.10Z,NAFRev2,N,7.733887,48.819136,0.96,street,Route d’Ohlungen 67590 Schweighouse-sur-Moder,67458_0760,G,ROUTE D OHLUNGEN,
216704585,00050,21670458500050,O,1998-01-01,NN,,,2019-11-14T14:00:53,false,4,,29,,RUE,DU GENERAL DE GAULLE,67590,SCHWEIGHOUSE-SUR-MODER,,,67458,,,,,,,,,,,,,,,,,,,2008-06-30,F,POMPES FUNEBRES,,,,96.03Z,NAFRev2,N,7.735867,48.821358,0.96,housenumber,29 Rue du General de Gaulle 67590 Schweighouse-sur-Moder,67458_0400_00029,G,29 RUE DU GENERAL DE GAULLE,
216704585,00068,21670458500068,O,2000-01-01,NN,,,2019-11-14T14:00:53,false,4,MAIRIE,29,,RUE,DU GENERAL DE GAULLE,67590,SCHWEIGHOUSE-SUR-MODER,,,67458,,,,,,,,,,,,,,,,,,,2008-10-06,F,LOTISSEMENT,,,,42.99Z,NAFRev2,N,7.735867,48.821358,0.96,housenumber,29 Rue du General de Gaulle 67590 Schweighouse-sur-Moder,67458_0400_00029,G,29 RUE DU GENERAL DE GAULLE,
216704585,00076,21670458500076,O,1999-12-25,01,2019,,2021-10-27T08:09:57,false,3,,29,,RUE,DU GENERAL DE GAULLE,67590,SCHWEIGHOUSE-SUR-MODER,,,67458,,,,,,,,,,,,,,,,,,,2020-01-01,F,SERVICE D'EAU,,,,36.00Z,NAFRev2,N,7.735867,48.821358,0.96,housenumber,29 Rue du General de Gaulle 67590 Schweighouse-sur-Moder,67458_0400_00029,G,29 RUE DU GENERAL DE GAULLE,
216704585,00084,21670458500084,O,2001-12-25,NN,,,2019-11-14T14:00:53,false,3,MAIRIE,29,,RUE,DU GENERAL DE GAULLE,67590,SCHWEIGHOUSE-SUR-MODER,,,67458,,,,,,,,,,,,,,,,,,,2008-10-06,F,LOTISSEMENT BOULEAU,,,,42.99Z,NAFRev2,N,7.735867,48.821358,0.96,housenumber,29 Rue du General de Gaulle 67590 Schweighouse-sur-Moder,67458_0400_00029,G,29 RUE DU GENERAL DE GAULLE,
216704585,00092,21670458500092,O,2001-12-25,NN,,,2019-11-14T14:00:53,false,3,MAIRIE,29,,RUE,DU GENERAL DE GAULLE,67590,SCHWEIGHOUSE-SUR-MODER,,,67458,,,,,,,,,,,,,,,,,,,2008-10-06,F,LOTISSEMENT BERGERIE,,,,42.99Z,NAFRev2,N,7.735867,48.821358,0.96,housenumber,29 Rue du General de Gaulle 67590 Schweighouse-sur-Moder,67458_0400_00029,G,29 RUE DU GENERAL DE GAULLE,
216704585,00118,21670458500118,O,2016-09-30,,,,2019-11-14T14:00:53,false,1,MAIRIE,29,,RUE,DU GENERAL DE GAULLE,67590,SCHWEIGHOUSE-SUR-MODER,,,67458,,,,,,,,,,,,,,,,,,,2016-09-30,A,BUDGET ANNEXE - RUE DES ROSEAUX,,,,42.99Z,NAFRev2,N,7.735867,48.821358,0.96,housenumber,29 Rue du General de Gaulle 67590 Schweighouse-sur-Moder,67458_0400_00029,G,29 RUE DU GENERAL DE GAULLE,
246700082,00018,24670008200018,O,1983-03-01,NN,,,2019-11-14T14:00:53,true,5,MAIRIE,29,,RUE,DU GENERAL DE GAULLE,67590,SCHWEIGHOUSE-SUR-MODER,,,67458,,,,,,,,,,,,,,,,,,,2018-11-26,F,,,,,84.11Z,NAFRev2,O,7.735867,48.821358,0.96,housenumber,29 Rue du General de Gaulle 67590 Schweighouse-sur-Moder,67458_0400_00029,G,29 RUE DU GENERAL DE GAULLE,
246700082,00026,24670008200026,O,1999-12-25,NN,,,2019-11-14T14:00:53,false,4,MAIRIE,29,,RUE,DU GENERAL DE GAULLE,67590,SCHWEIGHOUSE-SUR-MODER,,,67458,,,,,,,,,,,,,,,,,,,2008-06-30,F,SERVICE DES ORDURES MENAGERES,,,,38.11Z,NAFRev2,N,7.735867,48.821358,0.96,housenumber,29 Rue du General de Gaulle 67590 Schweighouse-sur-Moder,67458_0400_00029,G,29 RUE DU GENERAL DE GAULLE,
246700082,00034,24670008200034,O,1999-12-25,,,,2019-11-14T14:00:53,false,3,MAIRIE,29,,RUE,DU GENERAL DE GAULLE,67590,SCHWEIGHOUSE-SUR-MODER,,,67458,,,,,,,,,,,,,,,,,,,2012-12-17,F,SERVICE D'ASSAINISSEMENT,,,,37.00Z,NAFRev2,N,7.735867,48.821358,0.96,housenumber,29 Rue du General de Gaulle 67590 Schweighouse-sur-Moder,67458_0400_00029,G,29 RUE DU GENERAL DE GAULLE,
246700082,00042,24670008200042,O,2001-12-25,NN,,,2019-11-14T14:00:53,false,3,MAIRIE,29,,RUE,DU GENERAL DE GAULLE,67590,SCHWEIGHOUSE-SUR-MODER,,,67458,,,,,,,,,,,,,,,,,,,2016-12-21,F,SERVICE URBANISME,,,,42.99Z,NAFRev2,N,7.735867,48.821358,0.96,housenumber,29 Rue du General de Gaulle 67590 Schweighouse-sur-Moder,67458_0400_00029,G,29 RUE DU GENERAL DE GAULLE,
246700082,00059,24670008200059,O,2001-12-25,NN,,,2019-11-14T14:00:53,false,4,MAIRIE,29,,RUE,DU GENERAL DE GAULLE,67590,SCHWEIGHOUSE-SUR-MODER,,,67458,,,,,,,,,,,,,,,,,,,2008-06-30,F,SERVICE DECHETTERIE,,,,38.11Z,NAFRev2,N,7.735867,48.821358,0.96,housenumber,29 Rue du General de Gaulle 67590 Schweighouse-sur-Moder,67458_0400_00029,G,29 RUE DU GENERAL DE GAULLE,
246700082,00067,24670008200067,O,2001-12-25,NN,,,2019-11-14T14:00:53,false,3,MAIRIE,29,,RUE,DU GENERAL DE GAULLE,67590,SCHWEIGHOUSE-SUR-MODER,,,67458,,,,,,,,,,,,,,,,,,,2015-11-27,F,SERVICE MAISON DE RETRAITE,,,,84.12Z,NAFRev2,N,7.735867,48.821358,0.96,housenumber,29 Rue du General de Gaulle 67590 Schweighouse-sur-Moder,67458_0400_00029,G,29 RUE DU GENERAL DE GAULLE,
246700082,00075,24670008200075,O,2001-12-25,NN,,,2019-11-14T14:00:53,false,3,MAIRIE,29,,RUE,DU GENERAL DE GAULLE,67590,SCHWEIGHOUSE-SUR-MODER,,,67458,,,,,,,,,,,,,,,,,,,2012-10-01,F,SERVICE VOIRIE,,,,37.00Z,NAFRev2,N,7.735867,48.821358,0.96,housenumber,29 Rue du General de Gaulle 67590 Schweighouse-sur-Moder,67458_0400_00029,G,29 RUE DU GENERAL DE GAULLE,
246700082,00083,24670008200083,O,2001-12-25,NN,,,2019-11-14T14:00:53,false,3,MAIRIE,29,,RUE,DU GENERAL DE GAULLE,67590,SCHWEIGHOUSE-SUR-MODER,,,67458,,,,,,,,,,,,,,,,,,,2014-01-01,F,EQUIPEMENTS SPORTIFS,,,,93.11Z,NAFRev2,N,7.735867,48.821358,0.96,housenumber,29 Rue du General de Gaulle 67590 Schweighouse-sur-Moder,67458_0400_00029,G,29 RUE DU GENERAL DE GAULLE,
246700082,00091,24670008200091,O,2001-12-25,NN,,,2019-11-14T14:00:53,false,3,MAIRIE,29,,RUE,DU GENERAL DE GAULLE,67590,SCHWEIGHOUSE-SUR-MODER,,,67458,,,,,,,,,,,,,,,,,,,2014-01-01,F,SERVICE COSEC,,,,84.12Z,NAFRev2,N,7.735867,48.821358,0.96,housenumber,29 Rue du General de Gaulle 67590 Schweighouse-sur-Moder,67458_0400_00029,G,29 RUE DU GENERAL DE GAULLE,
246700082,00109,24670008200109,O,2001-12-25,NN,,,2019-11-14T14:00:53,false,3,MAIRIE,29,,RUE,DU GENERAL DE GAULLE,67590,SCHWEIGHOUSE-SUR-MODER,,,67458,,,,,,,,,,,,,,,,,,,2008-06-30,F,SERVICE CES,,,,84.12Z,NAFRev2,N,7.735867,48.821358,0.96,housenumber,29 Rue du General de Gaulle 67590 Schweighouse-sur-Moder,67458_0400_00029,G,29 RUE DU GENERAL DE GAULLE,
246700082,00117,24670008200117,O,2004-01-01,NN,,,2019-11-14T14:00:53,false,4,MAIRIE,29,,RUE,DU GENERAL DE GAULLE,67590,SCHWEIGHOUSE-SUR-MODER,,,67458,,,,,,,,,,,,,,,,,,,2016-12-21,F,SOUTIEN DES ANIMATIONS,,,,90.01Z,NAFRev2,N,7.735867,48.821358,0.96,housenumber,29 Rue du General de Gaulle 67590 Schweighouse-sur-Moder,67458_0400_00029,G,29 RUE DU GENERAL DE GAULLE,
246701247,00032,24670124700032,O,2002-12-13,,,,2019-11-14T14:00:53,false,2,,6,,RUE,MARANO,67590,SCHWEIGHOUSE-SUR-MODER,,,67458,,,,,,,,,,,,,,,,,,,2012-01-01,F,HALTE GARDERIE LES P'TITS LOUPS,,,,88.91A,NAFRev2,N,7.729418,48.817052,0.95,housenumber,6 Rue Marano 67590 Schweighouse-sur-Moder,67458_0535_00006,G,6 RUE MARANO,
256701822,00015,25670182200015,O,,,,,2019-11-14T14:00:53,true,1,,,,,MAIRIE,67590,SCHWEIGHOUSE-SUR-MODER,,,67458,,,,,,,,,,,,,,,,,,,,F,,,,,90.11,NAP,N,7.725121,48.822894,0.53,street,Rue du Maire Knecht 67590 Schweighouse-sur-Moder,67458_0523,G,RUE DU MAIRE KNECHT,
256701871,00012,25670187100012,O,1984-09-04,03,2019,,2021-10-27T08:12:22,true,5,ZI RIED,3,,RUE,DU CLAUSENHOF,67590,SCHWEIGHOUSE-SUR-MODER,,,67458,,,,,,,,,,,,,,,,,,,2008-01-01,A,,,,,38.11Z,NAFRev2,O,7.754166,48.825695,0.95,interpolation,3 Rue du Clausenhof 67590 Schweighouse-sur-Moder,,G,1 RUE DU CLAUSENHOF,
266700061,00051,26670006100051,O,2019-01-01,,,,2019-11-14T14:00:53,false,1,,1,,RUE,DU FAUBOURG,67590,SCHWEIGHOUSE-SUR-MODER,,,67458,,,,,,,,,,,,,,,,,,,2019-01-01,A,EHPAD LA ROSELIERE,,,,87.30A,NAFRev2,N,7.742123,48.819255,0.96,housenumber,1 Rue du Faubourg 67590 Schweighouse-sur-Moder,67458_0360_00001,G,1 RUE DU FAUBOURG,
266700863,00019,26670086300019,O,1991-09-12,00,2019,,2021-10-27T08:13:11,true,5,,1,,RUE,DU FAUBOURG,67590,SCHWEIGHOUSE-SUR-MODER,,,67458,,,,,,,,,,,,,,,,,,,2019-01-01,F,,,,,87.30A,NAFRev2,O,7.742123,48.819255,0.96,housenumber,1 Rue du Faubourg 67590 Schweighouse-sur-Moder,67458_0360_00001,G,1 RUE DU FAUBOURG,
266705128,00012,26670512800012,O,1995-12-25,NN,,,2019-11-14T14:00:53,true,2,MAIRIE,29,,RUE,DU GENERAL DE GAULLE,67590,SCHWEIGHOUSE-SUR-MODER,,,67458,,,,,,,,,,,,,,,,,,,2008-01-01,A,CCAS DE SCHWEIGHOUSE SUR MODER,,,,88.99B,NAFRev2,N,7.735867,48.821358,0.96,housenumber,29 Rue du General de Gaulle 67590 Schweighouse-sur-Moder,67458_0400_00029,G,29 RUE DU GENERAL DE GAULLE,
300312048,00014,30031204800014,O,1900-01-01,NN,,,2019-11-14T14:00:53,true,6,,45,,RTE,D'OHLUNGEN,67590,SCHWEIGHOUSE-SUR-MODER,,,67458,,,,,,,,,,,,,,,,,,,2013-09-21,F,,,,,96.02A,NAFRev2,N,7.736297,48.819636,0.86,housenumber,45 Route d’Ohlungen 67590 Schweighouse-sur-Moder,67458_0760_00045,G,45 ROUTE D OHLUNGEN,
300312071,00016,30031207100016,O,,NN,,,2019-11-14T14:00:53,true,1,,21,,RUE,DU MOULIN,67590,SCHWEIGHOUSE-SUR-MODER,,,67458,,,,,,,,,,,,,,,,,,,1989-12-31,F,,,,,64.21,NAP,N,7.73362,48.821316,0.96,housenumber,21 Rue du Moulin 67590 Schweighouse-sur-Moder,67458_0620_00021,G,21 RUE DU MOULIN,
300312576,00014,30031257600014,O,,,,,2019-11-14T14:00:53,true,1,,12,,RTE,DE WINTERSHOUSE,67590,SCHWEIGHOUSE-SUR-MODER,,,67458,,,,,,,,,,,,,,,,,,,1985-12-25,F,,,,,80.08,NAP,N,7.733105,48.81839,0.89,housenumber,12 Route de Wintershouse 67590 Schweighouse-sur-Moder,67458_1060_00012,G,12 ROUTE DE WINTERSHOUSE,
300325610,00016,30032561000016,O,,,,,2019-11-14T14:00:53,true,1,,2,,RUE,DU VALLON,67590,SCHWEIGHOUSE-SUR-MODER,,,67458,,,,,,,,,,,,,,,,,,,1984-12-25,F,,,,,55.60,NAP,N,7.730269,48.815633,0.96,housenumber,2 Rue du Vallon 67590 Schweighouse-sur-Moder,67458_1000_00002,G,2 RUE DU VALLON,
300325651,00028,30032565100028,O,1978-01-01,02,2019,1011ZZ,2021-10-27T08:13:41,true,5,,,,,ZONE INDUSTRIELLE,67590,SCHWEIGHOUSE-SUR-MODER,,,67458,,,,,,,,,,,,,,,,,,,2009-09-30,A,,,,,47.29Z,NAFRev2,O,7.742336,48.829976,0.93,street,Zone Industrielle Zinsel 67590 Schweighouse-sur-Moder,67458_0471,G,ZONE INDUSTRIELLE ZINSEL,
300898160,00076,30089816000076,O,2012-09-18,11,2019,,2021-10-27T08:13:50,false,3,ZI DU RIED,13,,RUE,DU RIED,67590,SCHWEIGHOUSE-SUR-MODER,,,67458,,,,,,,,,,,,,,,,,,,2020-11-01,F,,,,,46.73A,NAFRev2,O,7.747871,48.825652,0.96,housenumber,13 Rue du Ried 67590 Schweighouse-sur-Moder,67458_0815_00013,G,13 RUE DU RIED,
301099354,00013,30109935400013,O,1974-01-01,NN,,,2019-11-14T14:00:53,true,5,,16,,RUE,DU FAUBOURG,67590,SCHWEIGHOUSE-SUR-MODER,,,67458,,,,,,,,,,,,,,,,,,,2015-10-15,F,,,,,56.10A,NAFRev2,O,7.742283,48.819522,0.96,housenumber,16 Rue du Faubourg 67590 Schweighouse-sur-Moder,67458_0360_00016,G,16 RUE DU FAUBOURG,
301253399,00069,30125339900069,O,2002-10-28,NN,,,2019-11-14T14:00:53,false,5,ZI CENTRE COMMERCIAL,,,RTE,DE BITCHE,67590,SCHWEIGHOUSE-SUR-MODER,,,67458,,,,,,,,,,,,,,,,,,,2009-01-27,F,BUT,,,,47.59A,NAFRev2,O,7.729916,48.81953,0.44,street,Rue de la Rochette 67590 Schweighouse-sur-Moder,67458_0820,G,RUE DE LA ROCHETTE,
301466579,00010,30146657900010,O,1977-01-01,,,,2019-11-14T14:00:53,false,3,,4,,RUE,DU CHATEAU D EAU,67590,SCHWEIGHOUSE-SUR-MODER,,,67458,,,,,,,,,,,,,,,,,,,2000-01-01,F,,,,,45.2U,NAF1993,N,7.726268,48.817642,0.96,housenumber,4 Rue du Chateau d’Eau 67590 Schweighouse-sur-Moder,67458_0180_00004,G,4 RUE DU CHATEAU D EAU,
301466579,00028,30146657900028,O,2000-01-01,03,2019,4312BA,2021-10-27T08:14:02,true,3,,8,,RUE,D'OHLUNGEN,67590,SCHWEIGHOUSE-SUR-MODER,,,67458,,,,,,,,,,,,,,,,,,,2008-01-01,A,,,,,43.99D,NAFRev2,O,7.738688,48.820029,0.81,housenumber,8 Route d’Ohlungen 67590 Schweighouse-sur-Moder,67458_0760_00008,G,8 ROUTE D OHLUNGEN,
301603486,00020,30160348600020,O,,,,,2019-11-14T14:00:53,true,1,,14,,RUE,DES GENETS,67590,SCHWEIGHOUSE-SUR-MODER,,,67458,,,,,,,,,,,,,,,,,,,1984-12-25,F,,,,,77.05,NAP,N,7.722122,48.8158,0.96,housenumber,14 Rue des Genets 67590 Schweighouse-sur-Moder,67458_0420_00014,G,14 RUE DES GENETS,
301764072,00049,30176407200049,O,1988-10-06,NN,,,2019-11-14T14:00:53,false,6,ZI ZINSEL,,,,ZONE INDUSTRIELLE,67590,SCHWEIGHOUSE-SUR-MODER,,,67458,,,,,,,,,,,,,,,,,,,2011-12-28,F,SHOP CUISINES,,,,47.59A,NAFRev2,N,7.742336,48.829976,0.93,street,Zone Industrielle Zinsel 67590 Schweighouse-sur-Moder,67458_0471,G,ZONE INDUSTRIELLE ZINSEL,
301961033,00018,30196103300018,O,,,,,2019-11-14T14:00:53,true,1,,45,,RUE,LA ROCHETTE,67590,SCHWEIGHOUSE-SUR-MODER,,,67458,,,,,,,,,,,,,,,,,,,,F,,,,,77.14,NAP,N,7.732075,48.817205,0.95,housenumber,45 Rue de la Rochette 67590 Schweighouse-sur-Moder,67458_0820_00045,G,45 RUE DE LA ROCHETTE,
302162995,00047,30216299500047,O,1993-01-01,,,,2019-11-14T14:00:53,true,5,SECTEUR RIED - BP 40,,,,ZONE INDUSTRIELLE EST,67590,SCHWEIGHOUSE-SUR-MODER,,,67458,,,,,,,,,,,,,,,,,,,2004-12-25,F,,,,,60.2M,NAFRev1,N,7.742336,48.829976,0.78,street,Zone Industrielle Zinsel 67590 Schweighouse-sur-Moder,67458_0471,G,ZONE INDUSTRIELLE ZINSEL,
302237607,00023,30223760700023,O,1997-01-01,NN,,,2019-11-14T14:00:53,false,3,ZI DE LA SABLIERE,,,,,67590,SCHWEIGHOUSE-SUR-MODER,,,67458,,,,,,,,,,,,,,,,,,,2008-01-01,A,,,,,38.32Z,NAFRev2,N,7.748568,48.829491,0.69,street,Zone Industrielle la Sabliere 67590 Schweighouse-sur-Moder,67458_vrl0zz,D,ZONE INDUSTRIELLE LA SABLIERE,
302485867,00014,30248586700014,O,2002-01-04,NN,,,2019-11-14T14:00:53,true,5,,14,,RUE,DE LA GARE,67590,SCHWEIGHOUSE-SUR-MODER,,,67458,,,,,,,,,,,,,,,,,,,2008-12-31,F,,,,,68.20B,NAFRev2,N,7.74199,48.828437,0.96,housenumber,14 Rue de la Gare 67590 Schweighouse-sur-Moder,67458_0380_00014,G,14 RUE DE LA GARE,
302924220,00015,30292422000015,O,,,,,2019-11-14T14:00:53,true,1,,22,,RUE,DU GENERAL DE GAULLE,67590,SCHWEIGHOUSE-SUR-MODER,,,67458,,,,,,,,,,,,,,,,,,,1985-12-25,F,,,,,81.21,NAP,N,7.738123,48.821132,0.96,housenumber,22 Rue du General de Gaulle 67590 Schweighouse-sur-Moder,67458_0400_00022,G,22 RUE DU GENERAL DE GAULLE,
303376586,00747,30337658600747,O,2013-07-31,11,2019,,2021-10-27T08:14:39,false,1,LOTISSEMENT COMMERCIAL PRIVE ROOS,,,,LOT NUMERO 3,67590,SCHWEIGHOUSE-SUR-MODER,,,67458,,,,,,,,,,,,,,,,,,,2013-07-31,A,DARTY,,,,47.54Z,NAFRev2,O,,,0,,,,,,
303708200,00017,30370820000017,O,,,,,2019-11-14T14:00:53,true,1,,,,,ZONE INDUSTRIELLE,67590,SCHWEIGHOUSE-SUR-MODER,,,67458,,,,,,,,,,,,,,,,,,,1984-12-25,F,,,,,21.15,NAP,N,7.742336,48.829976,0.93,street,Zone Industrielle Zinsel 67590 Schweighouse-sur-Moder,67458_0471,G,ZONE INDUSTRIELLE ZINSEL,
303814875,00025,30381487500025,O,,,,,2019-11-14T14:00:53,true,1,,,,,ZONE INDUSTRIELLE,67590,SCHWEIGHOUSE-SUR-MODER,,,67458,,,,,,,,,,,,,,,,,,,1985-12-25,F,,,,,25.03,NAP,N,7.742336,48.829976,0.93,street,Zone Industrielle Zinsel 67590 Schweighouse-sur-Moder,67458_0471,G,ZONE INDUSTRIELLE ZINSEL,
304552334,00019,30455233400019,O,1900-01-01,NN,,,2019-11-14T14:00:53,true,5,,10,,,COTEAU DE LA PINEDE,67590,SCHWEIGHOUSE-SUR-MODER,,,67458,,,,,,,,,,,,,,,,,,,2008-12-31,F,,,,,50.40Z,NAFRev2,O,7.728161,48.816277,0.96,housenumber,10 Coteau de la Pinede 67590 Schweighouse-sur-Moder,67458_0790_00010,G,10 COTEAU DE LA PINEDE,
304995491,00012,30499549100012,O,,,,,2019-11-14T14:00:53,true,1,,47,,RUE,D OHLUNGEN,67590,SCHWEIGHOUSE-SUR-MODER,,,67458,,,,,,,,,,,,,,,,,,,1992-07-31,F,,,,,52.4Y,NAF1993,N,7.735924,48.819552,0.82,housenumber,47 Route d’Ohlungen 67590 Schweighouse-sur-Moder,67458_0760_00047,G,47 ROUTE D OHLUNGEN,
305064016,00044,30506401600044,O,1998-10-01,NN,,,2019-11-14T14:00:53,false,4,,,,,ZONE COMMERCIALE ZINSEL,67590,SCHWEIGHOUSE-SUR-MODER,,,67458,,,,,,,,,,,,,,,,,,,2010-12-31,F,ABC DEPANN'PARE BRISE,,,,45.20A,NAFRev2,O,7.742336,48.829976,0.53,street,Zone Industrielle Zinsel 67590 Schweighouse-sur-Moder,67458_0471,G,ZONE INDUSTRIELLE ZINSEL,
305205411,00724,30520541100724,O,2003-08-01,NN,,,2019-11-14T14:00:53,false,3,,,,,ZI DE LA SABLIERE,67590,SCHWEIGHOUSE-SUR-MODER,,,67458,,,,,,,,,,,,,,,,,,,2006-01-01,F,,,,,90.0B,NAFRev1,O,7.748568,48.829491,0.69,street,Zone Industrielle la Sabliere 67590 Schweighouse-sur-Moder,67458_vrl0zz,G,ZONE INDUSTRIELLE LA SABLIERE,
305205411,00823,30520541100823,O,2006-01-01,00,2019,,2021-10-27T08:15:30,false,4,,10,,RUE,DU RIED,67590,SCHWEIGHOUSE-SUR-MODER,,,67458,,,,,,,,,,,,,,,,,,,2019-12-31,F,,,,,38.11Z,NAFRev2,O,7.743114,48.82537,0.96,housenumber,10 Rue du Ried 67590 Schweighouse-sur-Moder,67458_0815_00010,G,10 RUE DU RIED,
305499576,00026,30549957600026,O,1991-07-15,,,,2019-11-14T14:00:53,false,3,,16,,RUE,VICTOR HUGO,67590,SCHWEIGHOUSE-SUR-MODER,,,67458,,,,,,,,,,,,,,,,,,,1997-04-29,F,,,,,74.2A,NAF1993,N,7.719541,48.818231,0.96,housenumber,16 Rue Victor Hugo 67590 Schweighouse-sur-Moder,67458_1015_00016,G,16 RUE VICTOR HUGO,
305499576,00034,30549957600034,O,1997-04-29,NN,,,2019-11-14T14:00:53,true,4,,55,,RTE,DE WINTERSHOUSE,67590,SCHWEIGHOUSE-SUR-MODER,,,67458,,,,,,,,,,,,,,,,,,,2009-03-31,F,,,,,71.11Z,NAFRev2,N,7.731762,48.816178,0.89,housenumber,55 Route de Wintershouse 67590 Schweighouse-sur-Moder,67458_1060_00055,G,55 ROUTE DE WINTERSHOUSE,
305874869,00012,30587486900012,O,,,,,2019-11-14T14:00:53,true,1,,4,,RUE,BRULEE,67590,SCHWEIGHOUSE-SUR-MODER,,,67458,,,,,,,,,,,,,,,,,,,1986-12-31,F,,,,,64.11,NAP,N,7.734353,48.82085,0.95,housenumber,4 Rue Brulee 67590 Schweighouse-sur-Moder,67458_0100_00004,G,4 RUE BRULEE,
306203449,00013,30620344900013,O,1976-01-01,NN,,,2019-11-14T14:00:53,true,5,,,,,ZONE INDUSTRIELLE,67590,SCHWEIGHOUSE-SUR-MODER,,BP 7,67458,,,,,,,,,,,,,,,,,,,2002-08-14,F,,,,,70.2C,NAF1993,N,7.742336,48.829976,0.93,street,Zone Industrielle Zinsel 67590 Schweighouse-sur-Moder,67458_0471,G,ZONE INDUSTRIELLE ZINSEL,
306410101,00027,30641010100027,O,1985-04-20,NN,,,2019-11-14T14:00:53,true,3,,27,,RUE,DU GENERAL DE GAULLE,67590,SCHWEIGHOUSE-SUR-MODER,,,67458,,,,,,,,,,,,,,,,,,,2008-01-01,A,,,,,68.20B,NAFRev2,N,7.736444,48.821281,0.96,housenumber,27 Rue du General de Gaulle 67590 Schweighouse-sur-Moder,67458_0400_00027,G,27 RUE DU GENERAL DE GAULLE,
306684465,00017,30668446500017,O,1900-01-01,NN,,,2019-11-14T14:00:53,true,4,,41,,RTE,D OHLUNGEN,67590,SCHWEIGHOUSE-SUR-MODER,,,67458,,,,,,,,,,,,,,,,,,,2009-11-30,F,,,,,85.53Z,NAFRev2,N,7.736603,48.819695,0.86,housenumber,41 Route d’Ohlungen 67590 Schweighouse-sur-Moder,67458_0760_00041,G,41 ROUTE D OHLUNGEN,
307068759,00017,30706875900017,O,,,,,2019-11-14T14:00:53,true,1,,34,,RTE,D'OHLUNGEN,67590,SCHWEIGHOUSE-SUR-MODER,,,67458,,,,,,,,,,,,,,,,,,,1988-10-31,F,,,,,60.2M,NAF1993,N,7.735371,48.819499,0.86,housenumber,34 Route d’Ohlungen 67590 Schweighouse-sur-Moder,67458_0760_00034,G,34 ROUTE D OHLUNGEN,
307102186,00037,30710218600037,O,1900-01-01,NN,,,2019-11-14T14:00:53,false,5,,6,,PL,DU MAIRE WENDLING,67590,SCHWEIGHOUSE-SUR-MODER,,,67458,,,,,,,,,,,,,,,,,,,2008-01-01,F,,,,,86.90E,NAFRev2,O,7.736175,48.820434,0.8,housenumber,6 Rue du Maire Wendling 67590 Schweighouse-sur-Moder,67458_0531_00006,G,6 RUE DU MAIRE WENDLING,
307102186,00045,30710218600045,O,2000-01-01,NN,,,2019-11-14T14:00:53,true,2,,2,,PL,DU MAIRE WENDLING,67590,SCHWEIGHOUSE-SUR-MODER,,,67458,,,,,,,,,,,,,,,,,,,2012-05-11,F,,,,,86.90E,NAFRev2,O,7.736037,48.8219,0.87,housenumber,2 Place du Maire Wendling 67590 Schweighouse-sur-Moder,67458_0530_00002,G,2 PLACE DU MAIRE WENDLING,
307102210,00019,30710221000019,O,,,,,2019-11-14T14:00:53,true,1,,34,,RUE,DU VALLON,67590,SCHWEIGHOUSE-SUR-MODER,,,67458,,,,,,,,,,,,,,,,,,,1993-02-28,F,,,,,51.1G,NAF1993,N,7.720529,48.814715,0.96,housenumber,34 Rue du Vallon 67590 Schweighouse-sur-Moder,67458_1000_00034,G,34 RUE DU VALLON,
307102418,00018,30710241800018,O,1971-01-01,NN,,,2019-11-14T14:00:53,true,3,,10,,,SCHELMENWASEN,67590,SCHWEIGHOUSE-SUR-MODER,,,67458,,,,,,,,,,,,,,,,,,,2008-01-01,A,,,,,68.20B,NAFRev2,N,7.728314,48.82192,0.93,housenumber,10 Rue Schelmenwasen 67590 Schweighouse-sur-Moder,67458_0880_00010,G,10 RUE SCHELMENWASEN,
307102657,00011,30710265700011,O,,NN,,,2019-11-14T14:00:53,true,1,,8,,,PETITE RUE BREITUNG,67590,SCHWEIGHOUSE-SUR-MODER,,,67458,,,,,,,,,,,,,,,,,,,1996-12-31,F,,,,,93.0N,NAF1993,N,7.730966,48.819462,0.96,housenumber,8 Petite Rue Breitung 67590 Schweighouse-sur-Moder,67458_0081_00008,G,8 PETITE RUE BREITUNG,