siren,nic,siret,statutDiffusionEtablissement,dateCreationEtablissement,trancheEffectifsEtablissement,anneeEffectifsEtablissement,activitePrincipaleRegistreMetiersEtablissement,dateDernierTraitementEtablissement,etablissementSiege,nombrePeriodesEtablissement,complementAdresseEtablissement,numeroVoieEtablissement,indiceRepetitionEtablissement,typeVoieEtablissement,libelleVoieEtablissement,codePostalEtablissement,libelleCommuneEtablissement,libelleCommuneEtrangerEtablissement,distributionSpecialeEtablissement,codeCommuneEtablissement,codeCedexEtablissement,libelleCedexEtablissement,codePaysEtrangerEtablissement,libellePaysEtrangerEtablissement,complementAdresse2Etablissement,numeroVoie2Etablissement,indiceRepetition2Etablissement,typeVoie2Etablissement,libelleVoie2Etablissement,codePostal2Etablissement,libelleCommune2Etablissement,libelleCommuneEtranger2Etablissement,distributionSpeciale2Etablissement,codeCommune2Etablissement,codeCedex2Etablissement,libelleCedex2Etablissement,codePaysEtranger2Etablissement,libellePaysEtranger2Etablissement,dateDebut,etatAdministratifEtablissement,enseigne1Etablissement,enseigne2Etablissement,enseigne3Etablissement,denominationUsuelleEtablissement,activitePrincipaleEtablissement,nomenclatureActivitePrincipaleEtablissement,caractereEmployeurEtablissement,longitude,latitude,geo_score,geo_type,geo_adresse,geo_id,geo_ligne,geo_l4,geo_l5
218601367,00012,21860136700012,O,1983-03-01,03,2019,,2021-10-27T08:11:05,true,4,,,,RTE,DE BIOUSSAC,86400,LIZANT,,,86136,,,,,,,,,,,,,,,,,,,2008-01-01,A,MAIRIE,,,,84.11Z,NAFRev2,O,0.279069,46.084406,0.32,street,Rue de la Sonnette 86400 Lizant,86136_0035,G,RUE DE LA SONNETTE,
218601367,00020,21860136700020,O,1983-12-21,01,2019,,2021-10-27T08:11:05,false,5,,4,,RUE,DES ECOLIERS,86400,LIZANT,,,86136,,,,,,,,,,,,,,,,,,,2020-09-01,A,ECOLE PRIMAIRE LIZANT,,,,85.20Z,NAFRev2,N,0.280156,46.083571,0.94,housenumber,4 Rue des Ecoliers 86400 Lizant,86136_0012_00004,G,4 RUE DES ECOLIERS,
268602463,00013,26860246300013,O,1995-12-25,NN,,,2016-10-05T08:37:20,true,4,MAIRIE,,,RTE,DE BIOUSSAC,86400,LIZANT,,,86136,,,,,,,,,,,,,,,,,,,2016-12-31,F,,,,,88.99B,NAFRev2,N,0.279069,46.084406,0.32,street,Rue de la Sonnette 86400 Lizant,86136_0035,G,RUE DE LA SONNETTE,
268602935,00010,26860293500010,O,1995-12-25,NN,,,2016-07-23T12:26:17,true,4,MAIRIE,,,RTE,DE BIOUSSAC,86400,LIZANT,,,86136,,,,,,,,,,,,,,,,,,,2015-12-31,F,,,,,88.99B,NAFRev2,N,0.279069,46.084406,0.32,street,Rue de la Sonnette 86400 Lizant,86136_0035,G,RUE DE LA SONNETTE,
298600552,00012,29860055200012,O,1983-08-10,NN,,,2014-04-07T17:26:55,true,4,,,,,MAIRIE,86400,LIZANT,,,86136,,,,,,,,,,,,,,,,,,,1999-12-27,F,,,,,70.1C,NAF1993,N,0.279411,46.085942,0.51,street,Rue de la Maréchalerie 86400 Lizant,86136_0024,G,RUE DE LA MARECHALERIE,
304378904,00011,30437890400011,O,1986-01-01,NN,,,2013-02-02T12:16:13,true,4,,,,,,86400,LIZANT,,,86136,,,,,,,,,,,,,,,,,,,2012-12-25,F,,,,,01.11Z,NAFRev2,N,,,0,,,,,,
305275729,00013,30527572900013,O,1976-01-01,NN,,,,true,1,,,,,,86400,LIZANT,,,86136,,,,,,,,,,,,,,,,,,,1995-12-31,F,,,,,52.4Z,NAF1993,O,,,0,,,,,,
305352676,00020,30535267600020,O,,,,,,true,1,,,,,,86400,LIZANT,,,86136,,,,,,,,,,,,,,,,,,,1993-10-17,F,,,,,15.8C,NAF1993,N,,,0,,,,,,
306089673,00017,30608967300017,O,,,,,,true,1,,,,PL,DE L'EGLISE,86400,LIZANT,,,86136,,,,,,,,,,,,,,,,,,,1985-12-25,F,,,,,67.08,NAP,N,-1.1676989,44.0766928,0.78,poi.park,Place de l'Église (Parc) Mézos,https://osm.org/way/37053988,G,,
306091174,00012,30609117400012,O,1965-01-01,NN,,,,true,4,,,,,,86400,LIZANT,,,86136,,,,,,,,,,,,,,,,,,,2001-10-15,F,,,,,52.2C,NAF1993,O,,,0,,,,,,
308188887,00019,30818888700019,O,1976-01-01,NN,,,,true,3,,,,,LE BOURG,86400,LIZANT,,,86136,,,,,,,,,,,,,,,,,,,1998-12-25,F,,,,,70.2C,NAF1993,N,0.259731,46.084123,0.5,street,Le Moulin de Boisseguin 86400 Lizant,86136_B132,G,LE MOULIN DE BOISSEGUIN,
308637891,00018,30863789100018,O,,,,,,true,1,,,,,CHEZ DAVID,86400,LIZANT,,,86136,,,,,,,,,,,,,,,,,,,1985-12-25,F,,,,,67.07,NAP,N,0.286926,46.085396,0.94,street,Chez David 86400 Lizant,86136_B066,G,CHEZ DAVID,
308778299,00013,30877829900013,O,1900-01-01,,,,2007-01-18T09:11:50,true,2,,,,,GRANDILLE,86400,LIZANT,,,86136,,,,,,,,,,,,,,,,,,,1993-12-25,F,,,,,01.4A,NAF1993,N,0.311699,46.074379,0.66,street,Grondillé 86400 Lizant,86136_17iv6m,G,GRONDILLE,
314877978,00010,31487797800010,O,,,,,,true,1,,,,,CHEZ BOULARD,86400,LIZANT,,,86136,,,,,,,,,,,,,,,,,,,1984-12-25,F,,,,,55.60,NAP,N,0.292908,46.082764,0.94,street,Chez Boulard 86400 Lizant,86136_B064,G,CHEZ BOULARD,
317547123,00016,31754712300016,O,1979-01-01,NN,,,2014-07-08T00:21:13,false,4,,,,LD,LES BRANDES,86400,LIZANT,,,86136,,,,,,,,,,,,,,,,,,,2010-08-01,F,,,,,11.01Z,NAFRev2,N,0.291521,46.068134,0.94,street,Les Brandes 86400 Lizant,86136_b1i2j1,G,LES BRANDES,
317547123,00024,31754712300024,O,1987-12-31,NN,,,2021-02-23T10:42:27,true,3,,,,,LES BRANDES,86400,LIZANT,,,86136,,,,,,,,,,,,,,,,,,,2008-01-01,A,,,,,01.11Z,NAFRev2,N,0.291521,46.068134,0.94,street,Les Brandes 86400 Lizant,86136_b1i2j1,G,LES BRANDES,
321248742,00025,32124874200025,O,1986-06-02,NN,,,2014-07-08T00:25:18,true,4,,,,,,86400,LIZANT,,,86136,,,,,,,,,,,,,,,,,,,2013-03-31,F,,,,,43.32A,NAFRev2,N,,,0,,,,,,
321506214,00030,32150621400030,O,2021-07-15,,,,2021-09-06T10:00:29,true,1,,7,,,LA FAYE,86400,LIZANT,,,86136,,,,,,,,,,,,,,,,,,,2021-07-15,A,,,,,90.03A,NAFRev2,N,0.269434,46.084871,0.94,housenumber,7 La Faye 86400 Lizant,86136_0mjhh0_00007,G,7 LA FAYE,
323279018,00069,32327901800069,O,2012-04-01,,,,2019-01-22T09:32:06,true,3,,2,,PL,LIEU-DIT CHEZ DAVID NO 2,86400,LIZANT,,,86136,,,,,,,,,,,,,,,,,,,2018-12-31,A,,,,HORS SERIE,68.20B,NAFRev2,N,0.286807,46.085507,0.61,housenumber,2 Chez David 86400 Lizant,86136_b066_00002,G,2 CHEZ DAVID,
323345314,00021,32334531400021,O,,,,,,true,1,,,,LD,LA GRANDE BARDATTE,86400,LIZANT,,,86136,,,,,,,,,,,,,,,,,,,1988-03-31,F,,,,,57.06,NAP,N,0.250322,46.083206,0.8,street,La Grande Barbatte 86400 Lizant,86136_B106,G,LA GRANDE BARBATTE,
323852004,00031,32385200400031,O,1990-08-06,NN,,,2006-12-15T00:22:03,false,3,,,,,LES COLLINEAUX,86400,LIZANT,,,86136,,,,,,,,,,,,,,,,,,,1992-12-31,F,,,,,52.6E,NAF1993,N,0.279599,46.092438,0.94,street,Les Collineaux 86400 Lizant,86136_o28ren,G,LES COLLINEAUX,
325976975,00012,32597697500012,O,,,,,,true,1,,,,,,86400,LIZANT,,,86136,,,,,,,,,,,,,,,,,,,1985-12-25,F,,,,,81.21,NAP,N,,,0,,,,,,
326072105,00017,32607210500017,O,1960-01-01,NN,,,2010-12-23T10:21:35,true,5,,,,LD,LA BARBATTE,86400,LIZANT,,,86136,,,,,,,,,,,,,,,,,,,2008-01-01,F,,,,,46.32C,NAFRev2,N,0.250322,46.083206,0.86,street,La Grande Barbatte 86400 Lizant,86136_B106,G,LA GRANDE BARBATTE,
326271095,00019,32627109500019,O,,,,,,true,1,,,,LD,LA GALARDERIE,86400,LIZANT,,,86136,,,,,,,,,,,,,,,,,,,1985-12-25,F,,,,,55.60,NAP,N,0.301744,46.071618,0.75,street,La Galardrie 86400 Lizant,86136_xc70xl,G,LA GALARDRIE,
326342078,00010,32634207800010,O,,,,,,true,1,,,,LD,CHEZ DAVID,86400,LIZANT,,,86136,,,,,,,,,,,,,,,,,,,1985-12-25,F,,,,,57.01,NAP,N,0.286926,46.085396,0.94,street,Chez David 86400 Lizant,86136_B066,G,CHEZ DAVID,
326680238,00010,32668023800010,O,,NN,,,,true,1,,,,,,86400,LIZANT,,,86136,,,,,,,,,,,,,,,,,,,1996-09-06,F,,,,,51.6N,NAF1993,N,,,0,,,,,,
326871746,00011,32687174600011,O,,NN,,,,true,1,,,,LD,CHEZ GUERIN,86400,LIZANT,,,86136,,,,,,,,,,,,,,,,,,,1986-12-25,F,,,,,01.1A,NAF1993,N,0.302549,46.077603,0.94,street,Chez Guérin 86400 Lizant,86136_B068,G,CHEZ GUERIN,
326874138,00018,32687413800018,O,,NN,,,,true,1,,,,,,86400,LIZANT,,,86136,,,,,,,,,,,,,,,,,,,,F,,,,,81.21,NAP,N,,,0,,,,,,
326897493,00010,32689749300010,O,1983-01-01,NN,,,2012-10-23T09:14:42,false,3,,,,LD,BOISSEGUIN,86400,LIZANT,,,86136,,,,,,,,,,,,,,,,,,,2005-02-21,F,,,,,01.4A,NAFRev1,N,0.261387,46.088443,0.94,street,Boisseguin 86400 Lizant,86136_26bpxw,G,BOISSEGUIN,
326897493,00028,32689749300028,O,1987-12-31,NN,,,2006-10-27T01:41:46,false,3,,,,,BOISSEGUIN,86400,LIZANT,,,86136,,,,,,,,,,,,,,,,,,,2005-02-21,F,,,,,01.1A,NAFRev1,N,0.261387,46.088443,0.94,street,Boisseguin 86400 Lizant,86136_26bpxw,G,BOISSEGUIN,
327270799,00015,32727079900015,O,,NN,,,,true,1,,,,RTE,DE RUFFEC,86400,LIZANT,,,86136,,,,,,,,,,,,,,,,,,,1994-12-31,F,,,,,52.6E,NAF1993,O,0.279069,46.084406,0.41,street,Rue de la Sonnette 86400 Lizant,86136_0035,G,RUE DE LA SONNETTE,
327280301,00026,32728030100026,O,1996-01-01,NN,,,2007-05-19T09:24:54,false,3,,,,,,86400,LIZANT,,,86136,,,,,,,,,,,,,,,,,,,2005-07-31,F,,,,,52.4Z,NAFRev1,O,,,0,,,,,,
329013734,00028,32901373400028,O,1998-01-01,NN,,,2006-10-27T01:53:21,true,3,,,,LD,LA GRANDE BARBATTE,86400,LIZANT,,,86136,,,,,,,,,,,,,,,,,,,2005-04-30,F,,,,,70.2A,NAFRev1,N,0.250322,46.083206,0.95,street,La Grande Barbatte 86400 Lizant,86136_B106,G,LA GRANDE BARBATTE,
329842629,00035,32984262900035,O,2021-04-10,,,,2021-06-19T11:41:59,true,1,,3,,LD,DE BOUTIERS,86400,LIZANT,,,86136,,,,,,,,,,,,,,,,,,,2021-04-10,A,,,,PAUVERT ALAIN,46.71Z,NAFRev2,N,0.241168,46.084074,0.69,housenumber,3 Boutiers 86400 Lizant,86136_e61rwm_00003,G,3 BOUTIERS,
331348235,00010,33134823500010,O,,NN,,,,true,1,,,,LD,CHEZ DAVID,86400,LIZANT,,,86136,,,,,,,,,,,,,,,,,,,1987-09-07,F,,,,,37.03,NAP,N,0.286926,46.085396,0.94,street,Chez David 86400 Lizant,86136_B066,G,CHEZ DAVID,
331547604,00032,33154760400032,O,1989-07-04,NN,,,2009-03-23T10:47:37,false,3,,,,,GRANDE BARBATTE,86400,LIZANT,,,86136,,,,,,,,,,,,,,,,,,,1993-12-31,F,,,,,52.6E,NAF1993,N,0.250322,46.083206,0.94,street,La Grande Barbatte 86400 Lizant,86136_B106,G,LA GRANDE BARBATTE,
333043727,00010,33304372700010,O,,NN,,,,true,1,,,,LD,LA FOUCHARDIERE,86400,LIZANT,,,86136,,,,,,,,,,,,,,,,,,,1991-12-31,F,,,,,01.80,NAP,N,0.299485,46.084395,0.94,street,La Fouchardière 86400 Lizant,86136_9o02yu,G,LA FOUCHARDIERE,
333552875,00010,33355287500010,O,,NN,,,,true,1,,,,LD,BOISSEGUIN,86400,LIZANT,,,86136,,,,,,,,,,,,,,,,,,,1994-12-31,F,,,,,01.1A,NAF1993,N,0.261387,46.088443,0.94,street,Boisseguin 86400 Lizant,86136_26bpxw,G,BOISSEGUIN,
333578698,00040,33357869800040,O,2001-07-01,NN,,,2008-11-07T00:53:25,true,4,,,,,LA RENARDE,86400,LIZANT,,,86136,,,,,,,,,,,,,,,,,,,2007-10-15,F,,,,,45.4M,NAFRev1,N,0.28803,46.083213,0.94,street,La Renarde 86400 Lizant,86136_2wjo55,G,LA RENARDE,
337776850,00014,33777685000014,O,1986-01-01,NN,,,,true,1,,,,LD,LES BRANDES,86400,LIZANT,,,86136,,,,,,,,,,,,,,,,,,,2001-09-30,F,,,,,01.2A,NAF1993,N,0.291521,46.068134,0.94,street,Les Brandes 86400 Lizant,86136_b1i2j1,G,LES BRANDES,
338170186,00013,33817018600013,O,,NN,,,,true,1,,,,LD,LA FAYE,86400,LIZANT,,,86136,,,,,,,,,,,,,,,,,,,1990-11-19,F,,,,,59.08,NAP,N,0.27003,46.084746,0.94,street,La Faye 86400 Lizant,86136_0mjhh0,G,LA FAYE,
338926769,00070,33892676900070,O,2008-05-22,,,,2021-02-23T10:55:19,true,1,,,,,LE VIEUX LOGIS,86400,LIZANT,,,86136,,,,,,,,,,,,,,,,,,,2008-05-22,A,,,,,90.03A,NAFRev2,N,5.4348557,46.1324494,0.9,poi.bar,Le vieux logis (Bar) Serrières-sur-Ain,https://osm.org/node/3646999402,G,,
339688285,00016,33968828500016,O,1984-10-08,,,,2007-05-19T09:56:56,true,4,,,,PL,DE L'EGLISE,86400,LIZANT,,,86136,,,,,,,,,,,,,,,,,,,2005-08-31,F,,,,,55.1A,NAFRev1,N,-1.1676989,44.0766928,0.78,poi.park,Place de l'Église (Parc) Mézos,https://osm.org/way/37053988,G,,
340454149,00030,34045414900030,O,2015-12-01,,,,2021-02-23T10:56:28,true,1,BOISSEGUIN,1,,RUE,"DU CHATEAU,",86400,LIZANT,,,86136,,,,,,,,,,,,,,,,,,,2015-12-01,A,,,,,41.10D,NAFRev2,N,0.279015,46.084969,0.48,housenumber,1 Rue du 8 Mai 1945 86400 Lizant,86136_0002_00001,G,1 RUE DU 8 MAI 1945,
342019635,00024,34201963500024,O,,,,,,true,1,,,,RTE,DE LA MANIERE,86400,LIZANT,,,86136,,,,,,,,,,,,,,,,,,,1993-02-28,F,,,,,45.1D,NAF1993,N,0.285797,46.086802,0.63,street,La Manière 86400 Lizant,86136_egzqin,G,LA MANIERE,
342887775,00019,34288777500019,O,1987-10-23,NN,,,2017-07-25T11:17:26,true,4,,,,LD,CHEZ DIJONNEAU,86400,LIZANT,,,86136,,,,,,,,,,,,,,,,,,,2012-12-31,F,,,,,01.43Z,NAFRev2,O,0.27863,46.07883,0.94,street,Chez Dijonneau 86400 Lizant,86136_B067,G,CHEZ DIJONNEAU,
343575643,00014,34357564300014,O,1988-01-04,NN,,,,true,3,,,,,CHEZ MOQUERAT,86400,LIZANT,,,86136,,,,,,,,,,,,,,,,,,,1992-12-31,F,,,,,02.0B,NAF1993,N,0.277872,46.079636,0.94,street,Chez Moquerat 86400 Lizant,86136_B069,G,CHEZ MOQUERAT,
349164202,00013,34916420200013,O,1988-11-01,NN,,,2007-01-18T09:26:38,true,3,,,,LD,LA VIZELLE,86400,LIZANT,,,86136,,,,,,,,,,,,,,,,,,,1998-12-25,F,,,,,01.3Z,NAF1993,N,0.280603,46.07246,0.94,street,La Vizelle 86400 Lizant,86136_l086gy,G,LA VIZELLE,
351047063,00018,35104706300018,O,,NN,,,,true,1,,,,LD,LA BARBOTTE,86400,LIZANT,,,86136,,,,,,,,,,,,,,,,,,,1989-03-01,F,,,,,01.2J,NAF1993,N,0.250322,46.083206,0.63,street,La Grande Barbatte 86400 Lizant,86136_B106,G,LA GRANDE BARBATTE,
351551031,00013,35155103100013,O,1989-08-16,NN,,,,true,4,,,,,LA GRANDE BARBATTE,86400,LIZANT,,,86136,,,,,,,,,,,,,,,,,,,1999-12-25,F,,,,,60.2M,NAF1993,O,0.250322,46.083206,0.95,street,La Grande Barbatte 86400 Lizant,86136_B106,G,LA GRANDE BARBATTE,
352018287,00016,35201828700016,O,1989-10-01,NN,,,2010-04-18T05:25:49,true,3,,,,,LA FOUCHARDIERE,86400,LIZANT,,,86136,,,,,,,,,,,,,,,,,,,2008-01-01,A,,,,,01.11Z,NAFRev2,N,0.299485,46.084395,0.94,street,La Fouchardière 86400 Lizant,86136_9o02yu,G,LA FOUCHARDIERE,
353173974,00018,35317397400018,O,1989-01-20,NN,,,,true,1,,,,,LA BARBATTE,86400,LIZANT,,,86136,,,,,,,,,,,,,,,,,,,2000-12-31,F,,,,,01.1A,NAF1993,N,0.250322,46.083206,0.86,street,La Grande Barbatte 86400 Lizant,86136_B106,G,LA GRANDE BARBATTE,
382815678,00018,38281567800018,O,1991-07-01,NN,,4399DC,2018-08-10T14:09:52,true,5,LE BOURG,,,RTE,DE LA FOUCHARDIERE,86400,LIZANT,,,86136,,,,,,,,,,,,,,,,,,,2015-07-01,F,,,,,42.21Z,NAFRev2,O,0.299485,46.084395,0.69,street,La Fouchardière 86400 Lizant,86136_9o02yu,G,LA FOUCHARDIERE,
383891520,00017,38389152000017,O,1991-11-06,NN,,,2015-05-14T05:03:03,true,3,,,,LD,CHEZ BOULARD,86400,LIZANT,,,86136,,,,,,,,,,,,,,,,,,,2008-01-01,A,,,,,01.11Z,NAFRev2,N,0.292908,46.082764,0.94,street,Chez Boulard 86400 Lizant,86136_B064,G,CHEZ BOULARD,
387967714,00016,38796771400016,O,1992-07-06,NN,,,2008-11-08T00:48:01,true,3,,,,LD,LE MALBOEUF,86400,LIZANT,,,86136,,,,,,,,,,,,,,,,,,,2007-06-30,F,,,,,45.4M,NAFRev1,N,0.300062,46.092314,0.94,street,Le Malbœuf 86400 Lizant,86136_ymnzbi,G,LE MALBOEUF,
389379231,00019,38937923100019,O,1992-07-01,NN,,,,false,4,,,,,LE BOURG,86400,LIZANT,,,86136,,,,,,,,,,,,,,,,,,,2001-12-31,F,,,,,15.8C,NAF1993,O,0.259731,46.084123,0.5,street,Le Moulin de Boisseguin 86400 Lizant,86136_B132,G,LE MOULIN DE BOISSEGUIN,
393145750,00013,39314575000013,O,1993-10-18,NN,,,2008-11-08T00:57:36,false,4,,,,RTE,DE BIOUSSAC,86400,LIZANT,,,86136,,,,,,,,,,,,,,,,,,,1997-12-25,F,,,,,15.8C,NAF1993,O,0.279069,46.084406,0.32,street,Rue de la Sonnette 86400 Lizant,86136_0035,G,RUE DE LA SONNETTE,
393724059,00018,39372405900018,O,1994-02-01,NN,,,2014-07-08T01:22:35,true,5,,,,,LA GRANDE BARBATTE,86400,LIZANT,,,86136,,,,,,,,,,,,,,,,,,,2011-12-31,F,,,,,43.91A,NAFRev2,N,0.250322,46.083206,0.95,street,La Grande Barbatte 86400 Lizant,86136_B106,G,LA GRANDE BARBATTE,
398729624,00013,39872962400013,O,1994-09-01,NN,,,,false,3,,,,,CHEZ BOULARD,86400,LIZANT,,,86136,,,,,,,,,,,,,,,,,,,1996-08-26,F,,,,,02.0B,NAF1993,N,0.292908,46.082764,0.94,street,Chez Boulard 86400 Lizant,86136_B064,G,CHEZ BOULARD,
400547709,00016,40054770900016,O,1995-03-30,NN,,,,false,4,,,,,,86400,LIZANT,,,86136,,,,,,,,,,,,,,,,,,,2001-05-04,F,,,,,70.2A,NAF1993,N,,,0,,,,,,
405380304,00015,40538030400015,O,1996-01-01,NN,,,2006-10-28T03:27:56,true,3,,,,,,86400,LIZANT,,,86136,,,,,,,,,,,,,,,,,,,2005-07-31,F,,,,,70.2C,NAFRev1,N,,,0,,,,,,
408052835,00027,40805283500027,O,1997-11-01,NN,,,,true,1,,,,,LE BOURG,86400,LIZANT,,,86136,,,,,,,,,,,,,,,,,,,2001-02-18,F,,,,,45.4A,NAF1993,N,0.259731,46.084123,0.5,street,Le Moulin de Boisseguin 86400 Lizant,86136_B132,G,LE MOULIN DE BOISSEGUIN,
412873119,00017,41287311900017,O,1987-12-31,NN,,,,true,1,,,,,LA FRAGNEE,86400,LIZANT,,,86136,,,,,,,,,,,,,,,,,,,2000-07-31,F,,,,,01.1A,NAF1993,N,0.275662,46.084732,0.94,street,La Fragnée 86400 Lizant,86136_mjlhrn,G,LA FRAGNEE,
413434119,00017,41343411900017,O,1997-06-02,NN,,,2014-07-08T01:47:08,false,4,,,,RTE,DE BIOUSSAC,86400,LIZANT,,,86136,,,,,,,,,,,,,,,,,,,2008-11-07,F,,,,,10.71C,NAFRev2,O,0.279069,46.084406,0.32,street,Rue de la Sonnette 86400 Lizant,86136_0035,G,RUE DE LA SONNETTE,
418237715,00028,41823771500028,O,1999-10-01,NN,,,2008-11-08T01:33:23,false,4,,,,,ENFAYE,86400,LIZANT,,,86136,,,,,,,,,,,,,,,,,,,2002-10-01,F,,,,,45.2V,NAF1993,O,0.26968,46.078565,0.94,street,Enfaye 86400 Lizant,86136_6q9rsb,G,ENFAYE,
418381661,00028,41838166100028,O,2009-02-02,,,,2016-04-20T03:41:06,false,2,,,,,PEULIARD,86400,LIZANT,,,86136,,,,,,,,,,,,,,,,,,,2016-03-01,F,,,,,68.20B,NAFRev2,N,0.305271,46.093629,0.94,street,Peuliard 86400 Lizant,86136_jtw6lt,G,PEULIARD,
419993571,00027,41999357100027,O,2003-07-05,NN,,5610CQ,2021-02-23T11:40:58,true,9,,,,,CHEZ DAVID,86400,LIZANT,,,86136,,,,,,,,,,,,,,,,,,,2016-07-20,A,COGEFA,,,COGEFA,82.19Z,NAFRev2,N,0.286926,46.085396,0.94,street,Chez David 86400 Lizant,86136_B066,G,CHEZ DAVID,
420150898,00013,42015089800013,O,1998-09-17,NN,,3312ZA,2017-03-07T08:42:01,false,6,,,,,LA BOBLIERE,86400,LIZANT,,,86136,,,,,,,,,,,,,,,,,,,2010-07-01,A,,,,,46.61Z,NAFRev2,O,0.282717,46.090453,0.94,street,La Boblière 86400 Lizant,86136_n99skk,G,LA BOBLIERE,
422539916,00029,42253991600029,O,2011-06-24,NN,,4399CZ,2017-03-30T10:00:32,false,4,MALBOEUF,,,,LA CHATAIGNERAIE,86400,LIZANT,,,86136,,,,,,,,,,,,,,,,,,,2017-03-15,F,,,,,43.99C,NAFRev2,N,0.271202,46.086595,0.92,street,Ld la Chataigneraie de la Faye 86400 Lizant,86136_inzp85,G,LD LA CHATAIGNERAIE DE LA FAYE,
422539916,00037,42253991600037,O,2017-04-01,,,4399CZ,2021-02-23T11:44:12,true,1,,3,,,MALBOEUF,86400,LIZANT,,,86136,,,,,,,,,,,,,,,,,,,2017-04-01,A,JOSSE MACONNERIE,,,,43.99C,NAFRev2,N,0.299988,46.091912,0.85,housenumber,3 Le Malbœuf 86400 Lizant,86136_ymnzbi_00003,G,3 LE MALBOEUF,
422626598,00037,42262659800037,O,1994-02-23,11,2019,,2021-10-27T08:04:00,false,4,,,,,,86400,LIZANT,,BP 33,86136,,,,,,,,,,,,,,,,,,,2008-01-01,A,CENTRE D'AIDE PAR LE TRAVAIL,,,,88.10C,NAFRev2,O,,,0,,,,,,
422626598,00045,42262659800045,O,1994-02-23,11,2019,,2021-10-27T08:04:00,false,6,,,,,,86400,LIZANT,,BP 33,86136,,,,,,,,,,,,,,,,,,,2020-01-31,A,FOYER DU CENTRE D'AIDE PAR LE TRAVAIL,,,,87.20A,NAFRev2,N,,,0,,,,,,
422626598,00052,42262659800052,O,1994-02-23,NN,,,2020-02-05T14:32:57,false,7,,,,,,86400,LIZANT,,BP 33,86136,,,,,,,,,,,,,,,,,,,2020-01-10,F,FOYER DE VIE ANNEXE CAT,,,,87.20A,NAFRev2,N,,,0,,,,,,
422626598,00060,42262659800060,O,1994-02-23,NN,,,2016-07-22T13:19:42,false,6,,,,,,86400,LIZANT,,BP 33,86136,,,,,,,,,,,,,,,,,,,2016-03-18,F,SERVICE DE SUITE SASIMO CAT,,,,88.10A,NAFRev2,O,,,0,,,,,,
422626598,00177,42262659800177,O,2008-01-01,12,2019,,2021-10-27T08:04:00,false,1,ESAT PRODUCTION,,,,LE CABEAU,86400,LIZANT,,,86136,,,,,,,,,,,,,,,,,,,2008-01-01,A,ESAT PRODUCTION,,,,88.10C,NAFRev2,O,0.285006,46.086806,0.94,street,Le Cabeau 86400 Lizant,86136_pfsn2d,G,LE CABEAU,
423640804,00039,42364080400039,O,2001-06-30,01,2019,4321AB,2021-10-27T08:05:19,true,7,,,,LD,LA PETITE BARBATTE,86400,LIZANT,,,86136,,,,,,,,,,,,,,,,,,,2020-07-31,F,,,,,43.21A,NAFRev2,O,0.244148,46.085016,0.94,street,La Petite Barbatte 86400 Lizant,86136_B146,G,LA PETITE BARBATTE,
423656867,00011,42365686700011,O,1999-07-01,NN,,,2020-08-25T10:14:43,true,5,,,,,LES BOUTIERS,86400,LIZANT,,,86136,,,,,,,,,,,,,,,,,,,2018-12-31,F,,,,,55.20Z,NAFRev2,N,0.241283,46.084098,0.68,street,Boutiers 86400 Lizant,86136_e61rwm,G,BOUTIERS,
428644884,00010,42864488400010,O,2000-01-01,NN,,,,true,3,,,,RUE,DU HUIT MAI 1945,86400,LIZANT,,,86136,,,,,,,,,,,,,,,,,,,2003-12-31,F,,,,,02.0B,NAFRev1,N,0.279469,46.085046,0.7,street,Rue du 8 Mai 1945 86400 Lizant,86136_0002,G,RUE DU 8 MAI 1945,
431005941,00015,43100594100015,O,1985-01-01,NN,,,2010-10-21T03:42:56,true,4,,,,,,86400,LIZANT,,,86136,,,,,,,,,,,,,,,,,,,2010-07-20,F,,,,,68.20B,NAFRev2,N,,,0,,,,,,
435323191,00021,43532319100021,O,2001-10-01,NN,,,2012-05-05T07:53:49,false,7,,,,,LE VIEUX LOGIS,86400,LIZANT,,,86136,,,,,,,,,,,,,,,,,,,2010-06-01,A,,,,,68.20B,NAFRev2,N,5.4348557,46.1324494,0.9,poi.bar,Le vieux logis (Bar) Serrières-sur-Ain,https://osm.org/node/3646999402,G,,
435323191,00054,43532319100054,O,2015-02-01,,,,2021-02-23T13:17:30,true,1,LE VIEUX LOGIS,4,,RUE,DE LA MARECHALERIE,86400,LIZANT,,,86136,,,,,,,,,,,,,,,,,,,2015-02-01,A,,,,,68.20B,NAFRev2,N,0.27999,46.086273,0.94,housenumber,4 Rue de la Maréchalerie 86400 Lizant,86136_0024_00004,G,4 RUE DE LA MARECHALERIE,
437647308,00018,43764730800018,O,2001-04-01,NN,,,2021-07-27T09:01:04,true,3,,2,,IMP,DES TANNEURS,86400,LIZANT,,,86136,,,,,,,,,,,,,,,,,,,2008-01-01,A,,,,,68.20B,NAFRev2,N,0.27869,46.083953,0.84,housenumber,2 Impasse des Tanneurs 86400 Lizant,86136_0040_00002,G,2 IMPASSE DES TANNEURS,
437724586,00015,43772458600015,O,2000-08-01,NN,,,2010-12-05T04:08:33,true,3,LAFRAGNEE,,,,,86400,LIZANT,,,86136,,,,,,,,,,,,,,,,,,,2008-01-01,A,,,,,01.45Z,NAFRev2,N,,,0,,,,,,
438176919,00035,43817691900035,O,2013-09-18,,,,2021-02-23T13:18:31,true,1,,,,,LA BOBLIERE NUMERO 6,86400,LIZANT,,,86136,,,,,,,,,,,,,,,,,,,2013-09-18,A,,,,,68.20B,NAFRev2,N,,,0,,,,,,
438865438,00016,43886543800016,O,2001-06-11,NN,,,2008-01-04T20:21:33,true,3,,,,,LA GRANDE BARBATTE,86400,LIZANT,,,86136,,,,,,,,,,,,,,,,,,,2008-01-01,A,,,,,68.20A,NAFRev2,N,0.250322,46.083206,0.95,street,La Grande Barbatte 86400 Lizant,86136_B106,G,LA GRANDE BARBATTE,
440039899,00016,44003989900016,O,2001-12-03,NN,,,2017-02-22T03:12:56,true,3,,,,,BOISSEGUIN,86400,LIZANT,,,86136,,,,,,,,,,,,,,,,,,,2008-01-01,A,,,,,41.10D,NAFRev2,N,0.261387,46.088443,0.94,street,Boisseguin 86400 Lizant,86136_26bpxw,G,BOISSEGUIN,
440236115,00018,44023611500018,O,2002-01-01,NN,,,2010-04-18T09:19:16,true,3,,,,,LE MOULIN DE BOISSEGUIN,86400,LIZANT,,,86136,,,,,,,,,,,,,,,,,,,2008-01-01,A,,,,,01.11Z,NAFRev2,O,0.259731,46.084123,0.93,street,Le Moulin de Boisseguin 86400 Lizant,86136_B132,G,LE MOULIN DE BOISSEGUIN,
440630721,00015,44063072100015,O,2001-12-21,NN,,,2021-04-02T03:39:20,true,4,,,,LD,CHEZ MOQUERAT,86400,LIZANT,,,86136,,,,,,,,,,,,,,,,,,,2021-04-01,F,,,,,68.20B,NAFRev2,N,0.277872,46.079636,0.94,street,Chez Moquerat 86400 Lizant,86136_B069,G,CHEZ MOQUERAT,
440642080,00012,44064208000012,O,2002-01-08,NN,,,2015-01-07T05:44:46,true,5,,,,,CHEZ BOULARD,86400,LIZANT,,,86136,,,,,,,,,,,,,,,,,,,2014-12-30,F,,,,,81.29B,NAFRev2,N,0.292908,46.082764,0.94,street,Chez Boulard 86400 Lizant,86136_B064,G,CHEZ BOULARD,
442701587,00010,44270158700010,O,2002-08-01,NN,,,2008-01-04T21:47:57,true,3,,,,,CHEZ POTON,86400,LIZANT,,,86136,,,,,,,,,,,,,,,,,,,2008-01-01,A,,,,,81.30Z,NAFRev2,N,0.274358,46.078931,0.94,street,Chez Poton 86400 Lizant,86136_B070,G,CHEZ POTON,
448872853,00016,44887285300016,O,2003-07-01,NN,,,2006-11-25T18:32:30,true,3,,,,,LE BOURG,86400,LIZANT,,,86136,,,,,,,,,,,,,,,,,,,2004-11-30,F,,,,,55.3B,NAFRev1,N,0.259731,46.084123,0.5,street,Le Moulin de Boisseguin 86400 Lizant,86136_B132,G,LE MOULIN DE BOISSEGUIN,
449934249,00011,44993424900011,O,2003-10-01,NN,,,2008-11-08T02:29:06,true,3,,,,,LA FOUCHARDIERE,86400,LIZANT,,,86136,,,,,,,,,,,,,,,,,,,2004-01-16,F,,,,,45.2V,NAFRev1,N,0.299485,46.084395,0.94,street,La Fouchardière 86400 Lizant,86136_9o02yu,G,LA FOUCHARDIERE,
451297535,00010,45129753500010,O,2004-01-05,NN,,,2016-07-19T10:19:41,true,5,,,,,LA GRANDE BARBATTE,86400,LIZANT,,,86136,,,,,,,,,,,,,,,,,,,2008-08-31,A,,,,,68.20B,NAFRev2,N,0.250322,46.083206,0.95,street,La Grande Barbatte 86400 Lizant,86136_B106,G,LA GRANDE BARBATTE,
451297535,00028,45129753500028,O,2014-08-01,,,4399CZ,2016-07-19T10:14:01,false,2,,,,,LA GRANDE BARBATTE,86400,LIZANT,,,86136,,,,,,,,,,,,,,,,,,,2016-04-30,F,,,,,43.99C,NAFRev2,N,0.250322,46.083206,0.95,street,La Grande Barbatte 86400 Lizant,86136_B106,G,LA GRANDE BARBATTE,
451441950,00032,45144195000032,O,2012-07-30,,,,2018-01-23T08:34:08,false,2,,,,,LA GRANDE BARBATTE,86400,LIZANT,,,86136,,,,,,,,,,,,,,,,,,,2018-01-01,F,,,,,68.31Z,NAFRev2,N,0.250322,46.083206,0.95,street,La Grande Barbatte 86400 Lizant,86136_B106,G,LA GRANDE BARBATTE,