siren,nic,siret,statutDiffusionEtablissement,dateCreationEtablissement,trancheEffectifsEtablissement,anneeEffectifsEtablissement,activitePrincipaleRegistreMetiersEtablissement,dateDernierTraitementEtablissement,etablissementSiege,nombrePeriodesEtablissement,complementAdresseEtablissement,numeroVoieEtablissement,indiceRepetitionEtablissement,typeVoieEtablissement,libelleVoieEtablissement,codePostalEtablissement,libelleCommuneEtablissement,libelleCommuneEtrangerEtablissement,distributionSpecialeEtablissement,codeCommuneEtablissement,codeCedexEtablissement,libelleCedexEtablissement,codePaysEtrangerEtablissement,libellePaysEtrangerEtablissement,complementAdresse2Etablissement,numeroVoie2Etablissement,indiceRepetition2Etablissement,typeVoie2Etablissement,libelleVoie2Etablissement,codePostal2Etablissement,libelleCommune2Etablissement,libelleCommuneEtranger2Etablissement,distributionSpeciale2Etablissement,codeCommune2Etablissement,codeCedex2Etablissement,libelleCedex2Etablissement,codePaysEtranger2Etablissement,libellePaysEtranger2Etablissement,dateDebut,etatAdministratifEtablissement,enseigne1Etablissement,enseigne2Etablissement,enseigne3Etablissement,denominationUsuelleEtablissement,activitePrincipaleEtablissement,nomenclatureActivitePrincipaleEtablissement,caractereEmployeurEtablissement,longitude,latitude,geo_score,geo_type,geo_adresse,geo_id,geo_ligne,geo_l4,geo_l5
219722113,00012,21972211300012,O,1983-12-19,21,2019,,2021-10-27T08:11:31,true,4,,,,,BOURG,97218,GRAND'RIVIERE,,,97211,,,,,,,,,,,,,,,,,,,2008-01-01,A,MAIRIE,,,,84.11Z,NAFRev2,O,-61.178112,14.87359,0.92,street,Rue Vieux Bourg 97218 Grand'Rivière,97211_0051,G,RUE VIEUX BOURG,
219722113,00020,21972211300020,O,1984-09-07,NN,,,2008-01-04T18:46:02,false,3,BOURG,,,AV,GENERAL DE GAULLE,97218,GRAND'RIVIERE,,,97211,,,,,,,,,,,,,,,,,,,2008-01-01,A,ECOLE MATERNELLE PUBLIQUE,,,,85.10Z,NAFRev2,N,-61.17882,14.872658,0.81,street,Avenue General Charles de Gaulle 97218 Grand'Rivière,97211_0025,G,AVENUE GENERAL CHARLES DE GAULLE,
219722113,00038,21972211300038,O,1984-09-07,03,2019,,2021-10-27T08:11:31,false,3,,,,QUA,PERRIOLAT,97218,GRAND'RIVIERE,,,97211,,,,,,,,,,,,,,,,,,,2008-01-01,A,ECOLE ELEMENTAIRE PUBLIQUE,,,,85.20Z,NAFRev2,N,,,0,,,,,,
219722113,00046,21972211300046,O,1997-01-01,NN,,,2008-01-04T18:46:02,false,3,MAIRIE,,,,BOURG,97218,GRAND'RIVIERE,,,97211,,,,,,,,,,,,,,,,,,,2008-01-01,A,SERVICE DES EAUX DE GRAND'RIVIERE,,,,36.00Z,NAFRev2,N,-61.178112,14.87359,0.92,street,Rue Vieux Bourg 97218 Grand'Rivière,97211_0051,G,RUE VIEUX BOURG,
229720016,00299,22972001600299,O,1983-09-14,NN,,,2018-01-30T16:43:31,false,4,,,,,BOURG,97218,GRAND'RIVIERE,,,97211,,,,,,,,,,,,,,,,,,,2016-01-01,F,DISPENSAIRE DE GRAND-RIVIERE,,,,86.21Z,NAFRev2,N,-61.178112,14.87359,0.92,street,Rue Vieux Bourg 97218 Grand'Rivière,97211_0051,G,RUE VIEUX BOURG,
229720016,00653,22972001600653,O,1983-09-14,NN,,,2018-01-30T16:43:31,false,4,,,,,BOURG,97218,GRAND'RIVIERE,,,97211,,,,,,,,,,,,,,,,,,,2016-01-01,F,CPMI DE GRAND-RIVIERE,,,,86.21Z,NAFRev2,N,-61.178112,14.87359,0.92,street,Rue Vieux Bourg 97218 Grand'Rivière,97211_0051,G,RUE VIEUX BOURG,
269720116,00012,26972011600012,O,1983-09-14,NN,,,2010-06-26T03:18:06,true,3,MAIRIE,,,,BOURG,97218,GRAND'RIVIERE,,,97211,,,,,,,,,,,,,,,,,,,2008-01-01,A,CCAS,,,,88.99B,NAFRev2,N,-61.178112,14.87359,0.92,street,Rue Vieux Bourg 97218 Grand'Rivière,97211_0051,G,RUE VIEUX BOURG,
269720454,00017,26972045400017,O,1983-09-14,NN,,,2010-06-26T03:18:06,true,3,MAIRIE,,,,BOURG,97218,GRAND'RIVIERE,,,97211,,,,,,,,,,,,,,,,,,,2008-01-01,A,CDE,,,,88.99B,NAFRev2,N,-61.178112,14.87359,0.92,street,Rue Vieux Bourg 97218 Grand'Rivière,97211_0051,G,RUE VIEUX BOURG,
299720243,00011,29972024300011,O,2003-07-01,,,,2008-01-04T19:08:22,true,3,,,,,HABITATION BEAUSEJOUR,97218,GRAND'RIVIERE,,,97211,,,,,,,,,,,,,,,,,,,2008-01-01,A,,,,,42.99Z,NAFRev2,N,-61.172739,14.874109,0.54,street,Beauséjour 97218 Grand'Rivière,97211_0wakvb,G,BEAUSEJOUR,
303140743,00061,30314074300061,O,1993-12-01,NN,,,2017-10-01T04:38:24,true,4,,,,RUE,LUCY DE FOSSARIEUX,97218,GRAND'RIVIERE,,,97211,,,,,,,,,,,,,,,,,,,2015-07-28,F,,,,,68.20B,NAFRev2,N,-61.179903,14.873806,0.75,street,Rue Lucie de Fossarieu 97218 Grand'Rivière,97211_0030,G,RUE LUCIE DE FOSSARIEU,
303157598,00028,30315759800028,O,1900-01-01,,,,2006-10-26T23:59:17,true,4,,,,RUE,DE LA LAVE,97218,GRAND'RIVIERE,,,97211,,,,,,,,,,,,,,,,,,,2004-03-20,F,,,,,55.1A,NAFRev1,N,-61.179166,14.87403,0.95,street,Rue de la Lave 97218 Grand'Rivière,97211_0028,G,RUE DE LA LAVE,
303160550,00057,30316055000057,O,1900-01-01,,,,2007-05-14T16:37:24,false,4,,,,,HABITATION EYMA,97218,GRAND'RIVIERE,,,97211,,,,,,,,,,,,,,,,,,,2007-05-14,F,HABITATION EYMA,,,,01.1F,NAFRev1,N,,,0,,,,,,
303166342,00012,30316634200012,O,,,,,,true,1,,,,,BOURG,97218,GRAND'RIVIERE,,,97211,,,,,,,,,,,,,,,,,,,,F,,,,,62.11,NAP,N,-61.178112,14.87359,0.92,street,Rue Vieux Bourg 97218 Grand'Rivière,97211_0051,G,RUE VIEUX BOURG,
303166359,00016,30316635900016,O,1900-01-01,NN,,,2016-05-04T09:04:02,true,4,GRAND-RIVIERE,25,,RUE,DE LA POSTE,97218,GRAND'RIVIERE,,,97211,,,,,,,,,,,,,,,,,,,2016-05-31,F,AU FRUIT A PAIN,,,,56.10A,NAFRev2,N,-61.179528,14.874229,0.55,street,Rue de la Mutualité 97218 Grand'Rivière,97211_0035,G,RUE DE LA MUTUALITE,
303166367,00019,30316636700019,O,1900-01-01,,,,,true,3,,,,,BOURG,97218,GRAND'RIVIERE,,,97211,,,,,,,,,,,,,,,,,,,1991-12-25,F,,,,,62.11,NAP,N,-61.178112,14.87359,0.92,street,Rue Vieux Bourg 97218 Grand'Rivière,97211_0051,G,RUE VIEUX BOURG,
303166375,00012,30316637500012,O,,,,,,true,1,,,,LD,BELLEVUE,97218,GRAND'RIVIERE,,,97211,,,,,,,,,,,,,,,,,,,1987-01-01,F,,,,,62.44,NAP,N,-61.180379,14.873212,0.92,street,Rue de Bellevue 97218 Grand'Rivière,97211_0005,G,RUE DE BELLEVUE,
303166383,00016,30316638300016,O,1973-01-01,NN,,,,true,1,,,,,BOURG,97218,GRAND'RIVIERE,,,97211,,,,,,,,,,,,,,,,,,,2002-12-31,F,,,,,52.1B,NAF1993,N,-61.178112,14.87359,0.92,street,Rue Vieux Bourg 97218 Grand'Rivière,97211_0051,G,RUE VIEUX BOURG,
303166391,00019,30316639100019,O,1973-01-01,NN,,,2011-03-03T11:55:20,true,4,,,,,LA LAVE BOURG,97218,GRAND'RIVIERE,,,97211,,,,,,,,,,,,,,,,,,,2009-12-25,F,,,,,49.39A,NAFRev2,N,-61.179166,14.87403,0.51,street,Rue de la Lave 97218 Grand'Rivière,97211_0028,G,RUE DE LA LAVE,
303166409,00019,30316640900019,O,,NN,,,,true,1,,,,RUE,DE FOSSARIEUX,97218,GRAND'RIVIERE,,,97211,,,,,,,,,,,,,,,,,,,,F,,,,,67.01,NAP,N,-61.179903,14.873806,0.83,street,Rue Lucie de Fossarieu 97218 Grand'Rivière,97211_0030,G,RUE LUCIE DE FOSSARIEU,
303166417,00012,30316641700012,O,,,,,,true,1,,,,,BOURG,97218,GRAND'RIVIERE,,,97211,,,,,,,,,,,,,,,,,,,1989-12-30,F,,,,,64.11,NAP,N,-61.178112,14.87359,0.92,street,Rue Vieux Bourg 97218 Grand'Rivière,97211_0051,G,RUE VIEUX BOURG,
303166425,00015,30316642500015,O,,,,,,true,1,,,,QUAI,DANS LA LAVE,97218,GRAND'RIVIERE,,,97211,,,,,,,,,,,,,,,,,,,1984-12-25,F,,,,,62.44,NAP,N,,,0,,,,,,
303166433,00019,30316643300019,O,,,,,,true,1,,,,QUAI,BELLEVUE,97218,GRAND'RIVIERE,,,97211,,,,,,,,,,,,,,,,,,,1984-12-25,F,,,,,64.49,NAP,N,-61.180379,14.873212,0.61,street,Rue de Bellevue 97218 Grand'Rivière,97211_0005,G,RUE DE BELLEVUE,
303166466,00019,30316646600019,O,1973-01-01,NN,,,2014-06-18T14:46:01,true,3,GRAND-RIVIERE,25,,RUE,BOURG,97218,GRAND'RIVIERE,,,97211,,,,,,,,,,,,,,,,,,,2008-01-01,A,,,,,68.20B,NAFRev2,N,-61.178112,14.87359,0.64,street,Rue Vieux Bourg 97218 Grand'Rivière,97211_0051,G,RUE VIEUX BOURG,
303166474,00013,30316647400013,O,1973-01-01,NN,,,2021-10-21T11:31:57,true,4,BOURG,,,BD,SAINTE CATHERINE,97218,GRAND'RIVIERE,,,97211,,,,,,,,,,,,,,,,,,,2021-09-01,A,,,,,56.10A,NAFRev2,O,-61.178978,14.874084,0.85,street,Boulevard Sainte Catherine 97218 Grand'Rivière,97211_0045,G,BOULEVARD SAINTE CATHERINE,
303166482,00016,30316648200016,O,,,,,,true,1,,,,,BOURG,97218,GRAND'RIVIERE,,,97211,,,,,,,,,,,,,,,,,,,1988-09-06,F,,,,,62.11,NAP,N,-61.178112,14.87359,0.92,street,Rue Vieux Bourg 97218 Grand'Rivière,97211_0051,G,RUE VIEUX BOURG,
303166490,00019,30316649000019,O,1973-01-01,NN,,,2018-01-26T08:38:44,true,4,,,,,,97218,GRAND'RIVIERE,,,97211,,,,,,,,,,,,,,,,,,,2017-09-30,F,,,,,49.39A,NAFRev2,N,,,0,,,,,,
303166508,00018,30316650800018,O,,,,,,true,1,,,,QUAI,LAVE,97218,GRAND'RIVIERE,,,97211,,,,,,,,,,,,,,,,,,,1985-12-25,F,,,,,62.43,NAP,N,-61.179166,14.87403,0.47,street,Rue de la Lave 97218 Grand'Rivière,97211_0028,G,RUE DE LA LAVE,
303166516,00037,30316651600037,O,1991-04-10,NN,,,2008-01-04T19:23:38,true,3,LA LAVE,,,LD,SAINTE CATHERINE,97218,GRAND'RIVIERE,,,97211,,,,,,,,,,,,,,,,,,,2008-01-01,A,,,,,47.11B,NAFRev2,N,-61.178978,14.874084,0.93,street,Boulevard Sainte Catherine 97218 Grand'Rivière,97211_0045,G,BOULEVARD SAINTE CATHERINE,
303166524,00015,30316652400015,O,,,,,,true,1,,,,,BOURG,97218,GRAND'RIVIERE,,,97211,,,,,,,,,,,,,,,,,,,1984-12-25,F,,,,,62.11,NAP,N,-61.178112,14.87359,0.92,street,Rue Vieux Bourg 97218 Grand'Rivière,97211_0051,G,RUE VIEUX BOURG,
303166532,00018,30316653200018,O,1973-01-01,NN,,,,true,4,,,,,,97218,GRAND'RIVIERE,,,97211,,,,,,,,,,,,,,,,,,,2003-07-28,F,,,,,60.2B,NAFRev1,N,,,0,,,,,,
303166540,00011,30316654000011,O,,,,,,true,1,,,,RUE,DE FOSSARIEUX,97218,GRAND'RIVIERE,,,97211,,,,,,,,,,,,,,,,,,,1984-12-25,F,,,,,38.40,NAP,N,-61.179903,14.873806,0.83,street,Rue Lucie de Fossarieu 97218 Grand'Rivière,97211_0030,G,RUE LUCIE DE FOSSARIEU,
303166565,00018,30316656500018,O,1973-01-01,NN,,,2008-06-05T20:23:33,true,1,,,,,BOURG,97218,GRAND'RIVIERE,,,97211,,,,,,,,,,,,,,,,,,,1999-01-13,F,,,,,52.6D,NAF1993,N,-61.178112,14.87359,0.92,street,Rue Vieux Bourg 97218 Grand'Rivière,97211_0051,G,RUE VIEUX BOURG,
303166573,00012,30316657300012,O,1900-01-01,,,,,true,3,,,,,BOURG,97218,GRAND'RIVIERE,,,97211,,,,,,,,,,,,,,,,,,,1991-12-25,F,,,,,64.11,NAP,N,-61.178112,14.87359,0.92,street,Rue Vieux Bourg 97218 Grand'Rivière,97211_0051,G,RUE VIEUX BOURG,
303166581,00015,30316658100015,O,,NN,,,,true,1,,,,,BOURG,97218,GRAND'RIVIERE,,,97211,,,,,,,,,,,,,,,,,,,1993-08-14,F,,,,,52.6D,NAF1993,N,-61.178112,14.87359,0.92,street,Rue Vieux Bourg 97218 Grand'Rivière,97211_0051,G,RUE VIEUX BOURG,
303166599,00017,30316659900017,O,,,,,,true,1,,,,,BOURG,97218,GRAND'RIVIERE,,,97211,,,,,,,,,,,,,,,,,,,,F,,,,,62.44,NAP,N,-61.178112,14.87359,0.92,street,Rue Vieux Bourg 97218 Grand'Rivière,97211_0051,G,RUE VIEUX BOURG,
303166607,00018,30316660700018,O,,,,,,true,1,,,,,BOURG,97218,GRAND'RIVIERE,,,97211,,,,,,,,,,,,,,,,,,,,F,,,,,62.44,NAP,N,-61.178112,14.87359,0.92,street,Rue Vieux Bourg 97218 Grand'Rivière,97211_0051,G,RUE VIEUX BOURG,
303166623,00015,30316662300015,O,,NN,,,,true,1,,,,,,97218,GRAND'RIVIERE,,,97211,,,,,,,,,,,,,,,,,,,,F,,,,,69.22,NAP,N,,,0,,,,,,
306572223,00015,30657222300015,O,1900-01-01,NN,,,,true,4,,,,,BOURG,97218,GRAND'RIVIERE,,,97211,,,,,,,,,,,,,,,,,,,1991-12-25,F,,,,,62.41,NAP,N,-61.178112,14.87359,0.92,street,Rue Vieux Bourg 97218 Grand'Rivière,97211_0051,G,RUE VIEUX BOURG,
310066790,00026,31006679000026,O,,NN,,,,true,1,,,,LD,PERRIOLAT,97218,GRAND'RIVIERE,,,97211,,,,,,,,,,,,,,,,,,,1987-02-28,F,,,,,62.44,NAP,N,5.0510138,45.0697323,0.88,poi.parking,Place Fernand Perriolat (Parking) Mours-Saint-Eusèbe,https://osm.org/way/177307097,G,,
313686487,00015,31368648700015,O,1978-01-01,NN,,,,true,1,,,,RUE,LUCY DE FOSSARIEU,97218,GRAND'RIVIERE,,,97211,,,,,,,,,,,,,,,,,,,1998-11-30,F,,,,,60.2L,NAF1993,N,-61.179903,14.873806,0.82,street,Rue Lucie de Fossarieu 97218 Grand'Rivière,97211_0030,G,RUE LUCIE DE FOSSARIEU,
313810640,00018,31381064000018,O,1978-01-01,NN,,,2015-06-09T08:41:29,true,4,,29,,AV,GENERAL DE GAULLE,97218,GRAND'RIVIERE,,,97211,,,,,,,,,,,,,,,,,,,2014-01-27,F,,,,,47.30Z,NAFRev2,N,-61.177574,14.87234,0.83,housenumber,29 Avenue General Charles de Gaulle 97218 Grand'Rivière,97211_0025_00029,G,29 AVENUE GAL CHARLES DE GAULLE,
313810673,00019,31381067300019,O,,NN,,,,true,1,,,,,,97218,GRAND'RIVIERE,,,97211,,,,,,,,,,,,,,,,,,,,F,,,,,69.22,NAP,N,,,0,,,,,,
313810707,00015,31381070700015,O,,,,,,true,1,,,,,,97218,GRAND'RIVIERE,,,97211,,,,,,,,,,,,,,,,,,,1985-12-25,F,,,,,69.12,NAP,N,,,0,,,,,,
313810988,00011,31381098800011,O,,,,,,true,1,,,,,,97218,GRAND'RIVIERE,,,97211,,,,,,,,,,,,,,,,,,,1984-12-25,F,,,,,55.60,NAP,N,,,0,,,,,,
313811002,00010,31381100200010,O,1978-01-01,NN,,,2010-08-10T16:21:22,true,4,,,,,QUARTIER BELLEVUE,97218,GRAND'RIVIERE,,,97211,,,,,,,,,,,,,,,,,,,2010-07-03,F,,,,,47.23Z,NAFRev2,N,-61.180379,14.873212,0.52,street,Rue de Bellevue 97218 Grand'Rivière,97211_0005,G,RUE DE BELLEVUE,
314080573,00012,31408057300012,O,1978-01-01,,,,2008-01-04T20:26:48,true,3,,,,,BOURG,97218,GRAND'RIVIERE,,,97211,,,,,,,,,,,,,,,,,,,2008-01-01,A,,,,,94.91Z,NAFRev2,N,-61.178112,14.87359,0.92,street,Rue Vieux Bourg 97218 Grand'Rivière,97211_0051,G,RUE VIEUX BOURG,
314167107,00015,31416710700015,O,,NN,,,2007-01-18T09:13:39,true,1,,,,LD,FOND MOULIN,97218,GRAND'RIVIERE,,,97211,,,,,,,,,,,,,,,,,,,,F,,,,,01.10,NAP,N,-61.180986,14.873313,0.33,locality,Lotissement les Koulirous 97218 Grand'Rivière,97211_A010,G,LOTISSEMENT LES KOULIROUS,
314809724,00011,31480972400011,O,,NN,,,,true,1,,,,,BOURG,97218,GRAND'RIVIERE,,,97211,,,,,,,,,,,,,,,,,,,1989-12-11,F,,,,,62.46,NAP,N,-61.178112,14.87359,0.92,street,Rue Vieux Bourg 97218 Grand'Rivière,97211_0051,G,RUE VIEUX BOURG,
316218924,00017,31621892400017,O,1979-01-01,NN,,,2009-07-20T21:59:33,true,4,,,,,ENTREE DU BOURG,97218,GRAND'RIVIERE,,,97211,,,,,,,,,,,,,,,,,,,2004-01-01,F,,,,,55.3A,NAFRev1,O,-61.17789,14.873583,0.37,street,Vieux Bourg 97218 Grand'Rivière,97211_B015,G,VIEUX BOURG,
318903929,00012,31890392900012,O,,NN,,,,true,1,,,,RUE,LUCIE DE FOSSARIEU,97218,GRAND'RIVIERE,,,97211,,,,,,,,,,,,,,,,,,,1985-01-15,F,,,,,55.3A,NAF1993,N,-61.179903,14.873806,0.95,street,Rue Lucie de Fossarieu 97218 Grand'Rivière,97211_0030,G,RUE LUCIE DE FOSSARIEU,
321559585,00013,32155958500013,O,1900-01-01,NN,,,2011-04-28T00:19:09,false,4,,,,LD,BOURG,97218,GRAND'RIVIERE,,,97211,,,,,,,,,,,,,,,,,,,1995-04-01,F,,,,,52.1B,NAF1993,O,-61.178112,14.87359,0.92,street,Rue Vieux Bourg 97218 Grand'Rivière,97211_0051,G,RUE VIEUX BOURG,
322646480,00010,32264648000010,O,,,,,,true,1,,,,LD,BEAUSEJOUR,97218,GRAND'RIVIERE,,,97211,,,,,,,,,,,,,,,,,,,1984-12-25,F,,,,,62.11,NAP,N,-61.172739,14.874109,0.94,street,Beauséjour 97218 Grand'Rivière,97211_0wakvb,G,BEAUSEJOUR,
323095372,00013,32309537200013,O,1981-12-01,NN,,,2008-04-26T09:30:03,true,5,,9,,,BOURG,97218,GRAND'RIVIERE,,,97211,,,,,,,,,,,,,,,,,,,2006-12-01,F,,,,,55.4A,NAFRev1,O,-61.178112,14.87359,0.92,street,Rue Vieux Bourg 97218 Grand'Rivière,97211_0051,G,RUE VIEUX BOURG,
323250795,00040,32325079500040,O,2001-04-09,NN,,,2008-01-04T18:44:01,false,3,TROU NAVET,,,,TROU NAVET,97218,GRAND'RIVIERE,,,97211,,,,,,,,,,,,,,,,,,,2008-01-01,A,,,,,01.42Z,NAFRev2,N,,,0,,,,,,
323414250,00031,32341425000031,O,2007-04-16,NN,,,2015-05-14T05:36:51,false,6,,,,,HABITATION BEAUSEJOUR,97218,GRAND'RIVIERE,,,97211,,,,,,,,,,,,,,,,,,,2013-08-30,F,LE CARBET CARAIBE,,,,56.10A,NAFRev2,O,-61.172739,14.874109,0.54,street,Beauséjour 97218 Grand'Rivière,97211_0wakvb,G,BEAUSEJOUR,
323633669,00011,32363366900011,O,,NN,,,2008-10-13T20:05:54,true,1,,,,,BOURG,97218,GRAND'RIVIERE,,,97211,,,,,,,,,,,,,,,,,,,,F,,,,,62.43,NAP,N,-61.178112,14.87359,0.92,street,Rue Vieux Bourg 97218 Grand'Rivière,97211_0051,G,RUE VIEUX BOURG,
323633677,00014,32363367700014,O,1981-07-01,NN,,,2009-12-11T15:30:11,true,4,,,,BD,STE CATHERINE,97218,GRAND'RIVIERE,,,97211,,,,,,,,,,,,,,,,,,,2009-12-25,F,,,,,49.39A,NAFRev2,N,-61.178978,14.874084,0.73,street,Boulevard Sainte Catherine 97218 Grand'Rivière,97211_0045,G,BOULEVARD SAINTE CATHERINE,
323749168,00015,32374916800015,O,1981-12-29,NN,,,2007-05-29T16:25:45,true,3,,,,,BOURG,97218,GRAND'RIVIERE,,,97211,,,,,,,,,,,,,,,,,,,2005-06-30,F,,,,,52.1B,NAFRev1,N,-61.178112,14.87359,0.92,street,Rue Vieux Bourg 97218 Grand'Rivière,97211_0051,G,RUE VIEUX BOURG,
327819090,00017,32781909000017,O,1983-07-01,NN,,,2008-11-07T00:45:31,true,4,,,,RUE,DE LUCY DE FOSSARIEU,97218,GRAND'RIVIERE,,,97211,,,,,,,,,,,,,,,,,,,2005-08-31,F,,,,,15.8C,NAFRev1,O,-61.179903,14.873806,0.82,street,Rue Lucie de Fossarieu 97218 Grand'Rivière,97211_0030,G,RUE LUCIE DE FOSSARIEU,
329239677,00019,32923967700019,O,,NN,,,,true,1,,,,RUE,DE LUCY DE FOSSARIEU,97218,GRAND'RIVIERE,,,97211,,,,,,,,,,,,,,,,,,,1988-08-31,F,,,,,62.41,NAP,N,-61.179903,14.873806,0.82,street,Rue Lucie de Fossarieu 97218 Grand'Rivière,97211_0030,G,RUE LUCIE DE FOSSARIEU,
329762470,00014,32976247000014,O,,,,,,true,1,,,,LD,BOURG,97218,GRAND'RIVIERE,,,97211,,,,,,,,,,,,,,,,,,,1985-12-25,F,,,,,64.11,NAP,N,-61.178112,14.87359,0.92,street,Rue Vieux Bourg 97218 Grand'Rivière,97211_0051,G,RUE VIEUX BOURG,
329947238,00013,32994723800013,O,,NN,,,,true,1,,,,,BOURG GRAND RIVIERE,97218,GRAND'RIVIERE,,,97211,,,,,,,,,,,,,,,,,,,,F,,,,,62.44,NAP,N,-61.178112,14.87359,0.93,street,Rue Vieux Bourg 97218 Grand'Rivière,97211_0051,G,RUE VIEUX BOURG,
331001958,00015,33100195800015,O,1984-09-04,NN,,,2008-01-04T20:06:48,true,3,,,,RUE,DE LUCY DE FOSSARIEU,97218,GRAND'RIVIERE,,,97211,,,,,,,,,,,,,,,,,,,2008-01-01,A,,,,,47.81Z,NAFRev2,N,-61.179903,14.873806,0.82,street,Rue Lucie de Fossarieu 97218 Grand'Rivière,97211_0030,G,RUE LUCIE DE FOSSARIEU,
332688969,00010,33268896900010,O,1985-05-19,NN,,,,false,4,,,,BD,SAINTE CATHERINE,97218,GRAND'RIVIERE,,,97211,,,,,,,,,,,,,,,,,,,1999-12-31,F,BAZAR DU COIN,,,,52.1J,NAF1993,O,-61.178978,14.874084,0.85,street,Boulevard Sainte Catherine 97218 Grand'Rivière,97211_0045,G,BOULEVARD SAINTE CATHERINE,
332688969,00028,33268896900028,O,1998-12-01,NN,,,2013-05-18T03:35:45,false,6,,,,RUE,GENERAL DE GAULLE,97218,GRAND'RIVIERE,,,97211,,,,,,,,,,,,,,,,,,,2011-07-31,F,,,,,47.81Z,NAFRev2,O,-61.17882,14.872658,0.81,street,Avenue General Charles de Gaulle 97218 Grand'Rivière,97211_0025,G,AVENUE GENERAL CHARLES DE GAULLE,
332688969,00044,33268896900044,O,2011-07-31,,,,2013-04-30T00:11:33,false,1,,19,,RUE,DE LA MUTUALITE,97218,GRAND'RIVIERE,,,97211,,,,,,,,,,,,,,,,,,,2011-07-31,F,,,,,47.11C,NAFRev2,O,-61.179877,14.8741,0.95,housenumber,19 Rue de la Mutualité 97218 Grand'Rivière,97211_0035_00019,G,19 RUE DE LA MUTUALITE,
332688969,00051,33268896900051,O,2010-07-01,02,2019,,2021-10-27T08:29:22,false,3,QUARTIER PERRIOLAT,4,,RUE,A. TAVERNY,97218,GRAND'RIVIERE,,,97211,,,,,,,,,,,,,,,,,,,2021-10-01,A,,,,,56.10A,NAFRev2,O,-61.176626,14.872366,0.82,housenumber,4 Rue Anatole Taverny 97218 Grand'Rivière,97211_0007_00004,G,4 RUE ANATOLE TAVERNY,
333782050,00012,33378205000012,O,,,,,,true,1,,,,,BOURG,97218,GRAND'RIVIERE,,,97211,,,,,,,,,,,,,,,,,,,1994-12-31,F,,,,,60.2B,NAF1993,N,-61.178112,14.87359,0.92,street,Rue Vieux Bourg 97218 Grand'Rivière,97211_0051,G,RUE VIEUX BOURG,
334095932,00045,33409593200045,O,2000-04-10,NN,,,,true,1,,,,AV,DU GENERAL DE GAULLE,97218,GRAND'RIVIERE,,,97211,,,,,,,,,,,,,,,,,,,2002-07-01,F,,,,,52.2P,NAF1993,N,-61.17882,14.872658,0.72,street,Avenue General Charles de Gaulle 97218 Grand'Rivière,97211_0025,G,AVENUE GENERAL CHARLES DE GAULLE,
334280112,00015,33428011200015,O,1985-11-01,NN,,,,true,3,,,,,,97218,GRAND'RIVIERE,,,97211,,,,,,,,,,,,,,,,,,,1992-01-09,F,,,,,52.2P,NAF1993,N,,,0,,,,,,
334816873,00015,33481687300015,O,1985-06-03,NN,,,2013-08-04T04:19:54,true,6,,3,,RUE,DE LUCY DE FOSSARIEU,97218,GRAND'RIVIERE,,,97211,,,,,,,,,,,,,,,,,,,2013-01-01,F,,,,,56.10A,NAFRev2,N,-61.179903,14.873806,0.83,housenumber,3 Rue Lucie de Fossarieu 97218 Grand'Rivière,97211_0030_00003,G,3 RUE LUCIE DE FOSSARIEU,
335356622,00019,33535662200019,O,1986-01-31,,,,2021-07-07T04:10:55,true,4,,,,LD,HABITATION BEAUSEJOUR,97218,GRAND'RIVIERE,,,97211,,,,,,,,,,,,,,,,,,,2008-01-01,A,,,,,68.20B,NAFRev2,N,-61.172739,14.874109,0.54,street,Beauséjour 97218 Grand'Rivière,97211_0wakvb,G,BEAUSEJOUR,
338013600,00014,33801360000014,O,1986-07-15,NN,,,,true,3,,,,RUE,DE LA MUTUALITE,97218,GRAND'RIVIERE,,,97211,,,,,,,,,,,,,,,,,,,2003-12-31,F,,,,,52.1B,NAFRev1,N,-61.179528,14.874229,0.95,street,Rue de la Mutualité 97218 Grand'Rivière,97211_0035,G,RUE DE LA MUTUALITE,
338439920,00012,33843992000012,O,1986-07-07,NN,,,2008-11-07T00:57:36,false,4,GRAND RIVIERE,,,,BOURG,97218,GRAND'RIVIERE,,,97211,,,,,,,,,,,,,,,,,,,1998-12-31,F,,,,,60.2B,NAF1993,N,-61.178112,14.87359,0.92,street,Rue Vieux Bourg 97218 Grand'Rivière,97211_0051,G,RUE VIEUX BOURG,
338578560,00017,33857856000017,O,1900-01-01,NN,,,2013-02-14T15:11:21,false,3,,,,LD,BELLEVUE,97218,GRAND'RIVIERE,,,97211,,,,,,,,,,,,,,,,,,,1987-12-25,F,,,,,64.24,NAP,N,-61.180379,14.873212,0.92,street,Rue de Bellevue 97218 Grand'Rivière,97211_0005,G,RUE DE BELLEVUE,
341196350,00019,34119635000019,O,1987-05-30,NN,,,,true,4,,,,,LA LAVE,97218,GRAND'RIVIERE,,,97211,,,,,,,,,,,,,,,,,,,1994-12-22,F,,,,,52.6D,NAF1993,N,-61.179166,14.87403,0.92,street,Rue de la Lave 97218 Grand'Rivière,97211_0028,G,RUE DE LA LAVE,
349163881,00064,34916388100064,O,2005-10-01,,,,2014-07-08T00:52:35,true,2,BEAUSEJOUR,,,,DESROSES,97218,GRAND'RIVIERE,,,97211,,,,,,,,,,,,,,,,,,,2008-01-01,A,,,,,01.22Z,NAFRev2,N,-61.179489,14.874225,0.42,street,Rue des Nuées Ardentes 97218 Grand'Rivière,97211_0041,G,RUE DES NUEES ARDENTES,
349915652,00011,34991565200011,O,1988-09-01,NN,,,2008-11-08T00:25:10,false,4,,,,,BOURG,97218,GRAND'RIVIERE,,,97211,,,,,,,,,,,,,,,,,,,1999-04-01,F,,,,,60.2B,NAF1993,N,-61.178112,14.87359,0.92,street,Rue Vieux Bourg 97218 Grand'Rivière,97211_0051,G,RUE VIEUX BOURG,
356000000,51519,35600000051519,O,2012-01-01,,,,2014-05-03T12:53:00,false,2,,13,,RUE,DES P ET T,97218,GRAND'RIVIERE,,,97211,,,,,,,,,,,,,,,,,,,2014-04-29,A,LA POSTE,,,,53.10Z,NAFRev2,N,-61.178728,14.873037,0.95,housenumber,13 Rue des P et T 97218 Grand'Rivière,97211_0040_00013,G,13 RUE DES P ET T,
356000976,00643,35600097600643,O,1991-01-01,NN,,,2009-10-17T12:53:53,false,4,,,,,LE BOURG,97218,GRAND'RIVIERE,,,97211,,,,,,,,,,,,,,,,,,,2009-03-18,F,BUREAU DE POSTE,,,,53.10Z,NAFRev2,O,-61.178112,14.87359,0.62,street,Rue Vieux Bourg 97218 Grand'Rivière,97211_0051,G,RUE VIEUX BOURG,
378224315,00010,37822431500010,O,,NN,,,,true,1,,,,,BOURG,97218,GRAND'RIVIERE,,,97211,,,,,,,,,,,,,,,,,,,1995-11-30,F,,,,,55.3A,NAF1993,N,-61.178112,14.87359,0.92,street,Rue Vieux Bourg 97218 Grand'Rivière,97211_0051,G,RUE VIEUX BOURG,
379866932,00013,37986693200013,O,1987-08-04,NN,,,2008-01-04T21:34:22,true,3,CHEZ MR JEAN-BAPTISTE EUGE,,,,LA LAVE,97218,GRAND'RIVIERE,,,97211,,,,,,,,,,,,,,,,,,,2008-01-01,A,,,,,94.99Z,NAFRev2,N,-61.179166,14.87403,0.92,street,Rue de la Lave 97218 Grand'Rivière,97211_0028,G,RUE DE LA LAVE,
381791847,00019,38179184700019,O,,NN,,,,true,1,,,,,BD STE CATHERINE,97218,GRAND'RIVIERE,,,97211,,,,,,,,,,,,,,,,,,,1993-03-31,F,,,,,36.6E,NAF1993,N,-61.178978,14.874084,0.73,street,Boulevard Sainte Catherine 97218 Grand'Rivière,97211_0045,G,BOULEVARD SAINTE CATHERINE,
381821040,00015,38182104000015,O,1986-12-23,NN,,,2008-01-04T22:01:14,true,3,,,,,VIEUX BOURG CHEZ REMILIEN,97218,GRAND'RIVIERE,,,97211,,,,,,,,,,,,,,,,,,,2008-01-01,A,,,,,93.12Z,NAFRev2,N,,,0,,,,,,
382030872,00016,38203087200016,O,1991-05-15,NN,,,,true,4,,,,RUE,DE LA MUTUALITE,97218,GRAND'RIVIERE,,,97211,,,,,,,,,,,,,,,,,,,2001-07-30,F,,,,,93.0D,NAF1993,N,-61.179528,14.874229,0.95,street,Rue de la Mutualité 97218 Grand'Rivière,97211_0035,G,RUE DE LA MUTUALITE,
384007811,00019,38400781100019,O,1990-11-22,NN,,,2006-11-25T11:44:18,false,4,,,,RUE,LUCY DE FOSSARIEU,97218,GRAND'RIVIERE,,,97211,,,,,,,,,,,,,,,,,,,1998-08-01,F,,,,,63.3Z,NAF1993,O,-61.179903,14.873806,0.82,street,Rue Lucie de Fossarieu 97218 Grand'Rivière,97211_0030,G,RUE LUCIE DE FOSSARIEU,
384007811,00027,38400781100027,O,1998-08-01,NN,,,2017-05-04T02:45:53,true,3,,,,,IMMEUBLE KOULIROU,97218,GRAND'RIVIERE,,,97211,,,,,,,,,,,,,,,,,,,2008-01-01,A,,,,,79.90Z,NAFRev2,O,-61.180986,14.873313,0.44,locality,Lotissement les Koulirous 97218 Grand'Rivière,97211_A010,G,LOTISSEMENT LES KOULIROUS,
384513073,00062,38451307300062,O,2007-01-01,,,,2012-06-28T21:05:26,false,2,,,,RUE,DE LA MUTUALITE,97218,GRAND'RIVIERE,,,97211,,,,,,,,,,,,,,,,,,,2011-12-31,F,,,,,65.12Z,NAFRev2,N,-61.179528,14.874229,0.95,street,Rue de la Mutualité 97218 Grand'Rivière,97211_0035,G,RUE DE LA MUTUALITE,