siren,nic,siret,statutDiffusionEtablissement,dateCreationEtablissement,trancheEffectifsEtablissement,anneeEffectifsEtablissement,activitePrincipaleRegistreMetiersEtablissement,dateDernierTraitementEtablissement,etablissementSiege,nombrePeriodesEtablissement,complementAdresseEtablissement,numeroVoieEtablissement,indiceRepetitionEtablissement,typeVoieEtablissement,libelleVoieEtablissement,codePostalEtablissement,libelleCommuneEtablissement,libelleCommuneEtrangerEtablissement,distributionSpecialeEtablissement,codeCommuneEtablissement,codeCedexEtablissement,libelleCedexEtablissement,codePaysEtrangerEtablissement,libellePaysEtrangerEtablissement,complementAdresse2Etablissement,numeroVoie2Etablissement,indiceRepetition2Etablissement,typeVoie2Etablissement,libelleVoie2Etablissement,codePostal2Etablissement,libelleCommune2Etablissement,libelleCommuneEtranger2Etablissement,distributionSpeciale2Etablissement,codeCommune2Etablissement,codeCedex2Etablissement,libelleCedex2Etablissement,codePaysEtranger2Etablissement,libellePaysEtranger2Etablissement,dateDebut,etatAdministratifEtablissement,enseigne1Etablissement,enseigne2Etablissement,enseigne3Etablissement,denominationUsuelleEtablissement,activitePrincipaleEtablissement,nomenclatureActivitePrincipaleEtablissement,caractereEmployeurEtablissement,longitude,latitude,geo_score,geo_type,geo_adresse,geo_id,geo_ligne,geo_l4,geo_l5
057505539,00189,05750553900189,O,1900-01-01,NN,,,2019-11-14T14:00:27,false,3,,,,,,26400,AOUSTE-SUR-SYE,,,26011,,,,,,,,,,,,,,,,,,,1993-12-31,F,,,,,26.5C,NAF1993,N,,,0,,,,,,
061502456,00025,06150245600025,O,1991-12-23,NN,,,2019-11-14T14:00:27,true,1,,,,RTE,DE LA CLASTRE,26400,AOUSTE-SUR-SYE,,,26011,,,,,,,,,,,,,,,,,,,1992-03-13,F,,,,,74.1J,NAF1993,N,5.059346,44.710978,0.5,street,Route de la Condamine 26400 Aouste-sur-Sye,26011_0032,G,ROUTE DE LA CONDAMINE,
065501850,00104,06550185000104,O,2018-06-01,,,,2019-11-14T14:00:27,false,1,,,,,LA CONDAMINE,26400,AOUSTE-SUR-SYE,,,26011,,,,,,,,,,,,,,,,,,,2018-06-01,A,,,,VILLARET ENERGIES FIOUL,46.71Z,NAFRev2,N,5.058742,44.711591,0.95,street,La Condamine 26400 Aouste-sur-Sye,26011_6enunf,G,LA CONDAMINE,
200040509,00016,20004050900016,O,2014-01-01,,,,2019-11-14T14:00:27,false,2,,,,AV,AMEDEE TERRAIL,26400,AOUSTE-SUR-SYE,,BP 15,26011,,,,,,,,,,,,,,,,,,,2014-02-28,F,,,,,84.11Z,NAFRev2,N,5.055597,44.713607,0.85,street,Avenue Amédée Terrail 26400 Aouste-sur-Sye,26011_0007,G,AVENUE AMEDEE TERRAIL,
200040509,00024,20004050900024,O,2014-01-01,,,,2021-02-23T10:29:24,false,1,ZA DES BORIES,,,CHE,DES SENTEURS,26400,AOUSTE-SUR-SYE,,BP 15,26011,,,,,,,,,,,,,,,,,,,2014-01-01,A,STATION D'EPURATION,,,,37.00Z,NAFRev2,N,5.066716,44.711104,0.84,street,Chemin des Senteurs 26400 Aouste-sur-Sye,26011_0092,G,CHEMIN DES SENTEURS,
200040509,00040,20004050900040,O,2014-02-28,21,2019,,2021-10-27T08:05:40,true,2,ZA DES BORIES,,,CHE,DES SENTEURS,26400,AOUSTE-SUR-SYE,,BP 15,26011,,,,,,,,,,,,,,,,,,,2014-07-13,A,,,,,84.11Z,NAFRev2,O,5.066716,44.711104,0.84,street,Chemin des Senteurs 26400 Aouste-sur-Sye,26011_0092,G,CHEMIN DES SENTEURS,
212600118,00013,21260011800013,O,1983-03-01,11,2019,,2021-10-27T08:07:28,true,4,HOTEL DE VILLE,,,,,26400,AOUSTE-SUR-SYE,,,26011,,,,,,,,,,,,,,,,,,,2008-01-01,A,MAIRIE,,,,84.11Z,NAFRev2,O,5.056252,44.716001,0.46,street,Rue de Surville 26400 Aouste-sur-Sye,26011_0093,D,RUE DE SURVILLE,
212600118,00021,21260011800021,O,1983-12-21,03,2019,,2021-10-27T08:07:28,false,3,,,,AV,AMEDEE TERRAIL,26400,AOUSTE-SUR-SYE,,,26011,,,,,,,,,,,,,,,,,,,2008-01-01,A,ECOLE MATERNELLE PUBLIQUE JULES FERRY,,,,85.10Z,NAFRev2,N,5.055597,44.713607,0.85,street,Avenue Amédée Terrail 26400 Aouste-sur-Sye,26011_0007,G,AVENUE AMEDEE TERRAIL,
212600118,00039,21260011800039,O,1983-12-21,11,2019,,2021-10-27T08:07:28,false,4,,,,AV,AMEDEE TERRAIL,26400,AOUSTE-SUR-SYE,,,26011,,,,,,,,,,,,,,,,,,,2008-01-01,A,ECOLE ELEMENTAIRE JULES FERRY,,,,85.20Z,NAFRev2,N,5.055597,44.713607,0.85,street,Avenue Amédée Terrail 26400 Aouste-sur-Sye,26011_0007,G,AVENUE AMEDEE TERRAIL,
212600118,00054,21260011800054,O,1994-12-25,NN,,,2019-11-14T14:00:27,false,2,MAIRIE,,,,,26400,AOUSTE-SUR-SYE,,,26011,,,,,,,,,,,,,,,,,,,2008-01-01,A,SERVICE EAUX,,,,36.00Z,NAFRev2,N,5.043716,44.71865,0.39,street,Impasse de l’Ancienne Scierie 26400 Aouste-sur-Sye,26011_ymd9po,D,IMPASSE DE L ANCIENNE SCIERIE,
212600118,00062,21260011800062,O,2002-04-25,NN,,,2019-11-14T14:00:27,false,4,MAIRIE,,,,,26400,AOUSTE-SUR-SYE,,,26011,,,,,,,,,,,,,,,,,,,2016-12-31,F,ZAC LA CONDAMINE,,,,42.99Z,NAFRev2,N,5.043716,44.71865,0.39,street,Impasse de l’Ancienne Scierie 26400 Aouste-sur-Sye,26011_ymd9po,D,IMPASSE DE L ANCIENNE SCIERIE,
212600118,00070,21260011800070,O,2001-01-01,02,2019,,2021-10-27T08:07:28,false,3,MAIRIE,,,,,26400,AOUSTE-SUR-SYE,,,26011,,,,,,,,,,,,,,,,,,,2008-01-01,A,SERVICE ASSAINISSEMENT,,,,37.00Z,NAFRev2,N,5.043716,44.71865,0.39,street,Impasse de l’Ancienne Scierie 26400 Aouste-sur-Sye,26011_ymd9po,D,IMPASSE DE L ANCIENNE SCIERIE,
212600118,00088,21260011800088,O,2001-12-25,,,,2019-11-14T14:00:27,false,1,MAIRIE,,,,,26400,AOUSTE-SUR-SYE,,,26011,,,,,,,,,,,,,,,,,,,2001-12-25,F,BA BUDGET ECONOMIE,,,,75.1C,NAF1993,N,5.043716,44.71865,0.39,street,Impasse de l’Ancienne Scierie 26400 Aouste-sur-Sye,26011_ymd9po,D,IMPASSE DE L ANCIENNE SCIERIE,
242600526,00048,24260052600048,O,2001-12-25,NN,,,2019-11-14T14:00:27,false,3,,,,CHE,DES SENTEURS,26400,AOUSTE-SUR-SYE,,,26011,,,,,,,,,,,,,,,,,,,2014-01-01,F,BUDGET ECONOMIE,,,,84.11Z,NAFRev2,N,5.066716,44.711104,0.84,street,Chemin des Senteurs 26400 Aouste-sur-Sye,26011_0092,G,CHEMIN DES SENTEURS,
242600526,00055,24260052600055,O,2001-07-01,NN,,,2019-11-14T14:00:27,false,4,,,,AV,AMEDEE TERAIL,26400,AOUSTE-SUR-SYE,,BP 15,26011,,,,,,,,,,,,,,,,,,,2013-10-07,F,,,,,84.11Z,NAFRev2,O,5.055597,44.713607,0.79,street,Avenue Amédée Terrail 26400 Aouste-sur-Sye,26011_0007,G,AVENUE AMEDEE TERRAIL,
242600526,00063,24260052600063,O,2002-10-25,NN,,,2019-11-14T14:00:27,false,4,,,,CHE,DES SENTEURS,26400,AOUSTE-SUR-SYE,,,26011,,,,,,,,,,,,,,,,,,,2014-01-01,F,STATION EPURATION DU CRESTOIS,,,,37.00Z,NAFRev2,N,5.066716,44.711104,0.84,street,Chemin des Senteurs 26400 Aouste-sur-Sye,26011_0092,G,CHEMIN DES SENTEURS,
242600526,00071,24260052600071,O,2013-10-07,NN,,,2019-11-14T14:00:27,true,2,,,,CHE,DES SENTEURS,26400,AOUSTE-SUR-SYE,,,26011,,,,,,,,,,,,,,,,,,,2014-01-01,F,,,,,84.11Z,NAFRev2,O,5.066716,44.711104,0.84,street,Chemin des Senteurs 26400 Aouste-sur-Sye,26011_0092,G,CHEMIN DES SENTEURS,
262600968,00016,26260096800016,O,1993-01-01,NN,,,2019-11-14T14:00:27,true,5,MAIRIE,,,AV,AMEDEE TERRAIL,26400,AOUSTE-SUR-SYE,,,26011,,,,,,,,,,,,,,,,,,,2014-01-01,A,,,,,88.99B,NAFRev2,O,5.055597,44.713607,0.85,street,Avenue Amédée Terrail 26400 Aouste-sur-Sye,26011_0007,G,AVENUE AMEDEE TERRAIL,
272600495,00019,27260049500019,O,,,,,2019-11-14T14:00:27,true,1,,,,,HOTEL DE VILLE,26400,AOUSTE-SUR-SYE,,,26011,,,,,,,,,,,,,,,,,,,1995-12-25,F,,,,,41.0Z,NAF1993,N,5.056252,44.716001,0.46,street,Rue de Surville 26400 Aouste-sur-Sye,26011_0093,G,RUE DE SURVILLE,
272600776,00012,27260077600012,O,,,,,2019-11-14T14:00:27,true,1,,,,,,26400,AOUSTE-SUR-SYE,,,26011,,,,,,,,,,,,,,,,,,,1995-12-25,F,,,,,75.1C,NAF1993,N,,,0,,,,,,
300947165,00019,30094716500019,O,,NN,,,2019-11-14T14:00:27,true,1,,,,,HLM FONTANIA,26400,AOUSTE-SUR-SYE,,,26011,,,,,,,,,,,,,,,,,,,,F,,,,,64.11,NAP,N,5.064412,44.716593,0.39,street,Route de Fontagnal 26400 Aouste-sur-Sye,26011_0049,G,ROUTE DE FONTAGNAL,
301106415,00013,30110641500013,O,,NN,,,2019-11-14T14:00:27,true,1,,,,,GRANDE RUE,26400,AOUSTE-SUR-SYE,,,26011,,,,,,,,,,,,,,,,,,,1996-06-30,F,,,,,52.3A,NAF1993,O,5.056975,44.715595,0.96,street,Grande Rue 26400 Aouste-sur-Sye,26011_0054,G,GRANDE RUE,
302799663,00018,30279966300018,O,1900-01-01,,,,2019-11-14T14:00:27,true,3,,,,,,26400,AOUSTE-SUR-SYE,,,26011,,,,,,,,,,,,,,,,,,,1997-12-25,F,,,,,80.4D,NAF1993,N,,,0,,,,,,
303268395,00017,30326839500017,O,1975-01-01,NN,,,2019-11-14T14:00:27,true,1,,,,,,26400,AOUSTE-SUR-SYE,,,26011,,,,,,,,,,,,,,,,,,,1999-12-31,F,,,,,45.3E,NAF1993,N,,,0,,,,,,
304372253,00019,30437225300019,O,,NN,,,2019-11-14T14:00:27,true,1,,,,,,26400,AOUSTE-SUR-SYE,,,26011,,,,,,,,,,,,,,,,,,,1982-08-20,F,,,,,64.48,NAP,N,,,0,,,,,,
305446908,00017,30544690800017,O,,NN,,,2019-11-14T14:00:27,true,1,,,,RUE,DE L ALLEE,26400,AOUSTE-SUR-SYE,,,26011,,,,,,,,,,,,,,,,,,,1986-03-06,F,,,,,69.12,NAP,N,5.056414,44.716187,0.95,street,Rue de l’Allée 26400 Aouste-sur-Sye,26011_0005,G,RUE DE L ALLEE,
306699869,00021,30669986900021,O,1990-07-02,NN,,,2019-11-14T14:00:27,false,3,,,,,QUARTIER MI VOIE,26400,AOUSTE-SUR-SYE,,,26011,,,,,,,,,,,,,,,,,,,1993-12-25,F,CHICK ET CHAUD,,,,55.3A,NAF1993,N,,,0,,,,,,
307918904,00011,30791890400011,O,1900-01-01,NN,,,2019-11-14T14:00:27,true,4,,,,,,26400,AOUSTE-SUR-SYE,,,26011,,,,,,,,,,,,,,,,,,,2010-09-07,F,,,,,68.20B,NAFRev2,N,,,0,,,,,,
307962738,00018,30796273800018,O,,NN,,,2019-11-14T14:00:27,true,1,,,,,QUARTIER ST PIERRE,26400,AOUSTE-SUR-SYE,,,26011,,,,,,,,,,,,,,,,,,,,F,,,,,55.60,NAP,N,5.058852,44.68666,0.54,street,Quartier Sauvanes 26400 Aouste-sur-Sye,26011_n53u05,G,QUARTIER SAUVANES,
308065499,00011,30806549900011,O,1976-01-01,NN,,,2019-11-14T14:00:27,false,6,QUARTIER MI VOIE,8,,RUE,CHAPOUTAT,26400,AOUSTE-SUR-SYE,,,26011,,,,,,,,,,,,,,,,,,,2008-12-11,F,,,,,47.29Z,NAFRev2,N,5.050974,44.716247,0.94,housenumber,8 Rue Charles Chapoutat 26400 Aouste-sur-Sye,26011_0027_00008,G,8 RUE CHARLES CHAPOUTAT,
308762202,00015,30876220200015,O,,,,,2019-11-14T14:00:27,true,1,,,,,,26400,AOUSTE-SUR-SYE,,,26011,,,,,,,,,,,,,,,,,,,,F,,,,,22.01,NAP,N,,,0,,,,,,
308871821,00010,30887182100010,O,1990-04-01,NN,,,2019-11-14T14:00:27,true,4,GRANDE RUE,,,PL,DE LA POSTE,26400,AOUSTE-SUR-SYE,,,26011,,,,,,,,,,,,,,,,,,,2010-09-07,F,,,,,68.20B,NAFRev2,N,5.057168,44.715282,0.83,street,Place de la Poste 26400 Aouste-sur-Sye,26011_0078,G,PLACE DE LA POSTE,
308871839,00012,30887183900012,O,1990-03-31,NN,,,2019-11-14T14:00:27,true,4,GRANDE RUE,,,PL,DE LA POSTE,26400,AOUSTE-SUR-SYE,,,26011,,,,,,,,,,,,,,,,,,,2010-09-07,F,,,,,68.20B,NAFRev2,N,5.057168,44.715282,0.83,street,Place de la Poste 26400 Aouste-sur-Sye,26011_0078,G,PLACE DE LA POSTE,
308961606,00032,30896160600032,O,2004-09-14,NN,,,2019-11-14T14:00:27,false,3,MME BRICARD,2,,RUE,E LA GARE,26400,AOUSTE-SUR-SYE,,BP 207,26011,,,,,,,,,,,,,,,,,,,2005-01-01,F,,,,,92.3D,NAFRev1,O,5.056085,44.719031,0.6,housenumber,2 Rue la Traversière 26400 Aouste-sur-Sye,26011_0098_00002,G,2 RUE LA TRAVERSIERE,
308961606,00040,30896160600040,O,2005-01-01,11,2019,,2021-10-27T08:16:36,true,3,,,,RUE,GUSTAVE GRESSE,26400,AOUSTE-SUR-SYE,,,26011,,,,,,,,,,,,,,,,,,,2008-01-01,A,,,,,94.99Z,NAFRev2,O,5.054341,44.715284,0.95,street,Rue Gustave Gresse 26400 Aouste-sur-Sye,26011_0056,G,RUE GUSTAVE GRESSE,
309036846,00025,30903684600025,O,,NN,,,2019-11-14T14:00:27,true,1,,,,,GRANDE RUE,26400,AOUSTE-SUR-SYE,,,26011,,,,,,,,,,,,,,,,,,,1995-12-04,F,,,,,15.8C,NAF1993,O,5.056975,44.715595,0.96,street,Grande Rue 26400 Aouste-sur-Sye,26011_0054,G,GRANDE RUE,
309359156,00010,30935915600010,O,1964-01-01,03,2019,2830ZZ,2021-10-27T08:16:46,true,4,,32,,RTE,DE CREST,26400,AOUSTE-SUR-SYE,,,26011,,,,,,,,,,,,,,,,,,,2008-01-01,A,,,,,28.30Z,NAFRev2,O,5.045229,44.718814,0.84,housenumber,32 Route de Crest 26400 Aouste-sur-Sye,26011_w8alof_00032,G,32 ROUTE DE CREST,
309566735,00010,30956673500010,O,,,,,2019-11-14T14:00:27,true,1,,,,,QUART MI-VOIE,26400,AOUSTE-SUR-SYE,,,26011,,,,,,,,,,,,,,,,,,,1988-07-08,F,,,,,15.08,NAP,N,,,0,,,,,,
309614402,00019,30961440200019,O,1900-01-01,NN,,,2019-11-14T14:00:27,false,3,,,,,GRANDE RUE,26400,AOUSTE-SUR-SYE,,,26011,,,,,,,,,,,,,,,,,,,1992-03-31,F,,,,,93.0D,NAF1993,N,5.056975,44.715595,0.96,street,Grande Rue 26400 Aouste-sur-Sye,26011_0054,G,GRANDE RUE,
310199955,00017,31019995500017,O,,NN,,,2019-11-14T14:00:27,true,1,,,,,QU DES HAUTS ARRAS,26400,AOUSTE-SUR-SYE,,,26011,,,,,,,,,,,,,,,,,,,1990-09-20,F,,,,,69.12,NAP,N,5.051651,44.727261,0.79,street,Chemin des Hauts Arras 26400 Aouste-sur-Sye,26011_0055,G,CHEMIN DES HAUTS ARRAS,
310248661,00020,31024866100020,O,1995-08-16,NN,,,2019-11-14T14:00:27,true,4,,,,,,26400,AOUSTE-SUR-SYE,,,26011,,,,,,,,,,,,,,,,,,,2008-01-15,F,,,,,47.62Z,NAFRev2,O,,,0,,,,,,
310574405,00026,31057440500026,O,2007-07-01,NN,,,2019-11-14T14:00:27,true,5,,,,,ROUTE DU PAS DE LAUZUN,26400,AOUSTE-SUR-SYE,,,26011,,,,,,,,,,,,,,,,,,,2018-05-31,F,,,,,86.21Z,NAFRev2,N,5.057873,44.707887,0.96,street,Route du Pas de Lauzun 26400 Aouste-sur-Sye,26011_0071,G,ROUTE DU PAS DE LAUZUN,
310952338,00039,31095233800039,O,2006-07-01,,,,2021-02-23T10:38:56,true,2,,1,,RTE,DES HAUTS ARRAS,26400,AOUSTE-SUR-SYE,,,26011,,,,,,,,,,,,,,,,,,,2008-01-01,A,,,,,90.03B,NAFRev2,N,5.051651,44.727261,0.72,street,Chemin des Hauts Arras 26400 Aouste-sur-Sye,26011_0055,G,CHEMIN DES HAUTS ARRAS,
312632672,00019,31263267200019,O,,NN,,,2019-11-14T14:00:27,true,1,,,,,GRANDE RUE,26400,AOUSTE-SUR-SYE,,,26011,,,,,,,,,,,,,,,,,,,1992-08-31,F,,,,,52.7A,NAF1993,N,5.056975,44.715595,0.96,street,Grande Rue 26400 Aouste-sur-Sye,26011_0054,G,GRANDE RUE,
312644826,00025,31264482600025,O,,NN,,,2019-11-14T14:00:27,true,1,,,,,QUARTIER CHANTELOUBE,26400,AOUSTE-SUR-SYE,,,26011,,,,,,,,,,,,,,,,,,,,F,,,,,55.60,NAP,N,5.064892,44.699386,0.51,street,Quartier Combe Plane 26400 Aouste-sur-Sye,26011_ygyy08,G,QUARTIER COMBE PLANE,
312916851,00016,31291685100016,O,1978-01-01,NN,,,2019-11-14T14:00:27,true,3,,,,AV,DE LA GARE,26400,AOUSTE-SUR-SYE,,,26011,,,,,,,,,,,,,,,,,,,2003-12-31,F,,,,,55.1A,NAFRev1,O,5.057558,44.712646,0.75,street,Rue de la Gare 26400 Aouste-sur-Sye,26011_0052,G,RUE DE LA GARE,
313226888,00011,31322688800011,O,,,,,2019-11-14T14:00:27,true,1,,,,,GRANDE RUE,26400,AOUSTE-SUR-SYE,,,26011,,,,,,,,,,,,,,,,,,,1990-09-30,F,,,,,65.03,NAP,N,5.056975,44.715595,0.96,street,Grande Rue 26400 Aouste-sur-Sye,26011_0054,G,GRANDE RUE,
313387201,00046,31338720100046,O,2017-01-06,01,2019,,2021-10-27T08:18:27,true,1,RENC'ARTS,,,QUAI,LA PIALLE,26400,AOUSTE-SUR-SYE,,,26011,,,,,,,,,,,,,,,,,,,2017-01-06,A,,,,,90.01Z,NAFRev2,O,,,0,,,,,,
313611949,00055,31361194900055,O,2004-10-01,NN,,,2019-11-14T14:00:27,false,4,,36,,,GRANDE RUE,26400,AOUSTE-SUR-SYE,,,26011,,,,,,,,,,,,,,,,,,,2014-06-01,F,,,,,47.22Z,NAFRev2,N,5.057792,44.715483,0.96,housenumber,36 Grande Rue 26400 Aouste-sur-Sye,26011_0054_00036,G,36 GRANDE RUE,
314011610,00032,31401161000032,O,1988-02-11,NN,,,2019-11-14T14:00:27,false,3,,,,RUE,DE LA GARE,26400,AOUSTE-SUR-SYE,,,26011,,,,,,,,,,,,,,,,,,,1994-01-31,F,,,,,74.2A,NAF1993,N,5.057558,44.712646,0.96,street,Rue de la Gare 26400 Aouste-sur-Sye,26011_0052,G,RUE DE LA GARE,
314452947,00034,31445294700034,O,1996-10-01,NN,,,2019-11-14T14:00:27,true,4,,,,QUAI,MI VOIE,26400,AOUSTE-SUR-SYE,,,26011,,,,,,,,,,,,,,,,,,,2003-12-31,F,,,,,93.0B,NAFRev1,O,,,0,,,,,,
314626938,00042,31462693800042,O,2018-12-01,,,,2019-11-14T14:00:27,false,1,,,,IMP,DE LA MODISTE,26400,AOUSTE-SUR-SYE,,,26011,,,,,,,,,,,,,,,,,,,2018-12-01,A,,,,,68.20A,NAFRev2,N,5.056696,44.715914,0.84,street,Impasse de la Modiste 26400 Aouste-sur-Sye,26011_0066,G,IMPASSE DE LA MODISTE,
315112375,00029,31511237500029,O,,NN,,,2019-11-14T14:00:27,true,1,,,,RUE,GARE,26400,AOUSTE-SUR-SYE,,,26011,,,,,,,,,,,,,,,,,,,1994-03-01,F,,,,,45.2V,NAF1993,N,5.057558,44.712646,0.84,street,Rue de la Gare 26400 Aouste-sur-Sye,26011_0052,G,RUE DE LA GARE,
315578757,00041,31557875700041,O,1995-12-05,NN,,,2019-11-14T14:00:27,true,3,,,,,GRANDE RUE,26400,AOUSTE-SUR-SYE,,,26011,,,,,,,,,,,,,,,,,,,2007-10-29,F,,,,,52.2G,NAFRev1,N,5.056975,44.715595,0.96,street,Grande Rue 26400 Aouste-sur-Sye,26011_0054,G,GRANDE RUE,
315578757,00058,31557875700058,O,1995-12-05,NN,,,2019-11-14T14:00:27,false,5,,,,,GRANDE RUE,26400,AOUSTE-SUR-SYE,,,26011,,,,,,,,,,,,,,,,,,,2007-10-29,F,,,,,15.8C,NAFRev1,N,5.056975,44.715595,0.96,street,Grande Rue 26400 Aouste-sur-Sye,26011_0054,G,GRANDE RUE,
316389725,00011,31638972500011,O,1900-01-01,12,2019,,2021-10-27T08:19:43,false,4,,,,RTE,DE LA CLASTRE,26400,AOUSTE-SUR-SYE,,,26011,,,,,,,,,,,,,,,,,,,2008-01-01,A,,,,,49.41B,NAFRev2,O,5.059346,44.710978,0.5,street,Route de la Condamine 26400 Aouste-sur-Sye,26011_0032,G,ROUTE DE LA CONDAMINE,
316435635,00032,31643563500032,O,1991-08-01,NN,,,2020-07-07T11:27:25,false,4,,,,,QUARTIER LES AUBES,26400,AOUSTE-SUR-SYE,,,26011,,,,,,,,,,,,,,,,,,,2016-12-31,F,,,,,01.50Z,NAFRev2,N,5.045172,44.696332,0.73,street,Quartier les Hubacs 26400 Aouste-sur-Sye,26011_p9f2hg,G,QUARTIER LES HUBACS,
316435635,00040,31643563500040,O,2017-01-01,,,,2021-02-23T10:41:48,true,1,LES AUBES,300,,RTE,DU CORNERET,26400,AOUSTE-SUR-SYE,,,26011,,,,,,,,,,,,,,,,,,,2017-01-01,A,,,,,68.20A,NAFRev2,N,5.083705,44.729946,0.86,housenumber,300 Route du Corneret 26400 Aouste-sur-Sye,26011_0035_00300,G,300 ROUTE DU CORNERET,
316435676,00010,31643567600010,O,,NN,,,2019-11-14T14:00:27,true,1,,,,PL,ROCHEFORT,26400,AOUSTE-SUR-SYE,,,26011,,,,,,,,,,,,,,,,,,,,F,,,,,66.02,NAP,N,5.058259,44.715042,0.8,street,Place Rochefort 26400 Aouste-sur-Sye,26011_0085,G,PLACE ROCHEFORT,
316631530,00029,31663153000029,O,,NN,,,2019-11-14T14:00:27,true,1,,93,,RTE,DE CREST,26400,AOUSTE-SUR-SYE,,,26011,,,,,,,,,,,,,,,,,,,1994-12-21,F,,,,,52.1D,NAF1993,O,5.037815,44.721509,0.67,street,Route de Crest 26400 Aouste-sur-Sye,26011_w8alof,G,ROUTE DE CREST,
317579142,00017,31757914200017,O,,,,,2019-11-14T14:00:27,true,1,,,,PL,DE LA CROIX,26400,AOUSTE-SUR-SYE,,,26011,,,,,,,,,,,,,,,,,,,1991-12-31,F,,,,,55.71,NAP,N,5.055236,44.715941,0.76,street,Rue de la Croix 26400 Aouste-sur-Sye,26011_0038,G,RUE DE LA CROIX,
318057049,00013,31805704900013,O,,,,,2019-11-14T14:00:27,true,1,,,,,QUARTIER MIVOIE,26400,AOUSTE-SUR-SYE,,,26011,,,,,,,,,,,,,,,,,,,1988-03-31,F,,,,,55.71,NAP,N,5.045261,44.710313,0.65,street,Quartier Millassoles 26400 Aouste-sur-Sye,26011_9yir23,G,QUARTIER MILLASSOLES,
318774247,00015,31877424700015,O,,NN,,,2019-11-14T14:00:27,true,1,,,,,GRANDE RUE,26400,AOUSTE-SUR-SYE,,,26011,,,,,,,,,,,,,,,,,,,1990-04-01,F,,,,,67.01,NAP,N,5.056975,44.715595,0.96,street,Grande Rue 26400 Aouste-sur-Sye,26011_0054,G,GRANDE RUE,
319077087,00058,31907708700058,O,2009-10-31,,,,2019-11-14T14:00:27,false,2,,,,,QUARTIER CHABANAS,26400,AOUSTE-SUR-SYE,,,26011,,,,,,,,,,,,,,,,,,,2016-12-07,F,,,,,86.21Z,NAFRev2,N,5.064892,44.699386,0.54,street,Quartier Combe Plane 26400 Aouste-sur-Sye,26011_ygyy08,G,QUARTIER COMBE PLANE,
319077087,00066,31907708700066,O,2016-12-07,,,,2021-02-23T10:43:30,true,1,,19,,RTE,DE CORNERET,26400,AOUSTE-SUR-SYE,,,26011,,,,,,,,,,,,,,,,,,,2016-12-07,A,,,,,86.21Z,NAFRev2,N,5.064073,44.720398,0.72,housenumber,19 Route du Corneret 26400 Aouste-sur-Sye,26011_0035_00019,G,19 ROUTE DU CORNERET,
321020455,00028,32102045500028,O,,NN,,,2019-11-14T14:00:27,true,1,,,,PL,DE L'EGLISE,26400,AOUSTE-SUR-SYE,,,26011,,,,,,,,,,,,,,,,,,,1996-04-01,F,,,,,52.1B,NAF1993,N,5.057229,44.716034,0.82,street,Place de l’Eglise 26400 Aouste-sur-Sye,26011_0042,G,PLACE DE L EGLISE,
321537003,00022,32153700300022,O,2010-10-15,,,,2019-11-14T14:00:27,false,2,QUARTIER MIVOIE,,,,CENTRE COMMERCIAL CD 93,26400,AOUSTE-SUR-SYE,,,26011,,,,,,,,,,,,,,,,,,,2012-10-15,F,OCEANE FLEURS,,,,47.76Z,NAFRev2,N,,,0,,,,,,
321572596,00013,32157259600013,O,,,,,2019-11-14T14:00:27,true,1,,,,,QUARTIER ST PIERRE,26400,AOUSTE-SUR-SYE,,,26011,,,,,,,,,,,,,,,,,,,1984-12-25,F,,,,,22.02,NAP,N,5.058852,44.68666,0.54,street,Quartier Sauvanes 26400 Aouste-sur-Sye,26011_n53u05,G,QUARTIER SAUVANES,
322188855,00397,32218885500397,O,1996-05-03,NN,,,2019-11-14T14:00:27,false,4,CC INTERMARCHE QUA MIVOIE,,,RTE,DE CREST,26400,AOUSTE-SUR-SYE,,,26011,,,,,,,,,,,,,,,,,,,2002-02-28,F,DEFI MODE,,,,52.4C,NAF1993,N,5.037815,44.721509,0.81,street,Route de Crest 26400 Aouste-sur-Sye,26011_w8alof,G,ROUTE DE CREST,
322285933,00030,32228593300030,O,2001-04-09,NN,,,2019-11-14T14:00:27,false,10,,,,,ST FRANCOIS,26400,AOUSTE-SUR-SYE,,,26011,,,,,,,,,,,,,,,,,,,2012-12-31,F,BEKA,,,,25.73A,NAFRev2,O,5.055228,44.718742,0.79,street,Saint François 26400 Aouste-sur-Sye,26011_B037,G,SAINT FRANCOIS,
322285933,00048,32228593300048,O,2013-07-12,,,,2021-02-23T10:45:53,true,1,ROUTE DE BLACON,,,,FONTAGNAL II,26400,AOUSTE-SUR-SYE,,,26011,,,,,,,,,,,,,,,,,,,2013-07-12,A,,,,,43.34Z,NAFRev2,N,5.064412,44.716593,0.73,street,Route de Fontagnal 26400 Aouste-sur-Sye,26011_0049,G,ROUTE DE FONTAGNAL,
322503780,00064,32250378000064,O,2000-02-01,NN,,,2019-11-14T14:00:27,false,4,,,,QUAI,MIVOIE,26400,AOUSTE-SUR-SYE,,,26011,,,,,,,,,,,,,,,,,,,2009-07-27,F,,,,,47.89Z,NAFRev2,N,5.041791,44.722359,0.55,street,Route de Mivoie 26400 Aouste-sur-Sye,26011_0062,G,ROUTE DE MIVOIE,
322503780,00072,32250378000072,O,2009-07-27,,,,2019-11-14T14:00:27,true,2,,4,,RUE,CHARLES CHAPOUTAT,26400,AOUSTE-SUR-SYE,,,26011,,,,,,,,,,,,,,,,,,,2017-05-14,F,,,,,47.89Z,NAFRev2,N,5.05005,44.716496,0.96,housenumber,4 Rue Charles Chapoutat 26400 Aouste-sur-Sye,26011_0027_00004,G,4 RUE CHARLES CHAPOUTAT,
322709999,00013,32270999900013,O,,NN,,,2019-11-14T14:00:27,true,1,,,,,GRANDE RUE,26400,AOUSTE-SUR-SYE,,,26011,,,,,,,,,,,,,,,,,,,,F,,,,,62.43,NAP,N,5.056975,44.715595,0.96,street,Grande Rue 26400 Aouste-sur-Sye,26011_0054,G,GRANDE RUE,
322914649,00015,32291464900015,O,,NN,,,2019-11-14T14:00:27,true,1,,,,,,26400,AOUSTE-SUR-SYE,,,26011,,,,,,,,,,,,,,,,,,,1985-03-07,F,,,,,81.21,NAP,N,,,0,,,,,,
322959529,00015,32295952900015,O,1981-11-01,NN,,,2019-11-14T14:00:27,true,3,,,,,,26400,AOUSTE-SUR-SYE,,,26011,,,,,,,,,,,,,,,,,,,2008-01-01,A,,,,,68.20B,NAFRev2,N,,,0,,,,,,
323028837,00058,32302883700058,O,2004-08-02,,,4334ZC,2019-11-14T14:00:27,true,4,,35,,RUE,DU 19 MARS 1962,26400,AOUSTE-SUR-SYE,,,26011,,,,,,,,,,,,,,,,,,,2015-06-30,F,,,,,43.34Z,NAFRev2,N,5.050754,44.713979,0.96,housenumber,35 Rue du 19 Mars 1962 26400 Aouste-sur-Sye,26011_0037_00035,G,35 RUE DU 19 MARS 1962,
323876755,00030,32387675500030,O,2003-08-01,NN,,4334ZC,2019-11-14T14:00:27,true,8,,,,QUA,LES MILLASSOLES,26400,AOUSTE-SUR-SYE,,,26011,,,,,,,,,,,,,,,,,,,2017-01-02,F,,,,,43.34Z,NAFRev2,N,5.045261,44.710313,0.73,street,Quartier Millassoles 26400 Aouste-sur-Sye,26011_9yir23,G,QUARTIER MILLASSOLES,
324043173,00016,32404317300016,O,1982-03-08,NN,,,2019-11-14T14:00:27,false,4,,,,,ZA,26400,AOUSTE-SUR-SYE,,,26011,,,,,,,,,,,,,,,,,,,2003-02-03,F,,,,,70.2C,NAFRev1,N,4.7170629,44.1023765,0.87,poi.industrial,ZA CNR (Zone industrielle) Caderousse,https://osm.org/way/74398546,G,,
324198431,00037,32419843100037,O,1983-12-15,NN,,,2019-11-14T14:00:27,false,4,,,,RTE,DU PAS DE LAUZENS,26400,AOUSTE-SUR-SYE,,,26011,,,,,,,,,,,,,,,,,,,2001-07-01,F,,,,,36.6E,NAF1993,N,5.059154,44.706789,0.87,street,Route du Pas de Lauzens 26400 Aouste-sur-Sye,26011_mdepln,G,ROUTE DU PAS DE LAUZENS,
325282077,00016,32528207700016,O,,NN,,,2019-11-14T14:00:27,true,1,,,,RTE,DES PLANTES,26400,AOUSTE-SUR-SYE,,,26011,,,,,,,,,,,,,,,,,,,1986-09-30,F,,,,,64.11,NAP,N,5.055604,44.715169,0.51,street,Place des 3 Balcons 26400 Aouste-sur-Sye,26011_0101,G,PLACE DES 3 BALCONS,
325489193,00012,32548919300012,O,,NN,,,2019-11-14T14:00:27,true,1,,,,,,26400,AOUSTE-SUR-SYE,,,26011,,,,,,,,,,,,,,,,,,,1995-08-15,F,,,,,52.4R,NAF1993,N,,,0,,,,,,
325567782,00033,32556778200033,O,2018-03-01,,,,2019-12-04T10:16:13,false,2,,,,,LE TEMPLE,26400,AOUSTE-SUR-SYE,,,26011,,,,,,,,,,,,,,,,,,,2019-03-01,F,,,,,52.10B,NAFRev2,N,5.049008,44.716246,0.32,street,Lotissement le Fleury 26400 Aouste-sur-Sye,26011_A009,G,LOTISSEMENT LE FLEURY,
325699700,00010,32569970000010,O,1982-10-01,NN,,,2019-11-14T14:00:27,true,1,,,,QUAI,DE LA GARE,26400,AOUSTE-SUR-SYE,,,26011,,,,,,,,,,,,,,,,,,,1991-12-25,F,,,,,45.4C,NAF1993,N,5.044662,44.730246,0.44,street,Chemin de la Loziere 26400 Aouste-sur-Sye,26011_txiwq4,G,CHEMIN DE LA LOZIERE,
325699718,00012,32569971800012,O,1982-10-01,NN,,,2019-11-14T14:00:27,true,1,,,,QUAI,DE LA GARE,26400,AOUSTE-SUR-SYE,,,26011,,,,,,,,,,,,,,,,,,,1991-12-25,F,,,,,45.4C,NAF1993,N,5.044662,44.730246,0.44,street,Chemin de la Loziere 26400 Aouste-sur-Sye,26011_txiwq4,G,CHEMIN DE LA LOZIERE,