siren,nic,siret,statutDiffusionEtablissement,dateCreationEtablissement,trancheEffectifsEtablissement,anneeEffectifsEtablissement,activitePrincipaleRegistreMetiersEtablissement,dateDernierTraitementEtablissement,etablissementSiege,nombrePeriodesEtablissement,complementAdresseEtablissement,numeroVoieEtablissement,indiceRepetitionEtablissement,typeVoieEtablissement,libelleVoieEtablissement,codePostalEtablissement,libelleCommuneEtablissement,libelleCommuneEtrangerEtablissement,distributionSpecialeEtablissement,codeCommuneEtablissement,codeCedexEtablissement,libelleCedexEtablissement,codePaysEtrangerEtablissement,libellePaysEtrangerEtablissement,complementAdresse2Etablissement,numeroVoie2Etablissement,indiceRepetition2Etablissement,typeVoie2Etablissement,libelleVoie2Etablissement,codePostal2Etablissement,libelleCommune2Etablissement,libelleCommuneEtranger2Etablissement,distributionSpeciale2Etablissement,codeCommune2Etablissement,codeCedex2Etablissement,libelleCedex2Etablissement,codePaysEtranger2Etablissement,libellePaysEtranger2Etablissement,dateDebut,etatAdministratifEtablissement,enseigne1Etablissement,enseigne2Etablissement,enseigne3Etablissement,denominationUsuelleEtablissement,activitePrincipaleEtablissement,nomenclatureActivitePrincipaleEtablissement,caractereEmployeurEtablissement,longitude,latitude,geo_score,geo_type,geo_adresse,geo_id,geo_ligne,geo_l4,geo_l5
213203417,00018,21320341700018,O,1983-03-01,02,2019,,2021-10-27T08:07:51,true,3,,,,,,32390,REJAUMONT,,,32341,,,,,,,,,,,,,,,,,,,2008-01-01,A,MAIRIE,,,,84.11Z,NAFRev2,N,,,0,,,,,,
213203417,00026,21320341700026,O,1983-12-21,NN,,,,false,4,,,,,,32390,REJAUMONT,,,32341,,,,,,,,,,,,,,,,,,,2001-07-09,F,ECOLE PRIMAIRE PUBLIQUE,,,,80.1Z,NAF1993,N,,,0,,,,,,
263204471,00019,26320447100019,O,1984-10-01,NN,,,2010-06-26T03:08:28,true,3,,,,,MAIRIE,32390,REJAUMONT,,,32341,,,,,,,,,,,,,,,,,,,2008-01-01,A,CCAS,,,,88.99B,NAFRev2,N,0.51466,43.825979,0.37,street,Lieu-Dit Maison Neuve 32390 Réjaumont,32341_ei138q,G,LIEU DIT MAISON NEUVE,
293201737,00013,29320173700013,O,1983-09-14,NN,,,2006-11-25T09:10:35,true,3,MAIRIE,,,,VILLAGE,32390,REJAUMONT,,,32341,,,,,,,,,,,,,,,,,,,2005-03-31,F,,,,,70.1C,NAFRev1,N,4.39087,45.4547668,0.89,poi.cafe,Village Café Saint-Étienne,https://osm.org/node/5321738834,G,,
304145089,00013,30414508900013,O,,NN,,,,true,1,,,,,,32390,REJAUMONT,,,32341,,,,,,,,,,,,,,,,,,,2000-04-13,F,,,,,38.40,NAP,N,,,0,,,,,,
309663920,00010,30966392000010,O,,,,,,true,1,,,,,,32390,REJAUMONT,,,32341,,,,,,,,,,,,,,,,,,,1985-12-25,F,,,,,67.04,NAP,N,,,0,,,,,,
314156902,00012,31415690200012,O,1978-01-01,NN,,,2017-10-06T08:40:39,true,6,,,,,CADEILLON,32390,REJAUMONT,,,32341,,,,,,,,,,,,,,,,,,,2016-12-31,F,,,,,01.11Z,NAFRev2,N,0.8459913,43.4201504,0.7,poi.community_centre,Salle des Fêtes de Cadeillan Cadeillan,https://osm.org/node/2640832986,G,,
314156902,00020,31415690200020,O,1995-05-23,NN,,,2006-11-25T09:33:58,false,3,,,,,,32390,REJAUMONT,,,32341,,,,,,,,,,,,,,,,,,,2005-07-31,F,,,,,70.2C,NAFRev1,N,,,0,,,,,,
317799021,00041,31779902100041,O,1988-11-10,NN,,,2021-02-18T10:42:02,true,4,,,,,GAUJAC,32390,REJAUMONT,,,32341,,,,,,,,,,,,,,,,,,,2020-12-31,F,,,,,01.11Z,NAFRev2,N,0.1322798,44.4882775,0.89,poi,(Pont) Gaujac,https://osm.org/way/140244882,G,,
319680807,00017,31968080700017,O,,,,,,true,1,,,,,,32390,REJAUMONT,,,32341,,,,,,,,,,,,,,,,,,,1985-12-25,F,,,,,65.03,NAP,N,,,0,,,,,,
319974523,00080,31997452300080,O,2022-05-03,,,,2022-06-04T12:47:04,true,1,,95,,AV,DE MONTASTRUC,32390,REJAUMONT,,,32341,,,,,,,,,,,,,,,,,,,2022-05-03,A,,,,,85.51Z,NAFRev2,N,0.551801,43.814336,0.72,housenumber,95 Avenue de Montestruc 32390 Réjaumont,32341_0090_00095,G,95 AVENUE DE MONTESTRUC,
321484396,00015,32148439600015,O,1981-02-25,NN,,,2022-06-10T03:59:39,true,4,,,,,EMBIDOURE,32390,REJAUMONT,,,32341,,,,,,,,,,,,,,,,,,,2022-02-18,F,,,,,01.61Z,NAFRev2,N,0.539836,43.809298,0.92,street,Chemin d’Embidoure 32390 Réjaumont,32341_utezx7,G,CHEMIN D EMBIDOURE,
322504820,00018,32250482000018,O,1981-08-01,NN,,,2008-01-04T18:36:26,true,3,,,,,LASSALLE,32390,REJAUMONT,,,32341,,,,,,,,,,,,,,,,,,,2008-01-01,A,,,,,01.11Z,NAFRev2,N,0.545261,43.809369,0.4,locality,À Carrère Lassus 32390 Réjaumont,32341_B011,G,A CARRERE LASSUS,
334405164,00016,33440516400016,O,,NN,,,,true,1,,,,,,32390,REJAUMONT,,,32341,,,,,,,,,,,,,,,,,,,1988-11-30,F,,,,,65.06,NAP,N,,,0,,,,,,
337936900,00030,33793690000030,O,1998-02-01,NN,,,2019-10-04T10:42:57,false,4,,,,,FARJAC,32390,REJAUMONT,,,32341,,,,,,,,,,,,,,,,,,,2019-09-30,F,,,,,01.61Z,NAFRev2,N,3.3962523,44.4869488,0.76,poi.cliff,(Falaise) Barjac,https://osm.org/way/249760832,G,,
338696545,00015,33869654500015,O,,NN,,,,true,1,,,,,,32390,REJAUMONT,,,32341,,,,,,,,,,,,,,,,,,,1995-12-25,F,,,,,71.2A,NAF1993,N,,,0,,,,,,
344390380,00014,34439038000014,O,,NN,,,,true,1,,,,LD,LA BOURDETTE,32390,REJAUMONT,,,32341,,,,,,,,,,,,,,,,,,,1989-05-31,F,,,,,02.20,NAP,N,0.55028,43.814634,0.3,street,Place de la Bastide 32390 Réjaumont,32341_0025,G,PLACE DE LA BASTIDE,
344877345,00027,34487734500027,O,1990-10-01,NN,,,2008-01-04T22:33:33,true,3,,,,,,32390,REJAUMONT,,,32341,,,,,,,,,,,,,,,,,,,2008-01-01,A,,,,,90.03B,NAFRev2,N,,,0,,,,,,
352432215,00023,35243221500023,O,2009-12-21,,,,2012-11-09T00:42:50,true,2,LAURENSAN,,,,,32390,REJAUMONT,,,32341,,,,,,,,,,,,,,,,,,,2011-12-31,F,,,,,66.22Z,NAFRev2,N,0.580346,43.825155,0.92,street,Chemin de Laurensan 32390 Réjaumont,32341_0075,D,CHEMIN DE LAURENSAN,
353735129,00028,35373512900028,O,2012-01-05,,,,2017-12-14T19:50:27,true,2,,,,,LAURENSAN,32390,REJAUMONT,,,32341,,,,,,,,,,,,,,,,,,,2017-12-31,F,,,,,66.22Z,NAFRev2,N,0.580346,43.825155,0.92,street,Chemin de Laurensan 32390 Réjaumont,32341_0075,G,CHEMIN DE LAURENSAN,
378443204,00011,37844320400011,O,1990-06-01,NN,,,2008-11-08T00:34:01,true,5,,,,,,32390,REJAUMONT,,,32341,,,,,,,,,,,,,,,,,,,2004-09-30,F,,,,,51.8P,NAFRev1,O,,,0,,,,,,
380169870,00025,38016987000025,O,1999-10-08,,,,2006-11-25T11:30:00,true,1,,,,,LA SALASSE,32390,REJAUMONT,,,32341,,,,,,,,,,,,,,,,,,,1999-12-30,F,,,,,74.1J,NAF1993,N,0.545261,43.809369,0.34,locality,À Carrère Lassus 32390 Réjaumont,32341_B011,G,A CARRERE LASSUS,
381701069,00019,38170106900019,O,1991-05-01,NN,,,2016-03-24T08:40:22,false,4,,,,,,32390,REJAUMONT,,,32341,,,,,,,,,,,,,,,,,,,2015-12-31,F,,,,,01.11Z,NAFRev2,N,,,0,,,,,,
381701069,00027,38170106900027,O,2004-04-01,NN,,,2016-06-02T16:03:47,true,4,PIRROU,,,,,32390,REJAUMONT,,,32341,,,,,,,,,,,,,,,,,,,2015-12-31,F,,,,,46.23Z,NAFRev2,N,0.52422,43.807584,0.51,street,Chemin du Bourrou 32390 Réjaumont,32341_0030,D,CHEMIN DU BOURROU,
388940108,00011,38894010800011,O,1992-10-19,NN,,,2013-07-19T10:14:09,true,7,,,,LD,BOUSQUET,32390,REJAUMONT,,,32341,,,,,,,,,,,,,,,,,,,2013-06-30,F,,,,,68.20B,NAFRev2,N,0.52422,43.807584,0.31,street,Chemin du Bourrou 32390 Réjaumont,32341_0030,G,CHEMIN DU BOURROU,
390147171,00016,39014717100016,O,,,,,,true,1,,,,,,32390,REJAUMONT,,,32341,,,,,,,,,,,,,,,,,,,1994-06-30,F,,,,,91.3E,NAF1993,N,,,0,,,,,,
391673043,00017,39167304300017,O,1993-07-01,NN,,,2012-07-31T13:55:42,true,3,,,,DOM,,32390,REJAUMONT,,,32341,,,,,,,,,,,,,,,,,,,2006-02-28,F,,,,,01.1G,NAFRev1,N,4.9678284,46.8197453,0.88,poi.convenience,Dom's (Épicerie) Bey,https://osm.org/node/3661746613,G,,
393394200,00017,39339420000017,O,1994-01-03,NN,,,2021-02-23T11:19:08,true,3,,860,,CHE,DE LAURENSAN,32390,REJAUMONT,,,32341,,,,,,,,,,,,,,,,,,,2008-01-01,A,,,,,01.11Z,NAFRev2,N,0.590537,43.82133,0.85,housenumber,860 Chemin de Laurensan 32390 Réjaumont,32341_0075_00860,G,860 CHEMIN DE LAURENSAN,
393524509,00014,39352450900014,O,1993-10-01,NN,,,2008-09-10T03:51:00,true,4,,,,,,32390,REJAUMONT,,,32341,,,,,,,,,,,,,,,,,,,2008-08-28,F,,,,,68.20B,NAFRev2,N,,,0,,,,,,
394155378,00018,39415537800018,O,1992-07-01,NN,,,2008-01-04T18:00:52,true,3,LASSALLE,,,,,32390,REJAUMONT,,,32341,,,,,,,,,,,,,,,,,,,2008-01-01,A,,,,,68.20B,NAFRev2,N,0.545261,43.809369,0.4,locality,À Carrère Lassus 32390 Réjaumont,32341_B011,D,A CARRERE LASSUS,
396014557,00013,39601455700013,O,,,,,,true,1,,,,LD,GAUJAC,32390,REJAUMONT,,,32341,,,,,,,,,,,,,,,,,,,1988-12-31,F,,,,,60.07,NAP,N,0.1322798,44.4882775,0.89,poi,(Pont) Gaujac,https://osm.org/way/140244882,G,,
396111965,00010,39611196500010,O,,NN,,,,true,1,,,,,,32390,REJAUMONT,,,32341,,,,,,,,,,,,,,,,,,,1991-04-30,F,,,,,57.02,NAP,N,,,0,,,,,,
396911158,00014,39691115800014,O,,NN,,,,true,1,,,,,,32390,REJAUMONT,,,32341,,,,,,,,,,,,,,,,,,,1993-06-19,F,,,,,15.8C,NAF1993,N,,,0,,,,,,
400604815,00011,40060481500011,O,1995-03-01,NN,,,2022-04-14T03:38:02,true,4,,,,LD,FARJAC,32390,REJAUMONT,,,32341,,,,,,,,,,,,,,,,,,,2021-12-31,F,,,,,01.11Z,NAFRev2,N,3.3962523,44.4869488,0.76,poi.cliff,(Falaise) Barjac,https://osm.org/way/249760832,G,,
402150429,00015,40215042900015,O,1979-01-01,NN,,,2008-01-04T19:59:09,true,3,,,,,,32390,REJAUMONT,,,32341,,,,,,,,,,,,,,,,,,,2008-01-01,A,,,,,68.20B,NAFRev2,N,,,0,,,,,,
403317951,00016,40331795100016,O,,NN,,,,true,1,,,,,,32390,REJAUMONT,,,32341,,,,,,,,,,,,,,,,,,,1996-07-15,F,,,,,52.6E,NAF1993,N,,,0,,,,,,
403374473,00029,40337447300029,O,1999-10-08,,,,,true,1,,,,LD,LA SALASSE,32390,REJAUMONT,,,32341,,,,,,,,,,,,,,,,,,,1999-12-30,F,,,,,60.2L,NAF1993,N,0.545261,43.809369,0.34,locality,À Carrère Lassus 32390 Réjaumont,32341_B011,G,A CARRERE LASSUS,
404151292,00012,40415129200012,O,1996-02-01,NN,,,2019-12-20T13:12:00,false,3,,,,,FARJAC,32390,REJAUMONT,,,32341,,,,,,,,,,,,,,,,,,,2008-01-01,A,,,,,68.20B,NAFRev2,N,3.3962523,44.4869488,0.76,poi.cliff,(Falaise) Barjac,https://osm.org/way/249760832,G,,
404151292,00020,40415129200020,O,2020-01-01,,,,2019-12-20T13:19:17,true,1,,1605,,RTE,DE PRECHAC,32390,REJAUMONT,,,32341,,,,,,,,,,,,,,,,,,,2020-01-01,A,,,,,35.11Z,NAFRev2,N,0.56297,43.802929,0.85,housenumber,1605 Route de Préchac 32390 Réjaumont,32341_0110_01605,G,1605 ROUTE DE PRECHAC,
408519957,00018,40851995700018,O,1986-09-24,NN,,,2018-09-28T11:26:29,true,4,,,,,AU BOURROU,32390,REJAUMONT,,,32341,,,,,,,,,,,,,,,,,,,2016-12-31,F,,,,,01.11Z,NAFRev2,N,0.52422,43.807584,0.76,street,Chemin du Bourrou 32390 Réjaumont,32341_0030,G,CHEMIN DU BOURROU,
409175668,00014,40917566800014,O,1996-10-03,NN,,,2008-11-08T01:21:19,false,4,,,,,AU VILLAGE,32390,REJAUMONT,,,32341,,,,,,,,,,,,,,,,,,,2000-08-01,F,,,,,55.5D,NAF1993,N,-1.6854522,47.8876296,0.9,poi.cafe,Au Village (Café) Poligné,https://osm.org/node/4456269839,G,,
412222879,00014,41222287900014,O,1989-01-01,NN,,,2008-01-04T22:12:27,true,3,,,,,,32390,REJAUMONT,,,32341,,,,,,,,,,,,,,,,,,,2008-01-01,A,,,,,01.11Z,NAFRev2,N,,,0,,,,,,
413419896,00019,41341989600019,O,1995-07-26,NN,,,2008-01-04T22:33:11,true,3,,,,,,32390,REJAUMONT,,,32341,,,,,,,,,,,,,,,,,,,2008-01-01,A,,,,,94.99Z,NAFRev2,N,,,0,,,,,,
417828886,00016,41782888600016,O,1978-01-01,NN,,,2008-01-04T23:11:34,true,3,,,,,AU LUC,32390,REJAUMONT,,,32341,,,,,,,,,,,,,,,,,,,2007-12-15,F,,,,,01.1A,NAFRev1,N,3.9017788,44.6529586,0.88,poi.track,Chemin de Labrot au Cellier-du-Luc Saint-Étienne-de-Lugdarès,https://osm.org/way/81844757,G,,
417831989,00013,41783198900013,O,1970-01-01,NN,,,2013-05-27T03:06:11,true,4,,,,,MARTISSENS,32390,REJAUMONT,,,32341,,,,,,,,,,,,,,,,,,,2012-12-31,F,,,,,01.11Z,NAFRev2,N,0.564988,43.820898,0.92,street,Chemin de Martissens 32390 Réjaumont,32341_0085,G,CHEMIN DE MARTISSENS,
417835337,00011,41783533700011,O,1973-01-01,NN,,,2008-01-04T23:11:39,true,3,,,,,,32390,REJAUMONT,,,32341,,,,,,,,,,,,,,,,,,,2008-01-01,A,,,,,01.11Z,NAFRev2,N,,,0,,,,,,
417835402,00013,41783540200013,O,1981-01-01,NN,,,2014-01-16T03:33:50,true,5,,,,,,32390,REJAUMONT,,,32341,,,,,,,,,,,,,,,,,,,2013-12-31,F,,,,,68.20B,NAFRev2,N,,,0,,,,,,
417837291,00018,41783729100018,O,1975-01-01,NN,,,2015-02-19T19:32:32,true,4,,,,,A CARRERE LABAT,32390,REJAUMONT,,,32341,,,,,,,,,,,,,,,,,,,2014-12-31,F,,,,,01.11Z,NAFRev2,N,0.55202,43.815777,0.93,locality,À Carrère Labat 32390 Réjaumont,32341_B010,G,A CARRERE LABAT,
417839867,00013,41783986700013,O,1976-01-01,NN,,,2008-06-05T20:23:06,true,4,,,,,A LAURENSAN,32390,REJAUMONT,,,32341,,,,,,,,,,,,,,,,,,,2008-01-01,F,,,,,01.11Z,NAFRev2,N,0.580346,43.825155,0.77,street,Chemin de Laurensan 32390 Réjaumont,32341_0075,G,CHEMIN DE LAURENSAN,
417842010,00015,41784201000015,O,1978-01-01,NN,,,2008-01-04T23:11:43,true,3,,,,,A EN CANET,32390,REJAUMONT,,,32341,,,,,,,,,,,,,,,,,,,2005-12-31,F,,,,,01.3Z,NAFRev1,N,0.524669,43.819849,0.93,locality,À En Canet 32390 Réjaumont,32341_B009,G,A EN CANET,
417850567,00013,41785056700013,O,1984-01-01,NN,,,2017-12-14T03:56:02,true,6,,,,,,32390,REJAUMONT,,,32341,,,,,,,,,,,,,,,,,,,2018-01-01,A,,,,,68.20B,NAFRev2,N,,,0,,,,,,
417850567,00021,41785056700021,O,1999-07-12,,,,,false,3,,,,,,32390,REJAUMONT,,,32341,,,,,,,,,,,,,,,,,,,2002-12-31,F,,,,,67.2Z,NAF1993,N,,,0,,,,,,
417857869,00016,41785786900016,O,1988-01-01,NN,,,2014-07-10T19:34:36,true,3,,,,,A FARJAC,32390,REJAUMONT,,,32341,,,,,,,,,,,,,,,,,,,2008-01-01,A,,,,,01.11Z,NAFRev2,N,,,0,,,,,,
417859600,00013,41785960000013,O,1988-10-01,NN,,,2008-01-04T23:11:55,true,3,,,,,MOULIS,32390,REJAUMONT,,,32341,,,,,,,,,,,,,,,,,,,2008-01-01,A,,,,,01.11Z,NAFRev2,N,0.537422,43.805943,0.64,street,Chemin du Moulin 32390 Réjaumont,32341_0095,G,CHEMIN DU MOULIN,
417859816,00015,41785981600015,O,1988-10-01,NN,,,2008-01-04T23:11:55,true,3,,,,,LA SALASSE,32390,REJAUMONT,,,32341,,,,,,,,,,,,,,,,,,,2008-01-01,A,,,,,01.11Z,NAFRev2,N,0.545261,43.809369,0.34,locality,À Carrère Lassus 32390 Réjaumont,32341_B011,G,A CARRERE LASSUS,
417863008,00013,41786300800013,O,1990-01-01,NN,,,,true,1,,,,,AU BOURROU,32390,REJAUMONT,,,32341,,,,,,,,,,,,,,,,,,,2002-10-12,F,,,,,01.1A,NAF1993,N,0.52422,43.807584,0.76,street,Chemin du Bourrou 32390 Réjaumont,32341_0030,G,CHEMIN DU BOURROU,
417936531,00017,41793653100017,O,1967-12-01,,,,,true,1,,,,,,32390,REJAUMONT,,,32341,,,,,,,,,,,,,,,,,,,2000-10-09,F,,,,,01.1A,NAF1993,N,,,0,,,,,,
418973152,00014,41897315200014,O,1971-01-01,NN,,,2008-07-18T08:58:34,true,4,,,,,A PETRICOU,32390,REJAUMONT,,,32341,,,,,,,,,,,,,,,,,,,2008-01-01,F,,,,,01.11Z,NAFRev2,N,,,0,,,,,,
418983201,00025,41898320100025,O,2005-01-01,,,,2008-01-04T23:29:24,true,2,A BARTHE,,,,,32390,REJAUMONT,,,32341,,,,,,,,,,,,,,,,,,,2008-01-01,A,,,,,01.11Z,NAFRev2,N,0.56755,43.828837,0.71,street,Chemin de Barthe 32390 Réjaumont,32341_0020,D,CHEMIN DE BARTHE,
418991972,00013,41899197200013,O,1994-02-27,NN,,,2008-01-04T23:29:28,true,3,,,,,GUILLAUMETTE,32390,REJAUMONT,,,32341,,,,,,,,,,,,,,,,,,,2008-01-01,A,,,,,01.11Z,NAFRev2,N,-1.0924215,45.989011,0.89,poi.chalet,La Guillaumette (Chalet) Fouras,https://osm.org/node/4750580137,G,,
421230103,00010,42123010300010,O,1998-11-28,NN,,,2015-11-30T11:55:28,false,4,,,,,,32390,REJAUMONT,,,32341,,,,,,,,,,,,,,,,,,,2015-10-26,F,,,,,68.20A,NAFRev2,N,,,0,,,,,,
421909367,00011,42190936700011,O,1999-01-04,01,2019,,2021-10-27T08:03:04,true,5,,,,LD,EMBIDOURE,32390,REJAUMONT,,,32341,,,,,,,,,,,,,,,,,,,2012-07-05,A,,,,,70.10Z,NAFRev2,O,0.539836,43.809298,0.92,street,Chemin d’Embidoure 32390 Réjaumont,32341_utezx7,G,CHEMIN D EMBIDOURE,
428851745,00011,42885174500011,O,1999-11-01,NN,,,2016-04-26T02:07:26,true,6,,,,,AU VILLAGE,32390,REJAUMONT,,,32341,,,,,,,,,,,,,,,,,,,2008-01-01,A,,,,,01.11Z,NAFRev2,N,-1.6854522,47.8876296,0.9,poi.cafe,Au Village (Café) Poligné,https://osm.org/node/4456269839,G,,
429117393,00018,42911739300018,O,1992-01-01,NN,,,2013-08-23T19:27:58,true,4,,,,LD,LA HOURCATERRE,32390,REJAUMONT,,,32341,,,,,,,,,,,,,,,,,,,2013-08-11,F,,,,,01.11Z,NAFRev2,N,,,0,,,,,,
429606569,00029,42960656900029,O,2004-01-01,NN,,,2012-11-06T11:39:58,true,4,,,,,LA FORET,32390,REJAUMONT,,,32341,,,,,,,,,,,,,,,,,,,2011-12-31,F,,,,,88.99B,NAFRev2,N,0.55028,43.814634,0.31,street,Place de la Bastide 32390 Réjaumont,32341_0025,G,PLACE DE LA BASTIDE,
432659621,00010,43265962100010,O,2000-08-28,NN,,,,true,1,,,,LD,LARROQUE,32390,REJAUMONT,,,32341,,,,,,,,,,,,,,,,,,,2001-03-05,F,,,,,74.8F,NAF1993,N,0.527227,43.820041,0.91,street,Chemin de Larroque 32390 Réjaumont,32341_0065,G,CHEMIN DE LARROQUE,
433227501,00015,43322750100015,O,2000-10-14,NN,,,,true,3,,,,,MAIRIE,32390,REJAUMONT,,,32341,,,,,,,,,,,,,,,,,,,2003-12-31,F,,,,,91.3E,NAFRev1,N,0.51466,43.825979,0.37,street,Lieu-Dit Maison Neuve 32390 Réjaumont,32341_ei138q,G,LIEU DIT MAISON NEUVE,
435078555,00016,43507855500016,O,2001-03-01,01,2019,,2021-10-27T08:15:45,true,3,LASSALLE,,,,,32390,REJAUMONT,,,32341,,,,,,,,,,,,,,,,,,,2008-01-01,A,,,,,01.11Z,NAFRev2,O,0.545261,43.809369,0.4,locality,À Carrère Lassus 32390 Réjaumont,32341_B011,D,A CARRERE LASSUS,
438070971,00033,43807097100033,O,2017-04-13,,,,2021-02-23T13:18:23,true,1,,,,DOM,DU BOURDIEU,32390,REJAUMONT,,,32341,,,,,,,,,,,,,,,,,,,2017-04-13,A,,,,,68.20B,NAFRev2,N,-0.6490275,44.8285825,0.79,poi.3,Domaine du Bourdieu (Patrimoine national) Mérignac,https://osm.org/way/164308438,G,,
439079963,00013,43907996300013,O,2001-11-01,NN,,,,true,1,,,,,EN CANET,32390,REJAUMONT,,,32341,,,,,,,,,,,,,,,,,,,2002-04-02,F,,,,,01.2G,NAF1993,N,0.524669,43.819849,0.92,locality,À En Canet 32390 Réjaumont,32341_B009,G,A EN CANET,
443254933,00015,44325493300015,O,2002-09-01,NN,,,2019-07-11T09:24:23,true,5,,,,LD,LAS TAPIES,32390,REJAUMONT,,,32341,,,,,,,,,,,,,,,,,,,2019-05-01,A,,,,,68.31Z,NAFRev2,N,0.506582,43.8156,0.66,street,Lieu-Dit Lastapies 32390 Réjaumont,32341_6hs7pj,G,LIEU DIT LASTAPIES,
443843933,00013,44384393300013,O,2002-10-12,NN,,,2017-12-15T04:34:01,true,4,,,,,LE BOURROU,32390,REJAUMONT,,,32341,,,,,,,,,,,,,,,,,,,2017-12-01,F,,,,,01.11Z,NAFRev2,N,0.52422,43.807584,0.68,street,Chemin du Bourrou 32390 Réjaumont,32341_0030,G,CHEMIN DU BOURROU,
444673289,00013,44467328900013,O,2003-01-01,NN,,,2013-02-04T19:42:46,true,4,,,,,LAURENSAN,32390,REJAUMONT,,,32341,,,,,,,,,,,,,,,,,,,2013-01-31,F,,,,,01.11Z,NAFRev2,N,0.580346,43.825155,0.92,street,Chemin de Laurensan 32390 Réjaumont,32341_0075,G,CHEMIN DE LAURENSAN,
444888549,00011,44488854900011,O,2003-01-01,01,2019,,2021-10-27T08:26:16,true,3,,196,,RTE,D'AUCH,32390,REJAUMONT,,,32341,,,,,,,,,,,,,,,,,,,2008-01-01,A,,,,,01.47Z,NAFRev2,N,0.549109,43.810985,0.81,housenumber,196 Route d’Auch 32390 Réjaumont,32341_0010_00196,G,196 ROUTE D AUCH,
451475859,00018,45147585900018,O,2004-01-15,NN,,,2006-11-25T18:54:57,true,3,,,,,CADEILLAN,32390,REJAUMONT,,,32341,,,,,,,,,,,,,,,,,,,2005-04-08,F,,,,,52.4J,NAFRev1,N,0.8477143,43.4207846,0.9,poi.park,(Parc) Cadeillan,https://osm.org/way/258754414,G,,
452944168,00023,45294416800023,O,2016-03-01,,,,2018-10-10T13:10:05,false,2,,,,LD,BEAUREGARD,32390,REJAUMONT,,,32341,,,,,,,,,,,,,,,,,,,2018-05-15,F,,,,,56.21Z,NAFRev2,N,2.44911,48.7282215,0.9,poi.park,Parc Beauregard Villeneuve-Saint-Georges,https://osm.org/way/256864200,G,,
453891897,00010,45389189700010,O,2004-07-01,NN,,,2015-05-14T05:26:00,true,4,,,,LD,BOUSQUET,32390,REJAUMONT,,,32341,,,,,,,,,,,,,,,,,,,2013-12-31,F,,,,,43.99C,NAFRev2,O,0.52422,43.807584,0.31,street,Chemin du Bourrou 32390 Réjaumont,32341_0030,G,CHEMIN DU BOURROU,
453963142,00014,45396314200014,O,2004-06-01,,,,2019-11-09T03:37:59,true,7,LAURENSAN,,,LD,LAURENSAN,32390,REJAUMONT,,,32341,,,,,,,,,,,,,,,,,,,2019-07-01,A,,,,,68.20B,NAFRev2,N,0.580346,43.825155,0.92,street,Chemin de Laurensan 32390 Réjaumont,32341_0075,G,CHEMIN DE LAURENSAN,
478828809,00010,47882880900010,O,2004-09-13,NN,,,2018-05-24T08:34:14,true,3,,,,,,32390,REJAUMONT,,,32341,,,,,,,,,,,,,,,,,,,2008-01-01,A,,,,,68.20B,NAFRev2,N,,,0,,,,,,
478899131,00013,47889913100013,O,2004-10-01,03,2019,3312ZA,2021-10-27T08:13:46,true,3,,23,,RUE,PRINCIPALE,32390,REJAUMONT,,,32341,,,,,,,,,,,,,,,,,,,2008-01-01,A,,,,,46.61Z,NAFRev2,O,0.551338,43.81576,0.94,housenumber,23 Rue Principale 32390 Réjaumont,32341_0115_00023,G,23 RUE PRINCIPALE,
479543027,00011,47954302700011,O,2004-11-01,01,2019,4312BA,2021-10-27T08:14:44,true,5,,565,,RTE,DE CEZAN,32390,REJAUMONT,,,32341,,,,,,,,,,,,,,,,,,,2014-08-01,A,,,,,43.12A,NAFRev2,O,0.543485,43.814336,0.83,housenumber,565 Route de Cézan 32390 Réjaumont,32341_0035_00565,G,565 ROUTE DE CEZAN,
484411665,00017,48441166500017,O,2005-08-01,NN,,,2011-04-23T14:39:21,false,5,,,,,EMBIDOURE,32390,REJAUMONT,,,32341,,,,,,,,,,,,,,,,,,,2009-08-01,F,,,,,47.81Z,NAFRev2,O,0.539836,43.809298,0.92,street,Chemin d’Embidoure 32390 Réjaumont,32341_utezx7,G,CHEMIN D EMBIDOURE,
485188601,00028,48518860100028,O,2013-09-15,,,,2021-02-23T13:50:58,true,1,,,,,LIEU DIT LE BOURDIEU,32390,REJAUMONT,,,32341,,,,,,,,,,,,,,,,,,,2013-09-15,A,,,,,96.04Z,NAFRev2,N,0.516385,43.821397,0.38,street,Lieu-Dit le Lac 32390 Réjaumont,32341_1ba4iq,G,LIEU DIT LE LAC,
488621855,00011,48862185500011,O,2006-02-01,,,4321AB,2015-09-09T03:16:05,true,3,,,,,LIEU DIT LARROQUE,32390,REJAUMONT,,,32341,,,,,,,,,,,,,,,,,,,2015-06-30,F,,,,,43.21A,NAFRev2,N,0.527227,43.820041,0.91,street,Chemin de Larroque 32390 Réjaumont,32341_0065,G,CHEMIN DE LARROQUE,
488877887,00015,48887788700015,O,2006-02-01,,,,2013-05-07T09:55:05,true,3,CADEILLAN,,,,,32390,REJAUMONT,,,32341,,,,,,,,,,,,,,,,,,,2013-01-01,F,,,,,01.11Z,NAFRev2,N,,,0,,,,,,
489324657,00019,48932465700019,O,2006-02-11,,,,2008-01-05T22:03:42,true,2,,,,LD,BOURROU,32390,REJAUMONT,,,32341,,,,,,,,,,,,,,,,,,,2008-01-01,A,,,,,68.20B,NAFRev2,N,0.52422,43.807584,0.91,street,Chemin du Bourrou 32390 Réjaumont,32341_0030,G,CHEMIN DU BOURROU,
490835535,00017,49083553500017,O,2006-03-01,02,2019,,2021-10-27T08:28:39,true,2,DOMAINE D'EMBIDOURE,,,,,32390,REJAUMONT,,,32341,,,,,,,,,,,,,,,,,,,2008-01-01,A,,,,,01.21Z,NAFRev2,O,0.539836,43.809298,0.58,street,Chemin d’Embidoure 32390 Réjaumont,32341_utezx7,D,CHEMIN D EMBIDOURE,
491930681,00011,49193068100011,O,2006-09-01,,,,2021-07-08T19:39:00,false,3,,,,,CADEILLON,32390,REJAUMONT,,,32341,,,,,,,,,,,,,,,,,,,2021-04-16,F,,,,,68.20B,NAFRev2,N,0.8459913,43.4201504,0.7,poi.community_centre,Salle des Fêtes de Cadeillan Cadeillan,https://osm.org/node/2640832986,G,,
495050528,00027,49505052800027,O,2008-04-14,,,,2021-02-08T20:03:53,false,4,,,,LD,LA GARENNE,32390,REJAUMONT,,,32341,,,,,,,,,,,,,,,,,,,2020-10-13,F,,,,EURODIS,47.89Z,NAFRev2,N,0.549541,43.813623,0.35,street,Rue de l’Ancienne Ecole 32390 Réjaumont,32341_0005,G,RUE DE L ANCIENNE ECOLE,
498937713,00010,49893771300010,O,2007-07-06,,,,2008-01-05T01:07:28,true,2,,,,,EMBIDOURE,32390,REJAUMONT,,,32341,,,,,,,,,,,,,,,,,,,2008-01-01,A,,,,,68.20B,NAFRev2,N,0.539836,43.809298,0.92,street,Chemin d’Embidoure 32390 Réjaumont,32341_utezx7,G,CHEMIN D EMBIDOURE,
507479244,00026,50747924400026,O,2013-03-22,,,,2020-04-30T09:40:34,false,2,,,,,LIEU DIT BOURROU,32390,REJAUMONT,,,32341,,,,,,,,,,,,,,,,,,,2020-02-14,F,,,,,68.32A,NAFRev2,N,0.52422,43.807584,0.91,street,Chemin du Bourrou 32390 Réjaumont,32341_0030,G,CHEMIN DU BOURROU,
509408068,00013,50940806800013,O,2008-12-11,,,3102ZZ,2014-10-23T00:16:33,true,1,,,,,AU VILLAGE,32390,REJAUMONT,,,32341,,,,,,,,,,,,,,,,,,,2008-12-11,A,,,,,31.02Z,NAFRev2,N,-1.6854522,47.8876296,0.9,poi.cafe,Au Village (Café) Poligné,https://osm.org/node/4456269839,G,,
512069766,00016,51206976600016,O,2009-05-01,,,,2016-11-27T03:26:21,true,2,,,,,LIEU DIT CARRERE LABAT,32390,REJAUMONT,,,32341,,,,,,,,,,,,,,,,,,,2013-10-23,F,,,,,43.91A,NAFRev2,N,0.55202,43.815777,0.93,locality,À Carrère Labat 32390 Réjaumont,32341_B010,G,A CARRERE LABAT,
518949466,00024,51894946600024,O,2016-01-29,,,,2022-02-02T04:09:58,false,2,,,,,PIRROU,32390,REJAUMONT,,,32341,,,,,,,,,,,,,,,,,,,2018-12-31,F,,,,,01.11Z,NAFRev2,N,0.52422,43.807584,0.51,street,Chemin du Bourrou 32390 Réjaumont,32341_0030,G,CHEMIN DU BOURROU,
518992433,00012,51899243300012,O,2009-12-18,,,,2017-07-06T11:27:20,false,2,,,,,CADEILLON,32390,REJAUMONT,,,32341,,,,,,,,,,,,,,,,,,,2017-06-15,F,,,,,68.20B,NAFRev2,N,0.8459913,43.4201504,0.7,poi.community_centre,Salle des Fêtes de Cadeillan Cadeillan,https://osm.org/node/2640832986,G,,
522014802,00022,52201480200022,O,2017-02-25,,,,2021-02-23T15:36:53,true,1,,,,LD,PITRE,32390,REJAUMONT,,,32341,,,,,,,,,,,,,,,,,,,2017-02-25,A,,,,,43.33Z,NAFRev2,N,1.2401637,49.3217649,0.88,poi.river,(Rivière) Pîtres,https://osm.org/way/204709216,G,,
523894624,00015,52389462400015,O,2010-07-12,,,,2012-11-10T02:20:50,false,2,,,,,CARRERE LABAT,32390,REJAUMONT,,,32341,,,,,,,,,,,,,,,,,,,2011-09-27,F,,,,,32.13Z,NAFRev2,N,0.55202,43.815777,0.93,locality,À Carrère Labat 32390 Réjaumont,32341_B010,G,A CARRERE LABAT,