siren,nic,siret,statutDiffusionEtablissement,dateCreationEtablissement,trancheEffectifsEtablissement,anneeEffectifsEtablissement,activitePrincipaleRegistreMetiersEtablissement,dateDernierTraitementEtablissement,etablissementSiege,nombrePeriodesEtablissement,complementAdresseEtablissement,numeroVoieEtablissement,indiceRepetitionEtablissement,typeVoieEtablissement,libelleVoieEtablissement,codePostalEtablissement,libelleCommuneEtablissement,libelleCommuneEtrangerEtablissement,distributionSpecialeEtablissement,codeCommuneEtablissement,codeCedexEtablissement,libelleCedexEtablissement,codePaysEtrangerEtablissement,libellePaysEtrangerEtablissement,complementAdresse2Etablissement,numeroVoie2Etablissement,indiceRepetition2Etablissement,typeVoie2Etablissement,libelleVoie2Etablissement,codePostal2Etablissement,libelleCommune2Etablissement,libelleCommuneEtranger2Etablissement,distributionSpeciale2Etablissement,codeCommune2Etablissement,codeCedex2Etablissement,libelleCedex2Etablissement,codePaysEtranger2Etablissement,libellePaysEtranger2Etablissement,dateDebut,etatAdministratifEtablissement,enseigne1Etablissement,enseigne2Etablissement,enseigne3Etablissement,denominationUsuelleEtablissement,activitePrincipaleEtablissement,nomenclatureActivitePrincipaleEtablissement,caractereEmployeurEtablissement,longitude,latitude,geo_score,geo_type,geo_adresse,geo_id,geo_ligne,geo_l4,geo_l5
213301302,00013,21330130200013,O,1983-03-01,11,2019,,2021-10-27T08:07:53,true,4,,,,,,33210,COIMERES,,,33130,,,,,,,,,,,,,,,,,,,2008-01-01,A,MAIRIE,,,,84.11Z,NAFRev2,O,,,0,,,,,,
213301302,00021,21330130200021,O,1983-12-21,03,2019,,2021-10-27T08:07:53,false,3,,23,,,LE BOURG,33210,COIMERES,,,33130,,,,,,,,,,,,,,,,,,,2008-01-01,A,ECOLE PRIMAIRE PUBLIQUE,,,,85.20Z,NAFRev2,N,-0.210691,44.494538,0.33,housenumber,23 Lotissement Duthil 33210 Coimères,33130_wqi4jf_00023,G,23 LOTISSEMENT DUTHIL,
213301302,00039,21330130200039,O,1996-12-25,NN,,,2008-04-30T10:52:57,false,3,MAIRIE,,,,,33210,COIMERES,,,33130,,,,,,,,,,,,,,,,,,,2008-01-01,F,SCE ASSAINISSEMNET,,,,37.00Z,NAFRev2,N,-0.218404,44.510267,0.52,street,Lotissement les Jardins de la Clairière 33210 Coimères,33130_A035,D,LOT LES JARDINS DE LA CLAIRIERE,
213301302,00047,21330130200047,O,1997-01-01,NN,,,2008-01-04T18:31:11,false,3,MAIRIE,,,,,33210,COIMERES,,,33130,,,,,,,,,,,,,,,,,,,2008-01-01,A,LOTISSEMENT DE COIMERES,,,,42.99Z,NAFRev2,N,-0.218404,44.510267,0.52,street,Lotissement les Jardins de la Clairière 33210 Coimères,33130_A035,D,LOT LES JARDINS DE LA CLAIRIERE,
213301302,00054,21330130200054,O,1999-04-25,NN,,,2006-10-26T23:40:46,false,3,MAIRIE,,,,,33210,COIMERES,,,33130,,,,,,,,,,,,,,,,,,,2005-12-31,F,LOGEMENTS SOCIAUX,,,,70.1C,NAFRev1,N,-0.218404,44.510267,0.52,street,Lotissement les Jardins de la Clairière 33210 Coimères,33130_A035,D,LOT LES JARDINS DE LA CLAIRIERE,
213301302,00062,21330130200062,O,2005-05-03,,,,2008-04-30T10:54:08,false,3,MAIRIE,,,,BOURG,33210,COIMERES,,,33130,,,,,,,,,,,,,,,,,,,2008-01-01,F,AMENAGEMENT LOGEMENT CERCLE 2,,,,42.99Z,NAFRev2,N,-0.237571,44.498986,0.59,street,La Bourdette 33210 Coimères,33130_bmycas,G,LA BOURDETTE,
253302889,00014,25330288900014,O,1983-03-01,NN,,,2006-10-26T23:43:40,true,3,,,,,,33210,COIMERES,,,33130,,,,,,,,,,,,,,,,,,,2004-12-25,F,,,,,75.1C,NAFRev1,N,,,0,,,,,,
253303374,00016,25330337400016,O,1985-01-22,03,2019,,2021-10-27T08:12:07,true,4,MAIRIE,24,,,LE BOURG,33210,COIMERES,,,33130,,,,,,,,,,,,,,,,,,,2008-01-01,A,,,,,84.12Z,NAFRev2,O,-0.237571,44.498986,0.41,street,La Bourdette 33210 Coimères,33130_bmycas,G,LA BOURDETTE,
253303374,00024,25330337400024,O,1998-05-26,,,,2021-02-23T10:34:43,false,1,MAIRIE,24,,,LE BOURG,33210,COIMERES,,,33130,,,,,,,,,,,,,,,,,,,1998-05-26,A,REGIE DE TRANSPORT,,,,49.39A,NAFRev2,N,-0.237571,44.498986,0.41,street,La Bourdette 33210 Coimères,33130_bmycas,G,LA BOURDETTE,
263301285,00015,26330128500015,O,1983-03-01,NN,,,2010-06-26T03:08:33,true,3,,,,,,33210,COIMERES,,,33130,,,,,,,,,,,,,,,,,,,2008-01-01,A,CCAS,,,,88.99B,NAFRev2,N,,,0,,,,,,
302298237,00033,30229823700033,O,,NN,,,,true,1,,,,LD,LA MAISONNETTE,33210,COIMERES,,,33130,,,,,,,,,,,,,,,,,,,1996-09-30,F,,,,,50.2Z,NAF1993,N,-0.237571,44.498986,0.38,street,La Bourdette 33210 Coimères,33130_bmycas,G,LA BOURDETTE,
306355363,00020,30635536300020,O,,NN,,,,true,1,,,,,,33210,COIMERES,,,33130,,,,,,,,,,,,,,,,,,,,F,,,,,67.01,NAP,N,,,0,,,,,,
308808492,00018,30880849200018,O,1976-01-01,NN,,,2011-01-13T05:53:34,true,4,,,,,PETIT GALAND,33210,COIMERES,,,33130,,,,,,,,,,,,,,,,,,,2010-12-31,F,,,,,68.31Z,NAFRev2,N,-0.193409,44.513953,0.44,street,Petit Labraize 33210 Coimères,33130_B081,G,PETIT LABRAIZE,
309301380,00056,30930138000056,O,2011-05-31,,,8121ZZ,2016-01-14T09:41:33,false,2,CHEZ PAULETTE,,,RTE,DE BAZAS,33210,COIMERES,,,33130,,,,,,,,,,,,,,,,,,,2014-01-16,F,,,,,81.21Z,NAFRev2,N,-0.22389,44.511684,0.31,street,Lotissement le Clos de Juliette 33210 Coimères,33130_mqi2ve,G,LOTISSEMENT LE CLOS DE JULIETTE,
310849740,00017,31084974000017,O,1900-01-01,NN,,,2006-11-25T09:27:18,true,3,,,,,,33210,COIMERES,,,33130,,,,,,,,,,,,,,,,,,,2002-12-31,F,,,,,70.2C,NAF1993,N,,,0,,,,,,
312382005,00014,31238200500014,O,,,,,,true,1,,,,LD,MOUTON,33210,COIMERES,,,33130,,,,,,,,,,,,,,,,,,,1990-12-25,F,,,,,81.11,NAP,N,-0.229431,44.513627,0.94,street,A Mouton 33210 Coimères,33130_feka6u,G,A MOUTON,
316953918,00018,31695391800018,O,1900-01-01,NN,,,2008-11-07T00:32:31,true,4,,,,LD,LE CHALOUPIN,33210,COIMERES,,,33130,,,,,,,,,,,,,,,,,,,2005-12-31,F,,,,,74.7Z,NAFRev1,O,-0.210381,44.489021,0.75,street,Chaloupin 33210 Coimères,33130_dy0rsm,G,CHALOUPIN,
318534443,00037,31853444300037,O,,NN,,,,true,1,,,,LD,DUTHIL,33210,COIMERES,,,33130,,,,,,,,,,,,,,,,,,,1993-09-30,F,,,,,74.6Z,NAF1993,N,-0.211091,44.494554,0.92,street,Lotissement Duthil 33210 Coimères,33130_wqi4jf,G,LOTISSEMENT DUTHIL,
321596439,00018,32159643900018,O,,,,,,true,1,,,,,AU BOURG,33210,COIMERES,,,33130,,,,,,,,,,,,,,,,,,,1984-12-25,F,,,,,55.40,NAP,N,-0.237571,44.498986,0.41,street,La Bourdette 33210 Coimères,33130_bmycas,G,LA BOURDETTE,
326702644,00039,32670264400039,O,2016-07-01,,,,2021-02-23T10:48:37,true,1,,1,,,LACOSTE,33210,COIMERES,,,33130,,,,,,,,,,,,,,,,,,,2016-07-01,A,,,,,71.12B,NAFRev2,N,-0.207318,44.499088,0.92,street,Allée Lacoste 33210 Coimères,33130_0028,G,ALLEE LACOSTE,
328443668,00012,32844366800012,O,1983-10-01,NN,,,2013-05-18T03:23:39,true,5,,,,LD,CALLES,33210,COIMERES,,,33130,,,,,,,,,,,,,,,,,,,2011-11-10,F,,,,,55.10Z,NAFRev2,O,-0.229532,44.481909,0.52,street,Cabaille 33210 Coimères,33130_xpw6lj,G,CABAILLE,
328443676,00015,32844367600015,O,,,,,,true,1,,,,LD,CALLES,33210,COIMERES,,,33130,,,,,,,,,,,,,,,,,,,1987-06-30,F,,,,,67.08,NAP,N,-0.229532,44.481909,0.52,street,Cabaille 33210 Coimères,33130_xpw6lj,G,CABAILLE,
328695523,00014,32869552300014,O,,,,,,true,1,,,,LD,CALLES,33210,COIMERES,,,33130,,,,,,,,,,,,,,,,,,,1986-02-21,F,,,,,55.1A,NAF1993,N,-0.229532,44.481909,0.52,street,Cabaille 33210 Coimères,33130_xpw6lj,G,CABAILLE,
329028500,00018,32902850000018,O,,,,,,true,1,,,,LD,LA HERRERE,33210,COIMERES,,,33130,,,,,,,,,,,,,,,,,,,1984-12-25,F,,,,,55.73,NAP,N,-0.200391,44.509613,0.67,street,Herrère du Haut Nord 33210 Coimères,33130_B037,G,HERRERE DU HAUT NORD,
329029193,00011,32902919300011,O,,,,,,true,1,,,,LD,LA HERRERE,33210,COIMERES,,,33130,,,,,,,,,,,,,,,,,,,1984-12-25,F,,,,,55.73,NAP,N,-0.200391,44.509613,0.67,street,Herrère du Haut Nord 33210 Coimères,33130_B037,G,HERRERE DU HAUT NORD,
329371330,00021,32937133000021,O,1997-08-02,NN,,,2022-05-02T15:43:19,true,4,,1070,,RUE,DU SABLA,33210,COIMERES,,,33130,,,,,,,,,,,,,,,,,,,2008-01-01,A,,,,,68.20A,NAFRev2,N,-0.21012,44.505086,0.95,housenumber,1070 Rue du Sabla 33210 Coimères,33130_0070_01070,G,1070 RUE DU SABLA,
330214487,00028,33021448700028,O,1989-04-14,,,,,false,4,,,,LD,LE POULET,33210,COIMERES,,,33130,,,,,,,,,,,,,,,,,,,1992-12-25,F,,,,,28.5D,NAF1993,N,-0.211349,44.488171,0.46,street,Couchoulet 33210 Coimères,33130_gvu76e,G,COUCHOULET,
331536631,00012,33153663100012,O,1985-01-01,NN,,,2017-07-18T17:52:47,true,4,,,,,,33210,COIMERES,,,33130,,,,,,,,,,,,,,,,,,,2011-12-31,F,,,,,01.47Z,NAFRev2,N,,,0,,,,,,
331557785,00051,33155778500051,O,1991-01-01,NN,,,2006-12-15T00:25:54,false,3,,,,,FRANCICOT,33210,COIMERES,,,33130,,,,,,,,,,,,,,,,,,,1993-12-22,F,,,,,85.1G,NAF1993,N,-0.197258,44.50827,0.39,street,Janicot 33210 Coimères,33130_ptbal7,G,JANICOT,
334626645,00017,33462664500017,O,1986-01-01,11,2019,,2021-10-27T08:30:42,true,4,,155,,RUE,LAGARDERE,33210,COIMERES,,,33130,,,,,,,,,,,,,,,,,,,2008-01-01,A,,,,,43.91A,NAFRev2,O,-0.210225,44.49513,0.95,housenumber,155 Rue Lagardère 33210 Coimères,33130_0030_00155,G,155 RUE LAGARDERE,
338612286,00017,33861228600017,O,1986-06-30,NN,,,2022-04-09T04:18:45,true,4,,,,,PETIT LAMOTHE,33210,COIMERES,,,33130,,,,,,,,,,,,,,,,,,,2014-04-04,F,,,,,41.10D,NAFRev2,N,-0.209432,44.502976,0.59,street,Lamothe 33210 Coimères,33130_jb1rs3,G,LAMOTHE,
341159192,00010,34115919200010,O,,NN,,,,true,1,,,,,,33210,COIMERES,,,33130,,,,,,,,,,,,,,,,,,,1989-07-15,F,,,,,67.01,NAP,N,,,0,,,,,,
341605848,00025,34160584800025,O,2012-06-21,,,,2020-11-19T08:58:09,false,2,,13,B,RUE,DUTHIL,33210,COIMERES,,,33130,,,,,,,,,,,,,,,,,,,2020-11-16,F,ATELIER COTE JARDIN,,,,90.03B,NAFRev2,N,-0.211091,44.494554,0.45,street,Lotissement Duthil 33210 Coimères,33130_wqi4jf,G,LOTISSEMENT DUTHIL,
342939741,00019,34293974100019,O,1987-12-01,,,,2008-09-03T13:46:35,true,4,,,,,,33210,COIMERES,,,33130,,,,,,,,,,,,,,,,,,,2008-01-01,F,,,,,01.47Z,NAFRev2,N,,,0,,,,,,
344441159,00029,34444115900029,O,2015-01-01,,,,2021-02-23T10:59:28,true,1,,,,,HIBON SUD,33210,COIMERES,,,33130,,,,,,,,,,,,,,,,,,,2015-01-01,A,,,,,68.20B,NAFRev2,N,-0.191924,44.505058,0.94,street,Hibon Sud 33210 Coimères,33130_B041,G,HIBON SUD,
345404776,00022,34540477600022,O,,,,,,true,1,,,,LD,LE BORDELAIS,33210,COIMERES,,,33130,,,,,,,,,,,,,,,,,,,1992-06-30,F,,,,,55.3A,NAF1993,N,-0.233772,44.491297,0.73,street,A Bordelais 33210 Coimères,33130_8vi9mx,G,A BORDELAIS,
347625584,00029,34762558400029,O,2008-10-31,,,,2021-02-23T11:00:30,true,1,LIEU DIT MOUTON,6,,,LOT DE L'HIPPODROME,33210,COIMERES,,,33130,,,,,,,,,,,,,,,,,,,2008-10-31,A,,,,,68.20B,NAFRev2,N,-0.218404,44.510267,0.39,housenumber,6 Lotissement les Jardins de la Clairière 33210 Coimères,33130_a035_00006,G,6 LOT LES JARD DE LA CLAIRIERE,
348149360,00011,34814936000011,O,1988-09-13,NN,,,2008-01-04T22:48:30,true,3,,,,,,33210,COIMERES,,,33130,,,,,,,,,,,,,,,,,,,2008-01-01,A,,,,,68.20A,NAFRev2,N,,,0,,,,,,
348430604,00028,34843060400028,O,1994-04-03,,,,,true,1,,,,,,33210,COIMERES,,,33130,,,,,,,,,,,,,,,,,,,1997-05-14,F,,,,,55.3A,NAF1993,N,,,0,,,,,,
349263012,00016,34926301200016,O,1989-01-01,NN,,,,true,4,,3,,,COUCHOULET,33210,COIMERES,,,33130,,,,,,,,,,,,,,,,,,,2003-12-31,F,,,,,01.2G,NAFRev1,N,-0.211349,44.488171,0.94,street,Couchoulet 33210 Coimères,33130_gvu76e,G,COUCHOULET,
349266668,00038,34926666800038,O,2006-01-05,NN,,,2021-02-23T11:02:09,true,4,,2,,,MOUREOU,33210,COIMERES,,,33130,,,,,,,,,,,,,,,,,,,2010-12-31,A,,,,,46.44Z,NAFRev2,N,-0.220731,44.511412,0.95,housenumber,2 Moureou 33210 Coimères,33130_25ovbw_00002,G,2 MOUREOU,
350483848,00015,35048384800015,O,,NN,,,,true,1,,,,LD,JEAN HAUT,33210,COIMERES,,,33130,,,,,,,,,,,,,,,,,,,1990-12-31,F,,,,,55.10,NAP,N,-0.211922,44.492835,0.93,street,Rue Jean Haut 33210 Coimères,33130_0024,G,RUE JEAN HAUT,
351231113,00017,35123111300017,O,,NN,,,,true,1,,,,AV,CASSOT,33210,COIMERES,,,33130,,,,,,,,,,,,,,,,,,,1991-08-31,F,,,,,01.57,NAP,N,-0.214216,44.509726,0.67,street,A Cassot 33210 Coimères,33130_e4zlad,G,A CASSOT,
351328471,00062,35132847100062,O,2010-01-01,,,,2010-03-31T17:20:50,false,1,,180,,AV,DU MARECHEL LECLERC,33210,COIMERES,,,33130,,,,,,,,,,,,,,,,,,,2010-01-01,F,,,,,47.21Z,NAFRev2,O,-0.87757,45.826652,0.71,poi,Avenue du Maréchal Leclerc (Pont) Pont-l'Abbé-d'Arnoult,https://osm.org/way/204179490,G,,
351753405,00015,35175340500015,O,1989-08-17,00,2019,,2021-10-27T08:02:20,true,3,,,,LD,LE GRUSSON,33210,COIMERES,,,33130,,,,,,,,,,,,,,,,,,,2008-01-01,A,,,,,01.21Z,NAFRev2,N,-0.209243,44.519927,0.69,street,Les Grussons 33210 Coimères,33130_270xwo,G,LES GRUSSONS,
352495055,00019,35249505500019,O,1989-01-01,NN,,,2008-01-04T23:43:08,true,3,,,,,LE GRUSSOU,33210,COIMERES,,,33130,,,,,,,,,,,,,,,,,,,2008-01-01,A,,,,,01.21Z,NAFRev2,N,-0.209243,44.519927,0.6,street,Les Grussons 33210 Coimères,33130_270xwo,G,LES GRUSSONS,
353797509,00026,35379750900026,O,2003-01-01,NN,,,2006-11-25T11:17:49,true,5,,2,,,SALABARTAN,33210,COIMERES,,,33130,,,,,,,,,,,,,,,,,,,2005-12-05,F,,,,,93.0N,NAFRev1,N,-0.227626,44.50583,0.94,housenumber,2 Salabartan 33210 Coimères,33130_n8cwvb_00002,G,2 SALABARTAN,
353896392,00027,35389639200027,O,1991-03-01,NN,,,2014-04-28T12:32:10,false,5,,,,LD,LE TIN,33210,COIMERES,,,33130,,,,,,,,,,,,,,,,,,,2014-01-01,F,,,,,47.78C,NAFRev2,N,-0.221313,44.493414,0.51,street,Au Tin 33210 Coimères,33130_zu3u9y,G,AU TIN,
380808279,00018,38080827900018,O,1990-12-29,NN,,,2008-01-04T21:47:52,true,3,,,,LD,DUTHIL,33210,COIMERES,,,33130,,,,,,,,,,,,,,,,,,,2008-01-01,A,,,,,68.20A,NAFRev2,N,-0.211091,44.494554,0.92,street,Lotissement Duthil 33210 Coimères,33130_wqi4jf,G,LOTISSEMENT DUTHIL,
381270909,00017,38127090900017,O,,,,,,true,1,,,,LD,LE SABLA,33210,COIMERES,,,33130,,,,,,,,,,,,,,,,,,,1997-12-31,F,,,,,01.2G,NAF1993,N,-0.211585,44.500997,0.63,street,Rue du Sabla 33210 Coimères,33130_0070,G,RUE DU SABLA,
381438969,00010,38143896900010,O,1900-01-01,NN,,,2016-06-23T08:19:24,false,3,,,,LD,LE BOURG,33210,COIMERES,,,33130,,,,,,,,,,,,,,,,,,,1992-12-31,F,,,,,52.2L,NAF1993,N,-0.237571,44.498986,0.41,street,La Bourdette 33210 Coimères,33130_bmycas,G,LA BOURDETTE,
382366557,00017,38236655700017,O,1900-01-01,,,,2014-02-25T08:01:42,false,4,,,,LD,BOURG,33210,COIMERES,,,33130,,,,,,,,,,,,,,,,,,,1993-12-25,F,,,,,60.2E,NAF1993,N,-0.237571,44.498986,0.59,street,La Bourdette 33210 Coimères,33130_bmycas,G,LA BOURDETTE,
383744190,00018,38374419000018,O,,NN,,,,true,1,,,,LD,JEAN HAUT,33210,COIMERES,,,33130,,,,,,,,,,,,,,,,,,,1992-04-01,F,,,,,74.8K,NAF1993,N,-0.211922,44.492835,0.93,street,Rue Jean Haut 33210 Coimères,33130_0024,G,RUE JEAN HAUT,
387810013,00038,38781001300038,O,2016-08-24,,,,2022-01-19T08:34:40,true,2,,,,,HIBON,33210,COIMERES,,,33130,,,,,,,,,,,,,,,,,,,2022-01-05,F,,,,,86.90F,NAFRev2,N,-0.191924,44.505058,0.92,street,Hibon Sud 33210 Coimères,33130_B041,G,HIBON SUD,
389840828,00013,38984082800013,O,1993-01-09,NN,,,,false,4,CHEZ MONSIEUR THIEBAUGEIGE,,,LD,AU PASTEN,33210,COIMERES,,,33130,,,,,,,,,,,,,,,,,,,1997-07-09,F,,,,,70.2A,NAF1993,N,-0.211374,44.508558,0.94,street,Au Pasten 33210 Coimères,33130_bad7zb,G,AU PASTEN,
390477974,00013,39047797400013,O,1993-01-01,NN,,,,true,1,,,,,LE BORDELAIS,33210,COIMERES,,,33130,,,,,,,,,,,,,,,,,,,2000-03-15,F,,,,,55.3A,NAF1993,O,-0.233772,44.491297,0.73,street,A Bordelais 33210 Coimères,33130_8vi9mx,G,A BORDELAIS,
390907467,00018,39090746700018,O,1992-01-01,NN,,,2020-02-10T09:53:35,false,3,,,,,,33210,COIMERES,,,33130,,,,,,,,,,,,,,,,,,,1998-12-25,F,,,,,01.1A,NAF1993,N,,,0,,,,,,
391886355,00018,39188635500018,O,1993-07-04,NN,,,2006-10-28T01:48:05,false,3,,4,,LOT,DUTHIL,33210,COIMERES,,,33130,,,,,,,,,,,,,,,,,,,2005-01-13,F,,,,,70.2A,NAFRev1,N,-0.211091,44.494554,0.71,street,Lotissement Duthil 33210 Coimères,33130_wqi4jf,G,LOTISSEMENT DUTHIL,
391949799,00012,39194979900012,O,1993-07-22,,,,,true,3,,,,,LIEU DIT JEAN HAUT,33210,COIMERES,,,33130,,,,,,,,,,,,,,,,,,,1999-05-26,F,,,,,74.6Z,NAF1993,N,-0.211922,44.492835,0.93,street,Rue Jean Haut 33210 Coimères,33130_0024,G,RUE JEAN HAUT,
392277083,00029,39227708300029,O,2011-01-25,,,,2021-02-23T11:18:05,true,1,,8,,,COULIN,33210,COIMERES,,,33130,,,,,,,,,,,,,,,,,,,2011-01-25,A,,,,,43.33Z,NAFRev2,N,-0.21001,44.488753,0.52,housenumber,8 Chaloupin 33210 Coimères,33130_dy0rsm_00008,G,8 CHALOUPIN,
392570503,00012,39257050300012,O,1993-10-04,NN,,,,true,1,,,,LOT,DUTHIL COIMERES,33210,COIMERES,,,33130,,,,,,,,,,,,,,,,,,,1999-12-30,F,,,,,52.6E,NAF1993,O,-0.211091,44.494554,0.89,street,Lotissement Duthil 33210 Coimères,33130_wqi4jf,G,LOTISSEMENT DUTHIL,
392582441,00029,39258244100029,O,1992-10-01,,,,2014-07-08T01:21:02,true,6,PLACE DE LA MAIRIE,5,,LD,LE BOURG,33210,COIMERES,,,33130,,,,,,,,,,,,,,,,,,,2009-12-31,F,,,,,10.71C,NAFRev2,O,-0.228774,44.51308,0.44,housenumber,5 Le Domaine du Haras 33210 Coimères,33130_a031_00005,G,5 LE DOMAINE DU HARAS,
394184469,00044,39418446900044,O,2016-02-01,,,,2019-11-14T15:50:46,false,2,9 RUE PAPON,,,,,33210,COIMERES,,,33130,,,,,,,,,,,,,,,,,,,2019-09-30,F,,,,,41.10A,NAFRev2,N,-0.209755,44.492271,0.55,street,Impasse Papon 33210 Coimères,33130_0050,D,IMPASSE PAPON,
395291008,00013,39529100800013,O,1993-01-01,NN,,,2008-01-04T18:24:30,true,3,,,,,,33210,COIMERES,,,33130,,,,,,,,,,,,,,,,,,,2008-01-01,A,,,,,01.11Z,NAFRev2,N,,,0,,,,,,
398213652,00025,39821365200025,O,1995-10-01,NN,,,,false,4,MAIRIE DE COIMERES,9,,,LE BOURG,33210,COIMERES,,,33130,,,,,,,,,,,,,,,,,,,2000-10-01,F,,,,,85.1G,NAF1993,N,-0.191068,44.50202,0.36,housenumber,9 Les Arramounets 33210 Coimères,33130_no2kzw_00009,G,9 LES ARRAMOUNETS,
398213652,00066,39821365200066,O,2005-07-01,,,,2008-01-04T18:44:53,true,3,,5,,,LE TIN,33210,COIMERES,,,33130,,,,,,,,,,,,,,,,,,,2008-01-01,A,,,,,86.90D,NAFRev2,N,-0.221218,44.49363,0.51,housenumber,5 Au Tin 33210 Coimères,33130_zu3u9y_00005,G,5 AU TIN,
398365809,00035,39836580900035,O,2017-09-01,02,2019,,2021-10-27T08:24:31,true,1,1 BIS LIEU-DIT LE BORDELAIS,,,,,33210,COIMERES,,,33130,,,,,,,,,,,,,,,,,,,2017-09-01,A,LA FORGE,,,,56.10A,NAFRev2,O,-0.234049,44.491275,0.45,housenumber,1 A Bordelais 33210 Coimères,33130_8vi9mx_00001,D,1 A BORDELAIS,
398392282,00016,39839228200016,O,,NN,,,,true,1,,8,,,LE BOURG,33210,COIMERES,,,33130,,,,,,,,,,,,,,,,,,,1995-09-14,F,,,,,93.0N,NAF1993,N,-0.190271,44.502167,0.36,housenumber,8 Les Arramounets 33210 Coimères,33130_no2kzw_00008,G,8 LES ARRAMOUNETS,
398507517,00025,39850751700025,O,2006-04-15,NN,,,2014-07-08T01:26:48,true,7,,5,,,5 MANINE,33210,COIMERES,,,33130,,,,,,,,,,,,,,,,,,,2013-04-18,F,,,,PETURAUD FRANCIS NEGOCE DE BOIS,46.73A,NAFRev2,N,-0.227328,44.488897,0.69,street,Manine 33210 Coimères,33130_6vj5tx,G,MANINE,
400997227,00014,40099722700014,O,,NN,,,,true,1,,2,,,LOUSTEAU VIELL,33210,COIMERES,,,33130,,,,,,,,,,,,,,,,,,,1997-05-31,F,,,,,01.4B,NAF1993,O,,,0,,,,,,
401162821,00060,40116282100060,O,2012-06-01,,,,2017-01-16T15:59:54,false,2,,2,,LD,NINON,33210,COIMERES,,,33130,,,,,,,,,,,,,,,,,,,2016-12-12,F,,,,,46.69C,NAFRev2,N,-0.214232,44.487473,0.95,housenumber,2 Ninon 33210 Coimères,33130_0z4qae_00002,G,2 NINON,
404671539,00017,40467153900017,O,1996-04-02,NN,,,2014-07-08T01:37:18,true,5,,,,LD,CABAILLES,33210,COIMERES,,,33130,,,,,,,,,,,,,,,,,,,2012-05-11,F,,,,,49.41B,NAFRev2,N,-0.229532,44.481909,0.83,street,Cabaille 33210 Coimères,33130_xpw6lj,G,CABAILLE,
404972119,00014,40497211900014,O,1995-01-01,NN,,,2008-01-04T20:48:37,true,3,,,,,LES GRUSSANS,33210,COIMERES,,,33130,,,,,,,,,,,,,,,,,,,2008-01-01,A,,,,,01.42Z,NAFRev2,N,-0.209243,44.519927,0.73,street,Les Grussons 33210 Coimères,33130_270xwo,G,LES GRUSSONS,
404972945,00012,40497294500012,O,1995-01-01,NN,,,2016-01-12T00:17:11,true,3,,,,,,33210,COIMERES,,,33130,,,,,,,,,,,,,,,,,,,2008-01-01,A,,,,,02.10Z,NAFRev2,N,,,0,,,,,,
404977696,00016,40497769600016,O,1995-01-01,NN,,,2006-09-27T08:12:00,true,1,,,,,LE POULET,33210,COIMERES,,,33130,,,,,,,,,,,,,,,,,,,2000-12-31,F,,,,,01.3Z,NAF1993,N,-0.211349,44.488171,0.46,street,Couchoulet 33210 Coimères,33130_gvu76e,G,COUCHOULET,
405167040,00022,40516704000022,O,2012-10-23,,,,2021-02-23T11:29:27,true,1,,7,,,MOUREOU,33210,COIMERES,,,33130,,,,,,,,,,,,,,,,,,,2012-10-23,A,,,,,68.20A,NAFRev2,N,-0.223137,44.512618,0.95,housenumber,7 Moureou 33210 Coimères,33130_25ovbw_00007,G,7 MOUREOU,
407506443,00016,40750644300016,O,1995-01-01,NN,,,2016-01-12T00:17:24,true,3,,,,,LE BOURG,33210,COIMERES,,,33130,,,,,,,,,,,,,,,,,,,2008-01-01,A,,,,,02.10Z,NAFRev2,N,-0.237571,44.498986,0.41,street,La Bourdette 33210 Coimères,33130_bmycas,G,LA BOURDETTE,
412237711,00020,41223771100020,O,2009-01-01,NN,,,2021-02-23T11:34:34,false,3,SECTION PEINTURE,7,,,PEREOU,33210,COIMERES,,,33130,,,,,,,,,,,,,,,,,,,2017-12-01,A,,,,,94.99Z,NAFRev2,N,-0.227196,44.513286,0.95,housenumber,7 Péréou 33210 Coimères,33130_17hr0f_00007,G,7 PEREOU,
412402075,00011,41240207500011,O,1996-03-18,NN,,,2011-04-23T09:32:59,true,4,,,,,MAIRIE,33210,COIMERES,,,33130,,,,,,,,,,,,,,,,,,,2008-01-01,A,,,,,94.99Z,NAFRev2,O,-0.218404,44.510267,0.52,street,Lotissement les Jardins de la Clairière 33210 Coimères,33130_A035,G,LOT LES JARDINS DE LA CLAIRIERE,
412696791,00026,41269679100026,O,1998-09-09,NN,,,2011-11-17T09:58:30,false,4,,1,,LOT,CAPON,33210,COIMERES,,,33130,,,,,,,,,,,,,,,,,,,2011-07-29,F,,,,,68.20A,NAFRev2,N,-0.218645,44.511114,0.41,housenumber,1 Lotissement les Jardins de la Clairière 33210 Coimères,33130_a035_00001,G,1 LOT LES JARD DE LA CLAIRIERE,
412740037,00012,41274003700012,O,1987-12-31,NN,,,,true,1,,,,,LABOURDETTE,33210,COIMERES,,,33130,,,,,,,,,,,,,,,,,,,2001-12-14,F,,,,,01.1A,NAF1993,N,-0.237571,44.498986,0.79,street,La Bourdette 33210 Coimères,33130_bmycas,G,LA BOURDETTE,
412740557,00019,41274055700019,O,1987-12-31,NN,,,2006-10-28T04:05:26,true,4,,,,,PALUT,33210,COIMERES,,,33130,,,,,,,,,,,,,,,,,,,2006-01-20,F,,,,,01.1G,NAFRev1,N,-0.20499,44.496284,0.6,street,Palus 33210 Coimères,33130_1jcm3j,G,PALUS,
412742280,00016,41274228000016,O,1987-12-31,NN,,,,true,4,,,,,SALABARTAN,33210,COIMERES,,,33130,,,,,,,,,,,,,,,,,,,2003-08-28,F,,,,,01.1A,NAFRev1,N,-0.227717,44.505851,0.94,street,Salabartan 33210 Coimères,33130_n8cwvb,G,SALABARTAN,
412745119,00013,41274511900013,O,1987-12-31,NN,,,,true,1,,,,,LA BRAIZE,33210,COIMERES,,,33130,,,,,,,,,,,,,,,,,,,1999-05-04,F,,,,,01.1A,NAF1993,N,-0.194289,44.511383,0.67,street,Labraize 33210 Coimères,33130_yfgtiu,G,LABRAIZE,
412750234,00012,41275023400012,O,1991-03-01,NN,,,2008-01-04T22:21:47,true,3,,,,,,33210,COIMERES,,,33130,,,,,,,,,,,,,,,,,,,2008-01-01,A,,,,,01.21Z,NAFRev2,N,,,0,,,,,,
412769812,00014,41276981200014,O,1997-07-03,NN,,,,true,1,,26,,,LE BOURG,33210,COIMERES,,,33130,,,,,,,,,,,,,,,,,,,2002-03-31,F,,,,,55.3A,NAF1993,N,-0.237571,44.498986,0.41,street,La Bourdette 33210 Coimères,33130_bmycas,G,LA BOURDETTE,
412837155,00016,41283715500016,O,1997-07-01,,,,,false,3,MAIRIE,19,,,LE BOURG,33210,COIMERES,,,33130,,,,,,,,,,,,,,,,,,,1997-12-25,F,,,,,85.1G,NAF1993,N,-0.217769,44.510366,0.41,housenumber,19 Lotissement les Jardins de la Clairière 33210 Coimères,33130_a035_00019,G,19 LOT LES JARD DE LA CLAIRIERE,
412988164,00031,41298816400031,O,2008-12-01,,,,2021-03-02T10:52:54,true,3,,6,,,MOUREOU,33210,COIMERES,,,33130,,,,,,,,,,,,,,,,,,,2021-03-01,A,,,,,70.22Z,NAFRev2,N,-0.222465,44.512286,0.95,housenumber,6 Moureou 33210 Coimères,33130_25ovbw_00006,G,6 MOUREOU,
414228957,00018,41422895700018,O,1997-10-30,,,,,true,1,,,,LD,JEAN HAUT,33210,COIMERES,,,33130,,,,,,,,,,,,,,,,,,,1998-12-15,F,,,,,74.6Z,NAF1993,N,-0.211922,44.492835,0.93,street,Rue Jean Haut 33210 Coimères,33130_0024,G,RUE JEAN HAUT,
414499319,00013,41449931900013,O,1965-07-26,NN,,,2018-09-29T12:39:51,true,6,,,,,MAIRIE,33210,COIMERES,,,33130,,,,,,,,,,,,,,,,,,,2015-01-11,A,,,,,90.01Z,NAFRev2,O,-0.218404,44.510267,0.52,street,Lotissement les Jardins de la Clairière 33210 Coimères,33130_A035,G,LOT LES JARDINS DE LA CLAIRIERE,
415203397,00013,41520339700013,O,1997-10-16,,,,2008-01-04T23:00:47,true,3,,,,LOT,DUTHIL,33210,COIMERES,,,33130,,,,,,,,,,,,,,,,,,,2008-01-01,A,,,,,90.01Z,NAFRev2,N,-0.211091,44.494554,0.85,street,Lotissement Duthil 33210 Coimères,33130_wqi4jf,G,LOTISSEMENT DUTHIL,
417564838,00015,41756483800015,O,1998-01-01,NN,,,,true,3,,,,,LE SABLA,33210,COIMERES,,,33130,,,,,,,,,,,,,,,,,,,2003-12-31,F,,,,,01.2G,NAFRev1,N,-0.211585,44.500997,0.63,street,Rue du Sabla 33210 Coimères,33130_0070,G,RUE DU SABLA,
419588868,00028,41958886800028,O,2015-10-31,,,,2021-02-23T11:40:29,true,1,,4,,,MOURFIC,33210,COIMERES,,,33130,,,,,,,,,,,,,,,,,,,2015-10-31,A,,,,,01.21Z,NAFRev2,N,-0.228591,44.490277,0.94,housenumber,4 Mourfic 33210 Coimères,33130_cis91c_00004,G,4 MOURFIC,