siren,nic,siret,statutDiffusionEtablissement,dateCreationEtablissement,trancheEffectifsEtablissement,anneeEffectifsEtablissement,activitePrincipaleRegistreMetiersEtablissement,dateDernierTraitementEtablissement,etablissementSiege,nombrePeriodesEtablissement,complementAdresseEtablissement,numeroVoieEtablissement,indiceRepetitionEtablissement,typeVoieEtablissement,libelleVoieEtablissement,codePostalEtablissement,libelleCommuneEtablissement,libelleCommuneEtrangerEtablissement,distributionSpecialeEtablissement,codeCommuneEtablissement,codeCedexEtablissement,libelleCedexEtablissement,codePaysEtrangerEtablissement,libellePaysEtrangerEtablissement,complementAdresse2Etablissement,numeroVoie2Etablissement,indiceRepetition2Etablissement,typeVoie2Etablissement,libelleVoie2Etablissement,codePostal2Etablissement,libelleCommune2Etablissement,libelleCommuneEtranger2Etablissement,distributionSpeciale2Etablissement,codeCommune2Etablissement,codeCedex2Etablissement,libelleCedex2Etablissement,codePaysEtranger2Etablissement,libellePaysEtranger2Etablissement,dateDebut,etatAdministratifEtablissement,enseigne1Etablissement,enseigne2Etablissement,enseigne3Etablissement,denominationUsuelleEtablissement,activitePrincipaleEtablissement,nomenclatureActivitePrincipaleEtablissement,caractereEmployeurEtablissement,longitude,latitude,geo_score,geo_type,geo_adresse,geo_id,geo_ligne,geo_l4,geo_l5
130019433,00015,13001943300015,O,2013-05-07,,,,2014-05-19T09:22:32,true,1,EHPAD GASTON CHARGE,,,,LES TERMELLES,37160,ABILLY,,,37001,,,,,,,,,,,,,,,,,,,2013-05-07,A,,,,,84.12Z,NAFRev2,N,0.724866,46.935208,0.94,street,Les Termelles 37160 Abilly,37001_9dtpg2,G,LES TERMELLES,
213700016,00016,21370001600016,O,1983-03-01,11,2019,,2021-10-27T08:08:06,true,4,,,,PL,DE LA MAIRIE,37160,ABILLY,,,37001,,,,,,,,,,,,,,,,,,,2008-01-01,A,MAIRIE,,,,84.11Z,NAFRev2,O,0.728916,46.940296,0.83,street,Place de la Mairie 37160 Abilly,37001_0055,G,PLACE DE LA MAIRIE,
213700016,00024,21370001600024,O,1983-12-21,02,2019,,2021-10-27T08:08:06,false,3,,10,,PL,CONTY MAIGNANT,37160,ABILLY,,,37001,,,,,,,,,,,,,,,,,,,2008-01-01,A,ECOLE PRIMAIRE PUBLIQUE,,,,85.20Z,NAFRev2,N,0.725438,46.941117,0.86,housenumber,10 Place Conty Maignant 37160 Abilly,37001_0020_00010,G,10 PLACE CONTY MAIGNANT,
213700016,00032,21370001600032,O,1994-01-01,NN,,,2008-01-04T18:32:22,false,3,MAIRIE,,,PL,DE LA MAIRIE,37160,ABILLY,,,37001,,,,,,,,,,,,,,,,,,,2008-01-01,A,SERVICE D'ASSAINISSEMENT,,,,37.00Z,NAFRev2,N,0.728916,46.940296,0.83,street,Place de la Mairie 37160 Abilly,37001_0055,G,PLACE DE LA MAIRIE,
213700016,00040,21370001600040,O,2003-05-01,NN,,,2008-01-04T18:32:22,false,3,MAIRIE,,,PL,DE LA MAIRIE,37160,ABILLY,,,37001,,,,,,,,,,,,,,,,,,,2008-01-01,A,CAMPING MUNICIPAL,,,,55.30Z,NAFRev2,N,0.728916,46.940296,0.83,street,Place de la Mairie 37160 Abilly,37001_0055,G,PLACE DE LA MAIRIE,
253700561,00017,25370056100017,O,1983-03-01,NN,,,2018-09-29T12:07:42,true,4,MAIRIE,,,PL,DE LA MAIRIE,37160,ABILLY,,,37001,,,,,,,,,,,,,,,,,,,2016-12-31,F,,,,,88.10A,NAFRev2,N,0.728916,46.940296,0.83,street,Place de la Mairie 37160 Abilly,37001_0055,G,PLACE DE LA MAIRIE,
263700072,00014,26370007200014,O,1983-03-01,22,2019,,2021-10-27T08:12:51,true,4,,,,,LES TERMELLES,37160,ABILLY,,,37001,,,,,,,,,,,,,,,,,,,2008-01-01,A,,,,,87.10A,NAFRev2,O,0.724866,46.935208,0.94,street,Les Termelles 37160 Abilly,37001_9dtpg2,G,LES TERMELLES,
263700072,00022,26370007200022,O,1984-12-01,11,2019,,2021-10-27T08:12:51,false,5,,,,,LES TERMELLES,37160,ABILLY,,,37001,,,,,,,,,,,,,,,,,,,2018-12-13,A,SSIAD ABILLY,,,,86.90D,NAFRev2,N,0.724866,46.935208,0.94,street,Les Termelles 37160 Abilly,37001_9dtpg2,G,LES TERMELLES,
263700072,00030,26370007200030,O,2002-01-01,NN,,,2015-05-14T03:49:46,false,3,,,,,LES TERMELLES,37160,ABILLY,,,37001,,,,,,,,,,,,,,,,,,,2008-01-01,A,CANTINE ET FOURNITURES DE REPAS,,,,56.29B,NAFRev2,N,0.724866,46.935208,0.94,street,Les Termelles 37160 Abilly,37001_9dtpg2,G,LES TERMELLES,
263700072,00048,26370007200048,O,2002-12-25,,,,2008-01-04T18:58:44,false,2,,,,,LES TERMELLES,37160,ABILLY,,,37001,,,,,,,,,,,,,,,,,,,2008-01-01,A,DOTATION NON AFFECTEE,,,,66.19A,NAFRev2,N,0.724866,46.935208,0.94,street,Les Termelles 37160 Abilly,37001_9dtpg2,G,LES TERMELLES,
263700072,00055,26370007200055,O,2009-09-17,NN,,,2021-02-23T10:35:04,false,1,,,,,LES TERMELLES,37160,ABILLY,,,37001,,,,,,,,,,,,,,,,,,,2009-09-17,A,SCE ACCUEIL DE JOUR ALZHEIMER,,,,88.10B,NAFRev2,N,0.724866,46.935208,0.94,street,Les Termelles 37160 Abilly,37001_9dtpg2,G,LES TERMELLES,
263700296,00019,26370029600019,O,1983-03-01,NN,,,2021-11-25T13:46:56,true,5,MAIRIE,,,PL,DE LA MAIRIE,37160,ABILLY,,,37001,,,,,,,,,,,,,,,,,,,2020-09-30,F,,,,,88.99B,NAFRev2,N,0.728916,46.940296,0.83,street,Place de la Mairie 37160 Abilly,37001_0055,G,PLACE DE LA MAIRIE,
293701546,00013,29370154600013,O,1989-08-04,NN,,,2018-09-29T12:08:56,true,3,MAIRIE,,,PL,DE LA MAIRIE,37160,ABILLY,,,37001,,,,,,,,,,,,,,,,,,,2008-01-01,A,,,,,42.99Z,NAFRev2,N,0.728916,46.940296,0.83,street,Place de la Mairie 37160 Abilly,37001_0055,G,PLACE DE LA MAIRIE,
302821681,00012,30282168100012,O,,NN,,,,true,1,,,,RUE,CUFFON,37160,ABILLY,,,37001,,,,,,,,,,,,,,,,,,,,F,,,,,21.08,NAP,N,0.730566,46.939201,0.44,street,Rue des Fonderies 37160 Abilly,37001_0035,G,RUE DES FONDERIES,
304688914,00031,30468891400031,O,1988-07-15,03,2019,,2021-10-27T08:15:18,true,5,,,,LD,LE BAS RIBAULT,37160,ABILLY,,,37001,,,,,,,,,,,,,,,,,,,2008-01-01,A,,,,,46.36Z,NAFRev2,O,0.709489,46.964599,0.52,street,Le Haut Ribeault 37160 Abilly,37001_B092,G,LE HAUT RIBEAULT,
305794638,00042,30579463800042,O,,,,,,true,1,,,,,RIVES,37160,ABILLY,,,37001,,,,,,,,,,,,,,,,,,,1994-03-28,F,,,,,22.2J,NAF1993,N,0.70881,46.942188,0.94,street,Rives 37160 Abilly,37001_aabug0,G,RIVES,
307397240,00010,30739724000010,O,,NN,,,,true,1,,,,,,37160,ABILLY,,,37001,,,,,,,,,,,,,,,,,,,1987-12-25,F,,,,,67.04,NAP,N,,,0,,,,,,
307522441,00012,30752244100012,O,,NN,,,,true,1,,,,LD,LES ROCHES,37160,ABILLY,,,37001,,,,,,,,,,,,,,,,,,,1989-01-17,F,,,,,00.98,NAP,N,0.707578,46.955135,0.94,street,Les Roches 37160 Abilly,37001_nyrij7,G,LES ROCHES,
307565978,00011,30756597800011,O,,NN,,,,true,1,,25,,RUE,COMMERCE,37160,ABILLY,,,37001,,,,,,,,,,,,,,,,,,,,F,,,,,81.21,NAP,N,0.72816,46.940023,0.89,housenumber,25 Rue du Commerce 37160 Abilly,37001_0015_00025,G,25 RUE DU COMMERCE,
308083328,00010,30808332800010,O,1976-01-01,NN,,,2006-11-25T09:22:49,true,4,,11,,RUE,DES FONDERIES,37160,ABILLY,,,37001,,,,,,,,,,,,,,,,,,,2004-12-31,F,,,,,45.1A,NAFRev1,O,0.730207,46.938628,0.95,housenumber,11 Rue des Fonderies 37160 Abilly,37001_0035_00011,G,11 RUE DES FONDERIES,
308891068,00022,30889106800022,O,1989-09-20,NN,,,2014-07-08T00:14:11,false,6,,25,,RUE,DU COMMERCE,37160,ABILLY,,,37001,,,,,,,,,,,,,,,,,,,2011-12-31,F,,,,,56.10A,NAFRev2,N,0.72816,46.940023,0.95,housenumber,25 Rue du Commerce 37160 Abilly,37001_0015_00025,G,25 RUE DU COMMERCE,
308891068,00030,30889106800030,O,2012-07-01,,,,2013-06-14T19:25:26,true,2,,18,,RUE,DES COTEAUX,37160,ABILLY,,,37001,,,,,,,,,,,,,,,,,,,2013-06-07,F,,,,,56.21Z,NAFRev2,N,0.724014,46.94395,0.95,housenumber,18 Rue des Coteaux 37160 Abilly,37001_0017_00018,G,18 RUE DES COTEAUX,
309220986,00017,30922098600017,O,,NN,,,,true,1,,,,LD,LES SABLES,37160,ABILLY,,,37001,,,,,,,,,,,,,,,,,,,1992-03-31,F,,,,,45.4C,NAF1993,N,0.717637,46.943247,0.94,street,Les Sables 37160 Abilly,37001_ytl3k2,G,LES SABLES,
309829349,00013,30982934900013,O,,,,,,true,1,,15,,RUE,DU COMMERCE,37160,ABILLY,,,37001,,,,,,,,,,,,,,,,,,,1984-12-25,F,,,,,62.11,NAP,N,0.72764,46.94009,0.95,housenumber,15 Rue du Commerce 37160 Abilly,37001_0015_00015,G,15 RUE DU COMMERCE,
310866819,00017,31086681900017,O,1977-01-01,NN,,,,true,1,,20,,RUE,LA MARCAUDERIE,37160,ABILLY,,,37001,,,,,,,,,,,,,,,,,,,1998-06-25,F,,,,,45.4C,NAF1993,N,0.728439,46.942681,0.94,housenumber,20 Rue de la Marcauderie 37160 Abilly,37001_0060_00020,G,20 RUE DE LA MARCAUDERIE,
312388002,00015,31238800200015,O,1978-01-01,NN,,,,true,1,,8,,RUE,DU PONT,37160,ABILLY,,,37001,,,,,,,,,,,,,,,,,,,1998-08-25,F,,,,,45.4C,NAF1993,O,0.730301,46.941075,0.82,street,Rue du Pont 37160 Abilly,37001_0083,G,RUE DU PONT,
312862311,00023,31286231100023,O,1981-08-01,NN,,,2008-11-07T00:28:02,true,4,,,,LD,CHIZAY,37160,ABILLY,,,37001,,,,,,,,,,,,,,,,,,,1990-12-25,F,,,,,45.4A,NAF1993,N,0.705181,46.952532,0.92,street,Chemin de Chizay 37160 Abilly,37001_0011,G,CHEMIN DE CHIZAY,
313124794,00014,31312479400014,O,,,,,,true,1,,,,LD,LA CHATIERE,37160,ABILLY,,,37001,,,,,,,,,,,,,,,,,,,1990-06-05,F,,,,,01.07,NAP,N,0.749557,46.927048,0.94,street,La Chatière 37160 Abilly,37001_1k5ci6,G,LA CHATIERE,
313513285,00020,31351328500020,O,1981-07-01,NN,,,,true,1,,,,LD,LA FAENZA,37160,ABILLY,,,37001,,,,,,,,,,,,,,,,,,,2000-09-29,F,,,,,26.2A,NAF1993,N,,,0,,,,,,
314111980,00038,31411198000038,O,1987-04-07,NN,,,,false,3,,10,,RUE,DES ANCIENS D AFN,37160,ABILLY,,,37001,,,,,,,,,,,,,,,,,,,1992-06-16,F,,,,,52.4F,NAF1993,N,0.720121,46.943959,0.55,housenumber,10 Rue des Combattants En Afn 37160 Abilly,37001_0010_00010,G,10 RUE DES COMBATTANTS EN AFN,
314111980,00046,31411198000046,O,1992-06-16,NN,,,2012-01-26T09:12:40,false,4,,,,LD,LES FOULONS,37160,ABILLY,,,37001,,,,,,,,,,,,,,,,,,,2008-04-01,F,,,,,47.51Z,NAFRev2,N,0.73911,46.934851,0.94,street,Les Foulons 37160 Abilly,37001_sstizg,G,LES FOULONS,
314846528,00102,31484652800102,O,2011-02-15,,,,2016-03-30T10:28:34,true,5,,6,,RUE,DES COTEAUX,37160,ABILLY,,,37001,,,,,,,,,,,,,,,,,,,2016-03-29,A,,,,,82.99Z,NAFRev2,N,0.723045,46.942365,0.95,housenumber,6 Rue des Coteaux 37160 Abilly,37001_0017_00006,G,6 RUE DES COTEAUX,
315313544,00019,31531354400019,O,,NN,,,,true,1,,21,,RUE,DU COMMERCE,37160,ABILLY,,,37001,,,,,,,,,,,,,,,,,,,1996-11-30,F,,,,,52.1B,NAF1993,N,0.727922,46.940055,0.95,housenumber,21 Rue du Commerce 37160 Abilly,37001_0015_00021,G,21 RUE DU COMMERCE,
315639245,00028,31563924500028,O,1983-04-01,NN,,4333ZZ,2017-10-09T08:42:17,true,5,,14,,RUE,DES RIVES,37160,ABILLY,,,37001,,,,,,,,,,,,,,,,,,,2017-09-30,F,,,,,43.33Z,NAFRev2,O,0.708843,46.945251,0.84,housenumber,14 Rue de Rives 37160 Abilly,37001_0092_00014,G,14 RUE DE RIVES,
316364140,00012,31636414000012,O,,NN,,,,true,1,,,,RUE,PASTEUR,37160,ABILLY,,,37001,,,,,,,,,,,,,,,,,,,1996-12-31,F,,,,,29.3D,NAF1993,N,0.72793,46.940472,0.94,street,Rue Pasteur 37160 Abilly,37001_0080,G,RUE PASTEUR,
316860006,00014,31686000600014,O,,,,,,true,1,,10,,RUE,DU COMMERCE,37160,ABILLY,,,37001,,,,,,,,,,,,,,,,,,,1991-09-10,F,,,,,55.72,NAP,N,0.728292,46.940131,0.95,housenumber,10 Rue du Commerce 37160 Abilly,37001_0015_00010,G,10 RUE DU COMMERCE,
317055390,00031,31705539000031,O,,NN,,,,true,1,,,,LD,LE MOULIN DE CUFFON,37160,ABILLY,,,37001,,,,,,,,,,,,,,,,,,,,F,,,,,87.07,NAP,N,0.749176,46.932661,0.51,street,Le Moulin Neuf 37160 Abilly,37001_B116,G,LE MOULIN NEUF,
317830487,00029,31783048700029,O,,,,,,true,1,,4,,RUE,DES MOULINS,37160,ABILLY,,,37001,,,,,,,,,,,,,,,,,,,1991-03-27,F,,,,,55.40,NAP,N,0.724583,46.940926,0.95,housenumber,4 Rue des Moulins 37160 Abilly,37001_0065_00004,G,4 RUE DES MOULINS,
320201635,00036,32020163500036,O,1993-08-15,NN,,1101ZQ,2015-03-18T01:00:24,true,3,,,,,LE VIVIER,37160,ABILLY,,,37001,,,,,,,,,,,,,,,,,,,2008-01-01,A,,,,,11.01Z,NAFRev2,N,0.723022,46.930427,0.47,street,Le Puy Chevrier 37160 Abilly,37001_B183,G,LE PUY CHEVRIER,
320574080,00018,32057408000018,O,1980-12-09,NN,,,2008-11-07T00:36:35,false,4,,1,,RUE,DU COMMERCE,37160,ABILLY,,,37001,,,,,,,,,,,,,,,,,,,2003-04-01,F,,,,,93.0D,NAFRev1,N,0.726969,46.940181,0.95,housenumber,1 Rue du Commerce 37160 Abilly,37001_0015_00001,G,1 RUE DU COMMERCE,
320653009,00011,32065300900011,O,1980-12-08,NN,,,2015-05-14T05:18:45,true,5,,,,,MAIRIE,37160,ABILLY,,,37001,,,,,,,,,,,,,,,,,,,2013-12-31,F,,,,,88.10A,NAFRev2,N,0.728916,46.940296,0.91,street,Place de la Mairie 37160 Abilly,37001_0055,G,PLACE DE LA MAIRIE,
321788440,00014,32178844000014,O,1981-01-01,NN,,,2012-03-06T05:01:25,true,5,LE COUVENT,2,,RUE,DES RIVES,37160,ABILLY,,,37001,,,,,,,,,,,,,,,,,,,2012-02-29,F,,,,,01.11Z,NAFRev2,N,0.710142,46.942828,0.84,housenumber,2 Rue de Rives 37160 Abilly,37001_0092_00002,G,2 RUE DE RIVES,
322691213,00019,32269121300019,O,1981-09-16,NN,,,2012-01-06T11:41:47,true,4,,3,,RUE,RABELAIS,37160,ABILLY,,,37001,,,,,,,,,,,,,,,,,,,2011-12-19,F,,,,,47.11B,NAFRev2,N,0.727085,46.940367,0.95,housenumber,3 Rue Rabelais 37160 Abilly,37001_0090_00003,G,3 RUE RABELAIS,
323425694,00045,32342569400045,O,2004-09-01,NN,,,2009-06-27T04:27:42,false,5,ZONE ARTISANALE,,,,LES RIVES,37160,ABILLY,,,37001,,,,,,,,,,,,,,,,,,,2008-06-11,F,,,,,43.21A,NAFRev2,O,0.711626,46.945969,0.82,street,Les Sables de Rives 37160 Abilly,37001_B193,G,LES SABLES DE RIVES,
323425694,00052,32342569400052,O,2008-06-11,01,2019,4321AB,2021-10-27T08:23:24,true,2,ZONE ARTISANALE,3,,RUE,DE LA CHOCOLATERIE,37160,ABILLY,,,37001,,,,,,,,,,,,,,,,,,,2009-01-25,A,,,,,43.21A,NAFRev2,O,0.7154,46.943888,0.95,housenumber,3 Rue de la Chocolaterie 37160 Abilly,37001_0009_00003,G,3 RUE DE LA CHOCOLATERIE,
323912360,00019,32391236000019,O,1982-01-07,NN,,,2017-09-27T04:43:06,true,3,MAIRIE,,,PL,DE LA MAIRIE,37160,ABILLY,,,37001,,,,,,,,,,,,,,,,,,,2008-01-01,A,,,,,01.61Z,NAFRev2,N,0.728916,46.940296,0.83,street,Place de la Mairie 37160 Abilly,37001_0055,G,PLACE DE LA MAIRIE,
324778794,00010,32477879400010,O,,NN,,,,true,1,,25,,RUE,DU COMMERCE,37160,ABILLY,,,37001,,,,,,,,,,,,,,,,,,,,F,,,,,67.01,NAP,N,0.72816,46.940023,0.95,housenumber,25 Rue du Commerce 37160 Abilly,37001_0015_00025,G,25 RUE DU COMMERCE,
324909068,00011,32490906800011,O,1981-01-01,,,,2006-12-15T00:22:34,false,3,,,,,LA PRINCERIE,37160,ABILLY,,,37001,,,,,,,,,,,,,,,,,,,1994-06-08,F,,,,,01.1A,NAF1993,N,0.743385,46.922278,0.94,street,La Princerie 37160 Abilly,37001_9lwm2x,G,LA PRINCERIE,
324909068,00029,32490906800029,O,1999-01-01,NN,,,2008-02-15T09:32:44,true,4,,,,,LES GRANDS CHAMPS,37160,ABILLY,,,37001,,,,,,,,,,,,,,,,,,,2008-01-01,F,,,,,55.20Z,NAFRev2,N,0.731883,46.93006,0.95,street,Les Grands Champs 37160 Abilly,37001_B081,G,LES GRANDS CHAMPS,
325686871,00022,32568687100022,O,,,,,,true,1,,25,,RUE,DU COMMERCE,37160,ABILLY,,,37001,,,,,,,,,,,,,,,,,,,1986-02-16,F,,,,,55.3A,NAF1993,N,0.72816,46.940023,0.95,housenumber,25 Rue du Commerce 37160 Abilly,37001_0015_00025,G,25 RUE DU COMMERCE,
325848653,00029,32584865300029,O,2011-02-01,,,,2014-07-08T00:30:25,true,2,,21,,RUE,DE RIVES,37160,ABILLY,,,37001,,,,,,,,,,,,,,,,,,,2013-06-30,F,,,,,82.19Z,NAFRev2,N,0.709054,46.944895,0.95,housenumber,21 Rue de Rives 37160 Abilly,37001_0092_00021,G,21 RUE DE RIVES,
326176799,00012,32617679900012,O,1983-01-03,NN,,,2008-11-07T00:43:31,true,3,,,,LD,LES SABLES DE RIVES,37160,ABILLY,,,37001,,,,,,,,,,,,,,,,,,,2007-01-31,F,,,,,50.2Z,NAFRev1,N,0.711626,46.945969,0.94,street,Les Sables de Rives 37160 Abilly,37001_B193,G,LES SABLES DE RIVES,
327080149,00120,32708014900120,O,2012-01-01,,,,2014-01-13T08:24:17,false,1,,,,LD,LA PIECE DE BERGERESSE,37160,ABILLY,,,37001,,,,,,,,,,,,,,,,,,,2012-01-01,A,,,,,08.12Z,NAFRev2,N,0.728257,46.913015,0.94,street,La Piece de Bergeresse 37160 Abilly,37001_B126,G,LA PIECE DE BERGERESSE,
328898804,00021,32889880400021,O,1995-06-22,NN,,,2013-10-16T10:06:41,false,4,,,,,LA BERGERESSE,37160,ABILLY,,,37001,,,,,,,,,,,,,,,,,,,2012-05-15,F,,,,,08.12Z,NAFRev2,N,0.728257,46.913015,0.86,street,La Piece de Bergeresse 37160 Abilly,37001_B126,G,LA PIECE DE BERGERESSE,
329534630,00010,32953463000010,O,,NN,,,,true,1,,,,,LES FORGES,37160,ABILLY,,,37001,,,,,,,,,,,,,,,,,,,1995-12-07,F,,,,,52.4N,NAF1993,O,0.71859,46.94234,0.94,street,Les Forges 37160 Abilly,37001_o7wvpu,G,LES FORGES,
329677157,00029,32967715700029,O,1900-01-01,NN,,,2011-04-28T00:25:04,false,3,,2,,AV,DES TERMELLES,37160,ABILLY,,,37001,,,,,,,,,,,,,,,,,,,1994-03-29,F,,,,,71.4B,NAF1993,N,0.726562,46.939803,0.85,housenumber,2 Avenue des Termelles 37160 Abilly,37001_0095_00002,G,2 AVENUE DES TERMELLES,
329717243,00011,32971724300011,O,,NN,,,,true,1,,,,LD,LA VOIERIE,37160,ABILLY,,,37001,,,,,,,,,,,,,,,,,,,1989-12-31,F,,,,,01.07,NAP,N,0.747091,46.95231,0.7,street,La Voirie 37160 Abilly,37001_ljojk4,G,LA VOIRIE,
329794986,00011,32979498600011,O,1984-04-30,NN,,,2008-01-04T19:53:11,true,3,,,,LD,LES DAVIERES,37160,ABILLY,,,37001,,,,,,,,,,,,,,,,,,,2008-01-01,A,,,,,01.11Z,NAFRev2,N,0.753561,46.935532,0.55,street,La Basse Daviere 37160 Abilly,37001_B007,G,LA BASSE DAVIERE,
330078783,00041,33007878300041,O,2003-06-14,NN,,,2008-11-07T00:48:23,true,3,,,,,LES VALLEES,37160,ABILLY,,,37001,,,,,,,,,,,,,,,,,,,2003-12-25,F,,,,,52.6E,NAFRev1,N,0.753047,46.927982,0.94,street,Les Vallees 37160 Abilly,37001_98ibzc,G,LES VALLEES,
331570341,00023,33157034100023,O,,NN,,,,true,1,,,,LD,LA TOURNIERE,37160,ABILLY,,,37001,,,,,,,,,,,,,,,,,,,1996-12-31,F,,,,,01.3Z,NAF1993,N,0.741879,46.954074,0.94,street,La Tournière 37160 Abilly,37001_af6la8,G,LA TOURNIERE,
332705482,00013,33270548200013,O,1985-01-01,NN,,,2018-09-29T12:27:42,true,3,,,,,CHIZAY,37160,ABILLY,,,37001,,,,,,,,,,,,,,,,,,,2008-01-01,A,,,,,68.20B,NAFRev2,N,0.705181,46.952532,0.92,street,Chemin de Chizay 37160 Abilly,37001_0011,G,CHEMIN DE CHIZAY,
332705482,00021,33270548200021,O,2007-06-20,,,,2021-02-23T10:52:23,false,2,,,,,CHIZAY,37160,ABILLY,,,37001,,,,,,,,,,,,,,,,,,,2008-01-01,A,,,,,66.21Z,NAFRev2,N,0.705181,46.952532,0.92,street,Chemin de Chizay 37160 Abilly,37001_0011,G,CHEMIN DE CHIZAY,
333054070,00011,33305407000011,O,,NN,,,,true,1,,,,LD,RIVES,37160,ABILLY,,,37001,,,,,,,,,,,,,,,,,,,,F,,,,,62.46,NAP,N,0.70881,46.942188,0.94,street,Rives 37160 Abilly,37001_aabug0,G,RIVES,
333160836,00016,33316083600016,O,1985-07-01,NN,,,2021-05-11T03:45:01,true,3,,,,,ANCIEN COUVENT DE RIVES,37160,ABILLY,,,37001,,,,,,,,,,,,,,,,,,,2008-01-01,A,,,,,68.20B,NAFRev2,N,0.70751,46.941202,0.94,street,Ancien Couvent de Rives 37160 Abilly,37001_B001,G,ANCIEN COUVENT DE RIVES,
333160844,00010,33316084400010,O,1985-05-21,NN,,,2019-03-29T03:42:38,true,4,,,,,MAIRIE,37160,ABILLY,,,37001,,,,,,,,,,,,,,,,,,,2008-01-01,A,,,,,08.11Z,NAFRev2,N,0.728916,46.940296,0.91,street,Place de la Mairie 37160 Abilly,37001_0055,G,PLACE DE LA MAIRIE,
333389609,00020,33338960900020,O,1990-01-01,NN,,,2010-08-18T09:07:00,false,4,,,,,LE PUYS CHEVRIER,37160,ABILLY,,,37001,,,,,,,,,,,,,,,,,,,2008-08-01,F,,,,,01.11Z,NAFRev2,N,0.723022,46.930427,0.79,street,Le Puy Chevrier 37160 Abilly,37001_B183,G,LE PUY CHEVRIER,
333389609,00038,33338960900038,O,2005-01-01,,,4312BA,2020-10-05T09:27:37,true,4,,,,,LE PUY CHEVRIER,37160,ABILLY,,,37001,,,,,,,,,,,,,,,,,,,2020-10-05,A,,,,,43.12A,NAFRev2,N,0.723022,46.930427,0.94,street,Le Puy Chevrier 37160 Abilly,37001_B183,G,LE PUY CHEVRIER,
333829240,00014,33382924000014,O,,NN,,,,true,1,,,,LD,LE MOULIN DE RIVES,37160,ABILLY,,,37001,,,,,,,,,,,,,,,,,,,,F,,,,,57.05,NAP,N,0.711626,46.945969,0.51,street,Les Sables de Rives 37160 Abilly,37001_B193,G,LES SABLES DE RIVES,
334339116,00017,33433911600017,O,1900-01-01,NN,,,2021-02-25T11:11:12,false,3,,9,,RUE,DU COMMERCE,37160,ABILLY,,,37001,,,,,,,,,,,,,,,,,,,1993-03-19,F,,,,,45.4C,NAF1993,N,0.727276,46.939945,0.95,housenumber,9 Rue du Commerce 37160 Abilly,37001_0015_00009,G,9 RUE DU COMMERCE,
337572168,00017,33757216800017,O,,NN,,,,true,1,,,,,RIVES,37160,ABILLY,,,37001,,,,,,,,,,,,,,,,,,,1988-05-23,F,,,,,52.6E,NAF1993,N,0.70881,46.942188,0.94,street,Rives 37160 Abilly,37001_aabug0,G,RIVES,
337920359,00011,33792035900011,O,,NN,,,,true,1,,,,,LA TOUCHE,37160,ABILLY,,,37001,,,,,,,,,,,,,,,,,,,1988-12-31,F,,,,,01.07,NAP,N,0.705249,46.927923,0.94,street,La Touche 37160 Abilly,37001_nshdts,G,LA TOUCHE,
338661960,00017,33866196000017,O,1986-07-01,NN,,,2010-04-18T04:44:45,false,5,,,,LD,LE MOULIN DE RIVES,37160,ABILLY,,,37001,,,,,,,,,,,,,,,,,,,2008-02-29,F,,,,,10.20Z,NAFRev2,O,0.711626,46.945969,0.51,street,Les Sables de Rives 37160 Abilly,37001_B193,G,LES SABLES DE RIVES,
338661960,00041,33866196000041,O,1996-01-01,NN,,,2018-09-29T12:31:14,false,4,,,,,RIVES,37160,ABILLY,,,37001,,,,,,,,,,,,,,,,,,,2008-01-01,A,,,,,01.47Z,NAFRev2,N,0.70881,46.942188,0.94,street,Rives 37160 Abilly,37001_aabug0,G,RIVES,
338925308,00011,33892530800011,O,,NN,,,,true,1,,10,,RUE,DU COMMERCE,37160,ABILLY,,,37001,,,,,,,,,,,,,,,,,,,1987-06-12,F,,,,,78.02,NAP,N,0.728292,46.940131,0.95,housenumber,10 Rue du Commerce 37160 Abilly,37001_0015_00010,G,10 RUE DU COMMERCE,
339023293,00030,33902329300030,O,2017-06-20,,,,2019-02-07T07:37:10,false,2,LA VOIRIE,,,,,37160,ABILLY,,,37001,,,,,,,,,,,,,,,,,,,2019-01-31,F,,,,,68.31Z,NAFRev2,N,0.747091,46.95231,0.94,street,La Voirie 37160 Abilly,37001_ljojk4,D,LA VOIRIE,
339558827,00020,33955882700020,O,,NN,,,,true,1,,18,,RUE,DE LA MERCAUDERIE,37160,ABILLY,,,37001,,,,,,,,,,,,,,,,,,,1989-08-31,F,,,,,60.09,NAP,N,0.72857,46.942736,0.84,housenumber,18 Rue de la Marcauderie 37160 Abilly,37001_0060_00018,G,18 RUE DE LA MARCAUDERIE,
339918724,00016,33991872400016,O,,,,,,true,1,,,,RUE,DE LA MAIRIE,37160,ABILLY,,,37001,,,,,,,,,,,,,,,,,,,1993-03-31,F,,,,,55.1A,NAF1993,N,0.728916,46.940296,0.77,street,Place de la Mairie 37160 Abilly,37001_0055,G,PLACE DE LA MAIRIE,
340403377,00013,34040337700013,O,1987-02-01,NN,,,2008-01-04T21:41:40,true,3,,,,,LES DAVIERES,37160,ABILLY,,,37001,,,,,,,,,,,,,,,,,,,2008-01-01,A,,,,,01.11Z,NAFRev2,N,0.753561,46.935532,0.55,street,La Basse Daviere 37160 Abilly,37001_B007,G,LA BASSE DAVIERE,
341456630,00019,34145663000019,O,1987-06-01,NN,,,,true,4,,,,,LA COTINIERE,37160,ABILLY,,,37001,,,,,,,,,,,,,,,,,,,1991-12-25,F,,,,,55.10,NAP,N,0.747435,46.956792,0.94,street,La Cotiniere 37160 Abilly,37001_7jayie,G,LA COTINIERE,
341745719,00011,34174571900011,O,1986-08-01,01,2019,,2021-10-27T08:34:36,true,4,,,,,BOIS MESLIN,37160,ABILLY,,,37001,,,,,,,,,,,,,,,,,,,2012-12-31,A,,,,,01.50Z,NAFRev2,O,0.732202,46.953098,0.93,street,Le Bois Meslin 37160 Abilly,37001_B017,G,LE BOIS MESLIN,
341797728,00019,34179772800019,O,,NN,,,,true,1,,,,,LE MARAIS,37160,ABILLY,,,37001,,,,,,,,,,,,,,,,,,,1993-12-15,F,,,,,45.4A,NAF1993,N,0.705034,46.962094,0.94,street,Le Marais 37160 Abilly,37001_heyz3g,G,LE MARAIS,
341844967,00016,34184496700016,O,2013-04-01,NN,,,2013-09-13T10:16:12,true,3,,,,,LA COTINIERE,37160,ABILLY,,,37001,,,,,,,,,,,,,,,,,,,2013-04-01,A,,,,,01.11Z,NAFRev2,N,0.747435,46.956792,0.94,street,La Cotiniere 37160 Abilly,37001_7jayie,G,LA COTINIERE,
341891497,00016,34189149700016,O,,NN,,,,true,1,,,,,LA PIERRE A VINAIGRE,37160,ABILLY,,,37001,,,,,,,,,,,,,,,,,,,1989-09-23,F,,,,,80.08,NAP,N,0.728257,46.913015,0.34,street,La Piece de Bergeresse 37160 Abilly,37001_B126,G,LA PIECE DE BERGERESSE,
342221017,00011,34222101700011,O,1987-09-01,NN,,,2008-11-08T00:16:05,false,3,,,,,LES FORGES,37160,ABILLY,,,37001,,,,,,,,,,,,,,,,,,,2004-09-16,F,,,,,45.4C,NAFRev1,N,0.71859,46.94234,0.94,street,Les Forges 37160 Abilly,37001_o7wvpu,G,LES FORGES,
342221017,00029,34222101700029,O,2004-09-16,,,,2014-07-08T00:46:52,true,4,,3,,RUE,DE LA CHOCOLATERIE,37160,ABILLY,,,37001,,,,,,,,,,,,,,,,,,,2009-12-31,F,,,,,43.32A,NAFRev2,N,0.7154,46.943888,0.95,housenumber,3 Rue de la Chocolaterie 37160 Abilly,37001_0009_00003,G,3 RUE DE LA CHOCOLATERIE,
342533171,00019,34253317100019,O,1987-09-17,NN,,,2006-10-27T03:15:38,true,3,,,,,BAS RIBAULT,37160,ABILLY,,,37001,,,,,,,,,,,,,,,,,,,2005-10-31,F,,,,,70.1D,NAFRev1,N,0.709489,46.964599,0.48,street,Le Haut Ribeault 37160 Abilly,37001_B092,G,LE HAUT RIBEAULT,
342595881,00018,34259588100018,O,,NN,,,,true,1,,,,,BERGERESSE,37160,ABILLY,,,37001,,,,,,,,,,,,,,,,,,,1993-12-31,F,,,,,01.1A,NAF1993,N,0.72789,46.913713,0.95,street,Bergeresse 37160 Abilly,37001_8mhft4,G,BERGERESSE,
342785383,00015,34278538300015,O,1987-11-02,NN,,,,true,1,,5,,RUE,DES FONDERIES,37160,ABILLY,,,37001,,,,,,,,,,,,,,,,,,,2001-05-29,F,,,,,27.5A,NAF1993,O,0.729302,46.939547,0.95,housenumber,5 Rue des Fonderies 37160 Abilly,37001_0035_00005,G,5 RUE DES FONDERIES,
343607719,00014,34360771900014,O,1900-01-01,,,,2011-04-28T00:36:21,false,3,,,,,BEAUREGARD,37160,ABILLY,,,37001,,,,,,,,,,,,,,,,,,,1996-12-31,F,,,,,01.1A,NAF1993,N,0.706539,46.962583,0.94,street,Beauregard 37160 Abilly,37001_oyuvh9,G,BEAUREGARD,