siren,nic,siret,statutDiffusionEtablissement,dateCreationEtablissement,trancheEffectifsEtablissement,anneeEffectifsEtablissement,activitePrincipaleRegistreMetiersEtablissement,dateDernierTraitementEtablissement,etablissementSiege,nombrePeriodesEtablissement,complementAdresseEtablissement,numeroVoieEtablissement,indiceRepetitionEtablissement,typeVoieEtablissement,libelleVoieEtablissement,codePostalEtablissement,libelleCommuneEtablissement,libelleCommuneEtrangerEtablissement,distributionSpecialeEtablissement,codeCommuneEtablissement,codeCedexEtablissement,libelleCedexEtablissement,codePaysEtrangerEtablissement,libellePaysEtrangerEtablissement,complementAdresse2Etablissement,numeroVoie2Etablissement,indiceRepetition2Etablissement,typeVoie2Etablissement,libelleVoie2Etablissement,codePostal2Etablissement,libelleCommune2Etablissement,libelleCommuneEtranger2Etablissement,distributionSpeciale2Etablissement,codeCommune2Etablissement,codeCedex2Etablissement,libelleCedex2Etablissement,codePaysEtranger2Etablissement,libellePaysEtranger2Etablissement,dateDebut,etatAdministratifEtablissement,enseigne1Etablissement,enseigne2Etablissement,enseigne3Etablissement,denominationUsuelleEtablissement,activitePrincipaleEtablissement,nomenclatureActivitePrincipaleEtablissement,caractereEmployeurEtablissement,longitude,latitude,geo_score,geo_type,geo_adresse,geo_id,geo_ligne,geo_l4,geo_l5
213801574,00012,21380157400012,O,1983-03-01,12,2019,,2021-10-27T08:08:09,true,4,,210,,RUE,DE L'EUROPE,38780,ESTRABLIN,,,38157,,,,,,,,,,,,,,,,,,,2008-01-01,A,MAIRIE,,,,84.11Z,NAFRev2,O,4.960441,45.517057,0.8,street,Rue de l’Europe 38780 Estrablin,38157_0592,G,RUE DE L EUROPE,
213801574,00020,21380157400020,O,1983-12-21,NN,,,,false,4,,,,,,38780,ESTRABLIN,,,38157,,,,,,,,,,,,,,,,,,,1997-12-31,F,ECOLE PRIMAIRE PUB MIXTE 1-0455N,,,,80.1Z,NAF1993,O,,,0,,,,,,
213801574,00038,21380157400038,O,1983-12-21,NN,,,2009-10-24T03:23:31,false,4,,,,,,38780,ESTRABLIN,,,38157,,,,,,,,,,,,,,,,,,,2008-08-31,F,ECOLE MATERNELLE PUBLIQUE,,,,85.10Z,NAFRev2,N,,,0,,,,,,
213801574,00046,21380157400046,O,1983-12-21,NN,,,,false,4,,,,,,38780,ESTRABLIN,,,38157,,,,,,,,,,,,,,,,,,,1997-12-31,F,ECOLE PRIMAIRE PUB MIXTE 2-0456P,,,,80.1Z,NAF1993,N,,,0,,,,,,
213801574,00053,21380157400053,O,1983-12-21,00,2019,,2021-10-27T08:08:09,false,4,,,,,,38780,ESTRABLIN,,,38157,,,,,,,,,,,,,,,,,,,2019-12-25,F,ECOLE PRIMAIRE PUBLIQUE LA ROSIERE,,,,85.20Z,NAFRev2,N,,,0,,,,,,
213801574,00061,21380157400061,O,1995-09-01,12,2019,,2021-10-27T08:08:09,false,4,,2,,RUE,DES CHATONS,38780,ESTRABLIN,,,38157,,,,,,,,,,,,,,,,,,,2008-01-01,A,ECOLE PRIMAIRE PUB LOUISE MICHEL,,,,85.20Z,NAFRev2,N,4.962694,45.515672,0.74,housenumber,2 Allee des Chatons 38780 Estrablin,38157_0469_00002,G,2 ALLEE DES CHATONS,
213801574,00079,21380157400079,O,1997-01-01,NN,,,2013-10-05T12:21:50,false,4,MAIRIE,,,,,38780,ESTRABLIN,,,38157,,,,,,,,,,,,,,,,,,,2012-12-25,F,SCE ASSAINISSEMENT,,,,37.00Z,NAFRev2,N,4.959496,45.504113,0.51,locality,Prairies sous Puzin 38780 Estrablin,38157_B072,D,PRAIRIES SOUS PUZIN,
213801574,00087,21380157400087,O,2000-01-01,NN,,,2020-07-21T10:17:56,false,3,MAIRIE,210,,RUE,DE L'EUROPE,38780,ESTRABLIN,,,38157,,,,,,,,,,,,,,,,,,,2008-01-01,A,BUDGET ANNEXE LIVRE HISTORIQUE,,,,84.12Z,NAFRev2,N,4.960441,45.517057,0.8,street,Rue de l’Europe 38780 Estrablin,38157_0592,G,RUE DE L EUROPE,
253802482,00013,25380248200013,O,1983-03-01,00,2019,,2021-10-27T08:12:09,false,5,1ER ETAGE,,,,MAISON DES SOCIETES,38780,ESTRABLIN,,,38157,,,,,,,,,,,,,,,,,,,2019-01-24,F,,,,,84.12Z,NAFRev2,O,2.948133,50.3095935,0.9,poi.community_centre,Maison des Sociétés (Salle des fêtes) Biache-Saint-Vaast,https://osm.org/way/247232155,G,,
253803431,00019,25380343100019,O,1986-11-13,NN,,,2006-11-25T09:09:08,false,4,MAIRIE,,,,,38780,ESTRABLIN,,,38157,,,,,,,,,,,,,,,,,,,1997-12-31,F,,,,,70.1C,NAF1993,N,4.959496,45.504113,0.51,locality,Prairies sous Puzin 38780 Estrablin,38157_B072,D,PRAIRIES SOUS PUZIN,
263804783,00011,26380478300011,O,1994-01-01,NN,,,2020-07-21T10:27:02,true,5,MAIRIE,210,,RUE,DE L'EUROPE,38780,ESTRABLIN,,,38157,,,,,,,,,,,,,,,,,,,2019-12-25,A,,,,,88.99B,NAFRev2,N,4.960441,45.517057,0.8,street,Rue de l’Europe 38780 Estrablin,38157_0592,G,RUE DE L EUROPE,
300427655,00026,30042765500026,O,,NN,,,,true,1,,711,,RTE,DES ALLOBROGES,38780,ESTRABLIN,,,38157,,,,,,,,,,,,,,,,,,,2002-10-27,F,,,,,45.4D,NAF1993,O,4.983682,45.514383,0.87,housenumber,711 Route des Allobroges 38780 Estrablin,38157_0374_00711,G,711 ROUTE DES ALLOBROGES,
300451929,00024,30045192900024,O,,NN,,,,true,1,,711,,RTE,DES ALLOBROGES,38780,ESTRABLIN,,,38157,,,,,,,,,,,,,,,,,,,2002-10-27,F,,,,,45.4D,NAF1993,N,4.983682,45.514383,0.87,housenumber,711 Route des Allobroges 38780 Estrablin,38157_0374_00711,G,711 ROUTE DES ALLOBROGES,
300453032,00025,30045303200025,O,1900-01-01,NN,,,2008-11-07T00:16:44,true,4,,711,,RTE,DES ALLOBROGES,38780,ESTRABLIN,,,38157,,,,,,,,,,,,,,,,,,,2003-12-25,F,,,,,45.4D,NAFRev1,N,4.983682,45.514383,0.87,housenumber,711 Route des Allobroges 38780 Estrablin,38157_0374_00711,G,711 ROUTE DES ALLOBROGES,
300506227,00010,30050622700010,O,,,,,,true,1,,53,,AV,GAL DE GAULLE,38780,ESTRABLIN,,,38157,,,,,,,,,,,,,,,,,,,1984-12-25,F,,,,,69.12,NAP,N,6.9086741,43.6636852,0.73,poi,Avenue Général de Gaulle (Pont) Grasse,https://osm.org/way/67487473,G,,
301284022,00029,30128402200029,O,,,,,,true,1,,10,,,LES HAUTS DE MICHALIN,38780,ESTRABLIN,,,38157,,,,,,,,,,,,,,,,,,,1984-12-25,F,,,,,55.71,NAP,N,4.969403,45.517376,0.85,housenumber,10 Les Hauts du Michalin 38780 Estrablin,38157_w373cy_00010,G,10 LES HAUTS DU MICHALIN,
301642104,00097,30164210400097,O,2000-01-01,NN,,,,false,4,CHATEAU PLANTIER,,,,,38780,ESTRABLIN,,,38157,,,,,,,,,,,,,,,,,,,2002-06-28,F,,,,,85.3K,NAF1993,N,4.954491,45.498536,0.5,locality,Plantier Ouest 38780 Estrablin,38157_B067,D,PLANTIER OUEST,
301679478,00018,30167947800018,O,,,,,,true,1,,,,,LA TABOURETTE,38780,ESTRABLIN,,,38157,,,,,,,,,,,,,,,,,,,1984-12-25,F,,,,,81.21,NAP,N,4.938683,45.516235,0.94,street,Route de la Tabourette 38780 Estrablin,38157_1352,G,ROUTE DE LA TABOURETTE,
301739546,00044,30173954600044,O,2002-07-17,NN,,,,false,4,,176,,,VEZONNE,38780,ESTRABLIN,,,38157,,,,,,,,,,,,,,,,,,,2003-10-20,F,,,,,52.6D,NAFRev1,N,4.964432,45.515073,0.86,housenumber,176 Rue de la Vézonne 38780 Estrablin,38157_0188_00176,G,176 RUE DE LA VEZONNE,
301836086,00019,30183608600019,O,,,,,,true,1,,,,,LE LOGIS NEUF,38780,ESTRABLIN,,,38157,,,,,,,,,,,,,,,,,,,1984-12-25,F,,,,,67.01,NAP,N,4.955613,45.51506,0.93,street,Lieu Dit le Logis Neuf 38780 Estrablin,38157_B092,G,LIEU DIT LE LOGIS NEUF,
302188966,00014,30218896600014,O,,,,,,true,1,,,,,,38780,ESTRABLIN,,,38157,,,,,,,,,,,,,,,,,,,1984-12-25,F,,,,,64.24,NAP,N,,,0,,,,,,
302280755,00075,30228075500075,O,1998-11-01,12,2019,,2021-10-27T08:14:18,false,4,ZA DU ROCHER,,,,,38780,ESTRABLIN,,,38157,,,,,,,,,,,,,,,,,,,2008-01-01,A,,,,,43.99C,NAFRev2,O,4.929436,45.516942,0.94,street,ZA du Rocher 38780 Estrablin,38157_A058,D,ZA DU ROCHER,
302623277,00027,30262327700027,O,1986-07-30,,,,,true,1,,14,,,LES HAUTS DU MICHALIN,38780,ESTRABLIN,,,38157,,,,,,,,,,,,,,,,,,,2000-12-29,F,,,,,45.4J,NAF1993,N,4.969759,45.518063,0.96,housenumber,14 Les Hauts du Michalin 38780 Estrablin,38157_w373cy_00014,G,14 LES HAUTS DU MICHALIN,
302675327,00027,30267532700027,O,1900-01-01,,,,2006-12-15T00:15:20,false,4,,,,,LA SUZE,38780,ESTRABLIN,,,38157,,,,,,,,,,,,,,,,,,,1999-10-29,F,,,,,70.2C,NAF1993,N,4.925627,45.503514,0.95,street,La Suze 38780 Estrablin,38157_k2d1uu,G,LA SUZE,
302675327,00035,30267532700035,O,2002-03-18,NN,,,2021-11-15T10:02:25,true,5,,919,,RTE,LA ROSIERE,38780,ESTRABLIN,,,38157,,,,,,,,,,,,,,,,,,,2022-01-01,A,JPC VHU,,,JPC VHU,46.77Z,NAFRev2,N,4.950131,45.492649,0.86,housenumber,919 Route de la Rosiere 38780 Estrablin,38157_0113_00919,G,919 ROUTE DE LA ROSIERE,
302675327,00043,30267532700043,O,2014-10-01,,,,2015-12-03T09:58:49,false,2,,980,,RTE,DE LA ROSIERE,38780,ESTRABLIN,,,38157,,,,,,,,,,,,,,,,,,,2014-12-03,F,,,,,01.47Z,NAFRev2,N,4.949728,45.492106,0.88,housenumber,980 Route de la Rosiere 38780 Estrablin,38157_0113_00980,G,980 ROUTE DE LA ROSIERE,
302826243,00016,30282624300016,O,1977-01-01,03,2019,4332AA,2021-10-27T08:14:29,true,4,,1475,,RTE,DE LA TABOURETTE,38780,ESTRABLIN,,,38157,,,,,,,,,,,,,,,,,,,2008-01-01,A,,,,,47.52A,NAFRev2,O,4.932979,45.516021,0.89,housenumber,1475 Route de la Tabourette 38780 Estrablin,38157_1352_01475,G,1475 ROUTE DE LA TABOURETTE,
302826250,00011,30282625000011,O,,,,,,true,1,,,,LD,LOGIS NEUF,38780,ESTRABLIN,,,38157,,,,,,,,,,,,,,,,,,,1987-06-10,F,,,,,67.04,NAP,N,4.957097,45.51198,0.93,locality,Logis Neuf Est 38780 Estrablin,38157_B050,G,LOGIS NEUF EST,
302826268,00013,30282626800013,O,,,,,,true,1,,,,,,38780,ESTRABLIN,,,38157,,,,,,,,,,,,,,,,,,,1984-12-25,F,,,,,00.97,NAP,N,,,0,,,,,,
303692057,00019,30369205700019,O,,NN,,,,true,1,,,,,,38780,ESTRABLIN,,,38157,,,,,,,,,,,,,,,,,,,1994-05-31,F,,,,,45.3F,NAF1993,N,,,0,,,,,,
305435703,00023,30543570300023,O,2009-01-06,,,,2016-11-10T03:23:53,true,2,,18,,,LE PLAN DE GEMENS,38780,ESTRABLIN,,,38157,,,,,,,,,,,,,,,,,,,2016-09-30,F,,,,,47.89Z,NAFRev2,N,4.938823,45.506265,0.96,housenumber,18 Le Plan de Gemens 38780 Estrablin,38157_b063_00018,G,18 LE PLAN DE GEMENS,
305647687,00014,30564768700014,O,,,,,,true,1,,,,,LE MICHALIN,38780,ESTRABLIN,,,38157,,,,,,,,,,,,,,,,,,,1984-12-25,F,,,,,77.01,NAP,N,4.968121,45.517445,0.93,street,Lotissement le Michalin 38780 Estrablin,38157_A019,G,LOTISSEMENT LE MICHALIN,
305933004,00478,30593300400478,O,2019-06-11,,,,2019-07-08T11:12:29,false,1,ZA DE L ABBAYE NORD,333,,RUE,DENIS CRAPON,38780,ESTRABLIN,,,38157,,,,,,,,,,,,,,,,,,,2019-06-11,A,,,,,88.10C,NAFRev2,O,4.960441,45.517057,0.32,street,Rue de l’Europe 38780 Estrablin,38157_0592,G,RUE DE L EUROPE,
306857962,00014,30685796200014,O,,,,,,true,1,,,,,LE MICHALIN,38780,ESTRABLIN,,,38157,,,,,,,,,,,,,,,,,,,1984-12-25,F,,,,,77.12,NAP,N,4.968121,45.517445,0.93,street,Lotissement le Michalin 38780 Estrablin,38157_A019,G,LOTISSEMENT LE MICHALIN,
307812560,00018,30781256000018,O,,NN,,,,true,1,,,,,LA ROSIERE,38780,ESTRABLIN,,,38157,,,,,,,,,,,,,,,,,,,,F,,,,,55.71,NAP,N,4.95085,45.493282,0.93,street,Route de la Rosiere 38780 Estrablin,38157_0113,G,ROUTE DE LA ROSIERE,
309147338,00052,30914733800052,O,1996-08-01,NN,,,2017-05-04T02:08:56,true,4,LE VILLAGE,,,RUE,DU CENTRE,38780,ESTRABLIN,,,38157,,,,,,,,,,,,,,,,,,,2015-12-31,F,,,,,86.21Z,NAFRev2,O,4.96962,45.515841,0.5,street,Rue du Dauphiné 38780 Estrablin,38157_0509,G,RUE DU DAUPHINE,
309220515,00014,30922051500014,O,,NN,,,,true,1,,,,,LA ROSIERE,38780,ESTRABLIN,,,38157,,,,,,,,,,,,,,,,,,,,F,,,,,01.00,NAP,N,4.95085,45.493282,0.93,street,Route de la Rosiere 38780 Estrablin,38157_0113,G,ROUTE DE LA ROSIERE,
309304616,02791,30930461602791,O,2006-04-28,02,2019,,2021-10-27T08:16:44,false,3,ZA DU ROCHER,502,,,ANCIENNE ROUTE NATIONALE,38780,ESTRABLIN,,,38157,,,,,,,,,,,,,,,,,,,2008-09-18,A,REXEL,,,,46.69A,NAFRev2,O,4.929436,45.516942,0.4,street,ZA du Rocher 38780 Estrablin,38157_A058,D,ZA DU ROCHER,
309914984,00021,30991498400021,O,1900-01-01,NN,,2599BA,2021-02-08T12:17:22,true,5,,10,,,LE JANIN,38780,ESTRABLIN,,,38157,,,,,,,,,,,,,,,,,,,2021-02-08,A,,,,FOURMI-CREATIONS,32.99Z,NAFRev2,N,4.947645,45.501084,0.94,street,Le Janin 38780 Estrablin,38157_4l40st,G,LE JANIN,
310164751,00037,31016475100037,O,,NN,,,,true,1,,,,LD,LE JANIN,38780,ESTRABLIN,,,38157,,,,,,,,,,,,,,,,,,,,F,,,,,55.60,NAP,N,4.947645,45.501084,0.94,street,Le Janin 38780 Estrablin,38157_4l40st,G,LE JANIN,
310325014,00028,31032501400028,O,,,,,,true,1,,,,LD,LE MICHALIN,38780,ESTRABLIN,,,38157,,,,,,,,,,,,,,,,,,,1990-10-09,F,,,,,55.10,NAP,N,4.968121,45.517445,0.93,street,Lotissement le Michalin 38780 Estrablin,38157_A019,G,LOTISSEMENT LE MICHALIN,
310768437,00025,31076843700025,O,,,,,,true,1,,,,LD,GEMENS,38780,ESTRABLIN,,,38157,,,,,,,,,,,,,,,,,,,1984-12-25,F,,,,,55.60,NAP,N,4.929227,45.511731,0.95,street,Gemens 38780 Estrablin,38157_8l8tik,G,GEMENS,
311353882,00013,31135388200013,O,,NN,,,,true,1,,,,,LA GABETIERE,38780,ESTRABLIN,,,38157,,,,,,,,,,,,,,,,,,,2002-01-15,F,,,,,55.1A,NAF1993,O,4.986807,45.524974,0.58,street,La Roussetiere 38780 Estrablin,38157_d2ap2z,G,LA ROUSSETIERE,
311501332,00010,31150133200010,O,1977-01-01,NN,,,2013-05-18T02:42:37,true,5,,,,,VOIE COMMUNALE N 1,38780,ESTRABLIN,,,38157,,,,,,,,,,,,,,,,,,,2011-10-31,F,,,,,47.73Z,NAFRev2,O,,,0,,,,,,
311629109,00019,31162910900019,O,,NN,,,,true,1,,4,,,HLM PRENAY,38780,ESTRABLIN,,,38157,,,,,,,,,,,,,,,,,,,1993-08-31,F,,,,,45.4D,NAF1993,N,,,0,,,,,,
311846836,00014,31184683600014,O,,,,,,true,1,,,,,,38780,ESTRABLIN,,,38157,,,,,,,,,,,,,,,,,,,1984-12-25,F,,,,,64.14,NAP,N,,,0,,,,,,
311846885,00011,31184688500011,O,,,,,,true,1,,,,,,38780,ESTRABLIN,,,38157,,,,,,,,,,,,,,,,,,,1984-12-25,F,,,,,64.11,NAP,N,,,0,,,,,,
312049687,00022,31204968700022,O,,,,,,true,1,,,,,LE GRAND RUINAIS,38780,ESTRABLIN,,,38157,,,,,,,,,,,,,,,,,,,1984-12-25,F,,,,,55.72,NAP,N,4.978409,45.503918,0.95,street,Le Grand Ruinais 38780 Estrablin,38157_B041,G,LE GRAND RUINAIS,
312584014,00020,31258401400020,O,1984-09-01,NN,,,2008-11-07T00:27:44,true,4,,112,,RUE,DE L EUROPE,38780,ESTRABLIN,,,38157,,,,,,,,,,,,,,,,,,,2004-09-30,F,,,,,93.0D,NAFRev1,O,4.963574,45.516772,0.96,housenumber,112 Rue de l’Europe 38780 Estrablin,38157_0592_00112,G,112 RUE DE L EUROPE,
313247488,00015,31324748800015,O,1978-01-01,NN,,,,true,3,,,,,LE GONNON,38780,ESTRABLIN,,,38157,,,,,,,,,,,,,,,,,,,2003-02-17,F,,,,,01.2C,NAFRev1,N,4.999573,45.529002,0.93,locality,Le Gonnon Est 38780 Estrablin,38157_B045,G,LE GONNON EST,
313716730,00020,31371673000020,O,,,,,,true,1,,,,,LA TABOURETTE,38780,ESTRABLIN,,,38157,,,,,,,,,,,,,,,,,,,1997-12-19,F,,,,,70.2C,NAF1993,N,4.938683,45.516235,0.94,street,Route de la Tabourette 38780 Estrablin,38157_1352,G,ROUTE DE LA TABOURETTE,
314209255,00012,31420925500012,O,,NN,,,,true,1,,,,,LA TABOURETTE,38780,ESTRABLIN,,,38157,,,,,,,,,,,,,,,,,,,1991-02-28,F,,,,,69.12,NAP,N,4.938683,45.516235,0.94,street,Route de la Tabourette 38780 Estrablin,38157_1352,G,ROUTE DE LA TABOURETTE,
314349887,00047,31434988700047,O,1900-01-01,NN,,,2011-04-28T00:14:55,false,3,,,,,LES DAMES,38780,ESTRABLIN,,,38157,,,,,,,,,,,,,,,,,,,1992-12-25,F,,,,,45.3E,NAF1993,N,4.973773,45.516941,0.95,street,Les Dames 38780 Estrablin,38157_rd2ayg,G,LES DAMES,
314563586,00036,31456358600036,O,2001-07-01,NN,,,2006-11-25T09:34:44,true,3,,,,,,38780,ESTRABLIN,,,38157,,,,,,,,,,,,,,,,,,,2006-07-31,F,,,,,80.4A,NAFRev1,N,,,0,,,,,,
314770058,00035,31477005800035,O,1993-09-01,NN,,,2021-03-15T10:55:28,false,4,,,,,LES ERABLES,38780,ESTRABLIN,,,38157,,,,,,,,,,,,,,,,,,,2021-01-28,F,,,,,86.90E,NAFRev2,N,4.941231,45.49428,0.66,street,Les 4 Vents 38780 Estrablin,38157_A057,G,LES 4 VENTS,
314770058,00043,31477005800043,O,2021-01-28,,,,2021-06-25T15:31:36,true,2,,118,,RUE,DE L'EUROPE,38780,ESTRABLIN,,,38157,,,,,,,,,,,,,,,,,,,2021-06-30,F,,,,,86.90E,NAFRev2,N,4.963439,45.516781,0.96,housenumber,118 Rue de l’Europe 38780 Estrablin,38157_0592_00118,G,118 RUE DE L EUROPE,
315329110,00045,31532911000045,O,1900-01-01,NN,,1392ZA,2015-03-18T00:59:51,true,7,,1791,,RTE,LE BADOIT,38780,ESTRABLIN,,,38157,,,,,,,,,,,,,,,,,,,2014-12-15,F,,,,CB CREATION DISTRIBUTION PRODUCTION,13.92Z,NAFRev2,N,4.98133,45.526775,0.67,housenumber,1791 Route du Badoit 38780 Estrablin,38157_0403_01791,G,1791 ROUTE DU BADOIT,
315457721,00019,31545772100019,O,,NN,,,,true,1,,,,,,38780,ESTRABLIN,,,38157,,,,,,,,,,,,,,,,,,,,F,,,,,22.02,NAP,N,,,0,,,,,,
315753582,00024,31575358200024,O,1983-12-01,NN,,,2008-11-07T00:31:14,true,4,,,,LD,LA SUZE,38780,ESTRABLIN,,,38157,,,,,,,,,,,,,,,,,,,2003-12-25,F,,,,,45.4C,NAFRev1,N,4.925627,45.503514,0.95,street,La Suze 38780 Estrablin,38157_k2d1uu,G,LA SUZE,
316058080,00052,31605808000052,O,2002-10-21,NN,,,2006-01-09T03:44:19,false,4,,1,,IMP,DES TILLEULS,38780,ESTRABLIN,,,38157,,,,,,,,,,,,,,,,,,,2003-09-01,F,SCM SYLVESTRE MADINIER BLONDEAU,,,,85.1C,NAFRev1,N,4.963859,45.516376,0.7,housenumber,1 Allee des Tilleuls 38780 Estrablin,38157_1372_00001,G,1 ALLEE DES TILLEULS,
316163153,00018,31616315300018,O,1979-01-01,NN,,,,true,1,,,,,LA TABOURETTE,38780,ESTRABLIN,,,38157,,,,,,,,,,,,,,,,,,,1999-06-30,F,,,,,70.2C,NAF1993,N,4.938683,45.516235,0.94,street,Route de la Tabourette 38780 Estrablin,38157_1352,G,ROUTE DE LA TABOURETTE,
316408707,00016,31640870700016,O,1900-01-01,NN,,,,true,4,,,,,LA TABOURETTE,38780,ESTRABLIN,,,38157,,,,,,,,,,,,,,,,,,,1991-12-25,F,,,,,67.01,NAP,N,4.938683,45.516235,0.94,street,Route de la Tabourette 38780 Estrablin,38157_1352,G,ROUTE DE LA TABOURETTE,
316980911,00010,31698091100010,O,,,,,,true,1,,,,,LA SUZE,38780,ESTRABLIN,,,38157,,,,,,,,,,,,,,,,,,,1984-12-25,F,,,,,65.03,NAP,N,4.925627,45.503514,0.95,street,La Suze 38780 Estrablin,38157_k2d1uu,G,LA SUZE,
317836146,00025,31783614600025,O,1900-01-01,NN,,,2013-01-15T08:17:10,false,4,,,,,LA CRAZ,38780,ESTRABLIN,,,38157,,,,,,,,,,,,,,,,,,,1991-12-25,F,,,,,64.24,NAP,N,4.933222,45.499555,0.46,street,La Coupe Sud 38780 Estrablin,38157_B029,G,LA COUPE SUD,
318115714,00012,31811571400012,O,,,,,,true,1,,,,,LES DAMES,38780,ESTRABLIN,,,38157,,,,,,,,,,,,,,,,,,,1988-07-12,F,,,,,55.60,NAP,N,4.973773,45.516941,0.95,street,Les Dames 38780 Estrablin,38157_rd2ayg,G,LES DAMES,
318115789,00022,31811578900022,O,1986-07-21,NN,,8121ZZ,2016-10-21T03:20:28,true,7,,297,,HAM,CHEZ MEUNIER,38780,ESTRABLIN,,,38157,,,,,,,,,,,,,,,,,,,2016-10-04,A,,,,,81.21Z,NAFRev2,N,4.927579,45.506316,0.96,housenumber,297 Chez Meunier 38780 Estrablin,38157_b021_00297,G,297 CHEZ MEUNIER,
318139169,00052,31813916900052,O,2008-07-01,,,,2011-04-03T04:50:51,false,2,,5294,,,PLANTIER OUEST,38780,ESTRABLIN,,,38157,,,,,,,,,,,,,,,,,,,2011-03-31,F,,,,,96.03Z,NAFRev2,N,4.954491,45.498536,0.74,locality,Plantier Ouest 38780 Estrablin,38157_B067,G,PLANTIER OUEST,
318155728,00021,31815572800021,O,2000-10-03,,,,,true,1,,,,,LA TABOURETTE,38780,ESTRABLIN,,,38157,,,,,,,,,,,,,,,,,,,2000-12-31,F,,,,,50.1Z,NAF1993,N,4.938683,45.516235,0.94,street,Route de la Tabourette 38780 Estrablin,38157_1352,G,ROUTE DE LA TABOURETTE,
318313897,00015,31831389700015,O,1980-07-01,NN,,,,true,3,,,,,LA ROSIERE,38780,ESTRABLIN,,,38157,,,,,,,,,,,,,,,,,,,1998-12-25,F,,,,,70.2C,NAF1993,N,4.95085,45.493282,0.93,street,Route de la Rosiere 38780 Estrablin,38157_0113,G,ROUTE DE LA ROSIERE,
318546561,00016,31854656100016,O,,NN,,,,true,1,,,,LD,DONCE LE VEZONNE,38780,ESTRABLIN,,,38157,,,,,,,,,,,,,,,,,,,,F,,,,,64.47,NAP,N,4.964497,45.515246,0.52,street,Rue de la Vézonne 38780 Estrablin,38157_0188,G,RUE DE LA VEZONNE,
318950367,00017,31895036700017,O,,NN,,,,true,1,,,,,LA ROSIERE,38780,ESTRABLIN,,,38157,,,,,,,,,,,,,,,,,,,,F,,,,,55.73,NAP,N,4.95085,45.493282,0.93,street,Route de la Rosiere 38780 Estrablin,38157_0113,G,ROUTE DE LA ROSIERE,
319086393,00018,31908639300018,O,1980-06-01,NN,,,2016-04-17T03:40:43,true,3,ZONE ARTISANALE,,,LD,LA CRAZ,38780,ESTRABLIN,,,38157,,,,,,,,,,,,,,,,,,,2008-01-01,A,,,,,68.20B,NAFRev2,N,4.933222,45.499555,0.46,street,La Coupe Sud 38780 Estrablin,38157_B029,G,LA COUPE SUD,
319342747,00015,31934274700015,O,1980-07-13,NN,,,2018-02-21T03:54:10,true,6,,,,,MAISON DES SOCIETES,38780,ESTRABLIN,,,38157,,,,,,,,,,,,,,,,,,,2018-02-18,A,,,,,55.20Z,NAFRev2,O,2.948133,50.3095935,0.9,poi.community_centre,Maison des Sociétés (Salle des fêtes) Biache-Saint-Vaast,https://osm.org/way/247232155,G,,
319709192,00011,31970919200011,O,,,,,,true,1,,,,,,38780,ESTRABLIN,,,38157,,,,,,,,,,,,,,,,,,,1984-12-25,F,,,,,67.01,NAP,N,,,0,,,,,,
319762134,00025,31976213400025,O,2001-01-01,NN,,,2008-11-07T00:35:38,false,3,,,,,LE GRAND GRILLET,38780,ESTRABLIN,,,38157,,,,,,,,,,,,,,,,,,,2004-05-01,F,,,,,45.3A,NAFRev1,O,4.967221,45.511169,0.8,street,Grand Grillet 38780 Estrablin,38157_5116ac,G,GRAND GRILLET,
319864583,00012,31986458300012,O,,NN,,,,true,1,,,,,LA ROSIERE,38780,ESTRABLIN,,,38157,,,,,,,,,,,,,,,,,,,1988-12-25,F,,,,,67.01,NAP,N,4.95085,45.493282,0.93,street,Route de la Rosiere 38780 Estrablin,38157_0113,G,ROUTE DE LA ROSIERE,
320305691,00018,32030569100018,O,1980-07-29,NN,,,2018-09-29T12:18:22,false,5,,,,,LE VILLAGE,38780,ESTRABLIN,,,38157,,,,,,,,,,,,,,,,,,,2016-12-31,F,,,,,86.23Z,NAFRev2,O,4.969582,45.508819,0.43,street,Le Viannay 38780 Estrablin,38157_boapcn,G,LE VIANNAY,
320305691,00034,32030569100034,O,2019-03-17,,,,2019-07-26T16:50:59,false,2,PONT EVEQUE,353,,CHE,DES PAULIERES,38780,ESTRABLIN,,,38157,,,,,,,,,,,,,,,,,,,2019-07-24,F,,,,,86.23Z,NAFRev2,N,4.985922,45.515684,0.87,housenumber,353 Chemin des Paulières 38780 Estrablin,38157_1160_00353,G,353 CHEMIN DES PAULIERES,
320564289,00017,32056428900017,O,1981-01-01,NN,,,2008-11-07T00:36:34,false,4,,,,,LA ROSIERE,38780,ESTRABLIN,,,38157,,,,,,,,,,,,,,,,,,,1995-12-25,F,,,,,45.1A,NAF1993,O,4.95085,45.493282,0.93,street,Route de la Rosiere 38780 Estrablin,38157_0113,G,ROUTE DE LA ROSIERE,
320940026,00026,32094002600026,O,,NN,,,,true,1,,,,,LE GRAND CRAY,38780,ESTRABLIN,,,38157,,,,,,,,,,,,,,,,,,,1986-03-19,F,,,,,34.2B,NAF1993,N,4.972402,45.508337,0.49,street,Rue le Petit Cray 38780 Estrablin,38157_6nntig,G,RUE LE PETIT CRAY,
321029746,00047,32102974600047,O,2001-01-02,NN,,,,true,4,LE GRAND MARAIS,726,,RUE,DAUPHINE,38780,ESTRABLIN,,,38157,,,,,,,,,,,,,,,,,,,2002-06-23,F,,,,,33.2B,NAF1993,O,4.97396,45.514995,0.95,housenumber,726 Rue du Dauphiné 38780 Estrablin,38157_0509_00726,G,726 RUE DU DAUPHINE,
321128431,00020,32112843100020,O,1986-07-15,,,,,false,4,,,,,CHATEAU GRILLET,38780,ESTRABLIN,,,38157,,,,,,,,,,,,,,,,,,,1996-04-01,F,,,,,50.1Z,NAF1993,N,4.968337,45.510794,0.68,street,Chat Grillet 38780 Estrablin,38157_B014,G,CHAT GRILLET,
321246076,00087,32124607600087,O,1994-01-01,NN,,,,false,4,,,,PL,DE L EGLISE,38780,ESTRABLIN,,,38157,,,,,,,,,,,,,,,,,,,1998-12-31,F,,,,,52.1B,NAF1993,N,4.965321,45.51743,0.76,street,Montée de l’Eglise 38780 Estrablin,38157_0040,G,MONTEE DE L EGLISE,
321554206,00011,32155420600011,O,,,,,,true,1,,,,,LOT BOIS BOLAY,38780,ESTRABLIN,,,38157,,,,,,,,,,,,,,,,,,,1984-12-25,F,,,,,51.10,NAP,N,4.958614,45.517603,0.75,street,Lotissement Bois Balay 38780 Estrablin,38157_A004,G,LOTISSEMENT BOIS BALAY,
321638793,00026,32163879300026,O,,,,,,true,1,,,,,PAVILLON 13 LA ROSIERE,38780,ESTRABLIN,,,38157,,,,,,,,,,,,,,,,,,,,F,,,,,64.40,NAP,N,4.95085,45.493282,0.48,street,Route de la Rosiere 38780 Estrablin,38157_0113,G,ROUTE DE LA ROSIERE,
322213299,00025,32221329900025,O,2007-12-01,02,2019,4332BB,2022-05-23T08:52:48,true,3,ZA LA CRAZ,645,,RTE,DE LA BOUGIE,38780,ESTRABLIN,,,38157,,,,,,,,,,,,,,,,,,,2021-08-03,A,,,,,43.32B,NAFRev2,N,4.944564,45.510737,0.87,housenumber,645 Route de la Bougie 38780 Estrablin,38157_0430_00645,G,645 ROUTE DE LA BOUGIE,
322282815,00016,32228281500016,O,1981-06-18,,,,2017-03-03T04:24:00,true,4,,,,LD,LE PETIT RUINAIS,38780,ESTRABLIN,,,38157,,,,,,,,,,,,,,,,,,,1997-12-25,F,,,,,92.3H,NAF1993,N,4.978409,45.503918,0.57,street,Le Grand Ruinais 38780 Estrablin,38157_B041,G,LE GRAND RUINAIS,
322635061,00037,32263506100037,O,1900-01-01,,,,2011-11-18T00:11:20,true,5,CHATEAU GRILLET,,,,RN 502,38780,ESTRABLIN,,,38157,,,,,,,,,,,,,,,,,,,2009-10-31,F,,,,,43.99C,NAFRev2,N,,,0,,,,,,
322747668,00018,32274766800018,O,,,,,,true,1,,,,,PETIT CRAY,38780,ESTRABLIN,,,38157,,,,,,,,,,,,,,,,,,,1988-12-25,F,,,,,65.02,NAP,N,4.972402,45.508337,0.93,street,Rue le Petit Cray 38780 Estrablin,38157_6nntig,G,RUE LE PETIT CRAY,
322795964,00012,32279596400012,O,,,,,,true,1,,,,,LE JANIN,38780,ESTRABLIN,,,38157,,,,,,,,,,,,,,,,,,,1985-12-25,F,,,,,69.12,NAP,N,4.947645,45.501084,0.94,street,Le Janin 38780 Estrablin,38157_4l40st,G,LE JANIN,
323076612,00015,32307661200015,O,1981-10-01,NN,,,2015-05-14T05:34:20,true,5,ZA LA CRAZ,,,LD,GRAND CRAY,38780,ESTRABLIN,,,38157,,,,,,,,,,,,,,,,,,,2013-11-05,F,,,,,25.62B,NAFRev2,O,4.972322,45.508648,0.54,street,Gd Cray 38780 Estrablin,38157_B038,G,GD CRAY,
323557488,00018,32355748800018,O,,,,,,true,1,,,,,RN 502,38780,ESTRABLIN,,,38157,,,,,,,,,,,,,,,,,,,1984-12-25,F,,,,,65.02,NAP,N,,,0,,,,,,