siren,nic,siret,statutDiffusionEtablissement,dateCreationEtablissement,trancheEffectifsEtablissement,anneeEffectifsEtablissement,activitePrincipaleRegistreMetiersEtablissement,dateDernierTraitementEtablissement,etablissementSiege,nombrePeriodesEtablissement,complementAdresseEtablissement,numeroVoieEtablissement,indiceRepetitionEtablissement,typeVoieEtablissement,libelleVoieEtablissement,codePostalEtablissement,libelleCommuneEtablissement,libelleCommuneEtrangerEtablissement,distributionSpecialeEtablissement,codeCommuneEtablissement,codeCedexEtablissement,libelleCedexEtablissement,codePaysEtrangerEtablissement,libellePaysEtrangerEtablissement,complementAdresse2Etablissement,numeroVoie2Etablissement,indiceRepetition2Etablissement,typeVoie2Etablissement,libelleVoie2Etablissement,codePostal2Etablissement,libelleCommune2Etablissement,libelleCommuneEtranger2Etablissement,distributionSpeciale2Etablissement,codeCommune2Etablissement,codeCedex2Etablissement,libelleCedex2Etablissement,codePaysEtranger2Etablissement,libellePaysEtranger2Etablissement,dateDebut,etatAdministratifEtablissement,enseigne1Etablissement,enseigne2Etablissement,enseigne3Etablissement,denominationUsuelleEtablissement,activitePrincipaleEtablissement,nomenclatureActivitePrincipaleEtablissement,caractereEmployeurEtablissement,longitude,latitude,geo_score,geo_type,geo_adresse,geo_id,geo_ligne,geo_l4,geo_l5
215203670,00017,21520367000017,O,1983-03-01,02,2019,,2021-10-27T08:08:49,true,3,,2,,RUE,DE LA MARNE,52000,VERBIESLES,,,52514,,,,,,,,,,,,,,,,,,,2008-01-01,A,MAIRIE,,,,84.11Z,NAFRev2,O,5.184054,48.069851,0.94,housenumber,2 Rue de la Marne 52000 Verbiesles,52514_0042_00002,G,2 RUE DE LA MARNE,
215203670,00025,21520367000025,O,1983-12-21,NN,,,2014-12-03T14:42:13,false,4,,2,,RUE,DE LA MARNE,52000,VERBIESLES,,,52514,,,,,,,,,,,,,,,,,,,2012-08-31,F,ECOLE PRIMAIRE PUBLIQUE,,,,85.20Z,NAFRev2,N,5.184054,48.069851,0.94,housenumber,2 Rue de la Marne 52000 Verbiesles,52514_0042_00002,G,2 RUE DE LA MARNE,
215203670,00033,21520367000033,O,1997-01-01,NN,,,2020-09-18T09:00:12,false,4,MAIRIE,2,,RUE,DE LA MARNE,52000,VERBIESLES,,,52514,,,,,,,,,,,,,,,,,,,2019-12-31,F,SERVICE D'EAU ET D'ASSAINISSEMENT,,,,36.00Z,NAFRev2,N,5.184054,48.069851,0.94,housenumber,2 Rue de la Marne 52000 Verbiesles,52514_0042_00002,G,2 RUE DE LA MARNE,
265204149,00016,26520414900016,O,1983-03-01,NN,,,2016-07-23T12:19:20,true,5,MAIRIE,2,,RUE,DE LA MARNE,52000,VERBIESLES,,,52514,,,,,,,,,,,,,,,,,,,2016-01-01,F,,,,,88.99B,NAFRev2,N,5.184054,48.069851,0.94,housenumber,2 Rue de la Marne 52000 Verbiesles,52514_0042_00002,G,2 RUE DE LA MARNE,
295202386,00013,29520238600013,O,,NN,,,2006-11-25T09:10:47,true,1,,,,,,52000,VERBIESLES,,,52514,,,,,,,,,,,,,,,,,,,1996-03-01,F,,,,,70.1C,NAF1993,N,,,0,,,,,,
301435939,00014,30143593900014,O,,NN,,,,true,1,,,,,,52000,VERBIESLES,,,52514,,,,,,,,,,,,,,,,,,,1989-03-31,F,,,,,49.05,NAP,N,,,0,,,,,,
313793523,00017,31379352300017,O,,NN,,,,true,1,,,,RUE,DE LA FONTAINE,52000,VERBIESLES,,,52514,,,,,,,,,,,,,,,,,,,1991-09-30,F,,,,,55.3A,NAF1993,N,5.18425,48.069464,0.58,street,Rue de la Marne 52000 Verbiesles,52514_0042,G,RUE DE LA MARNE,
315765727,00013,31576572700013,O,,,,,,true,1,,,,,,52000,VERBIESLES,,,52514,,,,,,,,,,,,,,,,,,,1989-03-01,F,,,,,55.73,NAP,N,,,0,,,,,,
316319607,00016,31631960700016,O,1979-01-01,NN,,,2014-07-08T00:20:13,true,6,,,,LOT,LES HERBUES,52000,VERBIESLES,,,52514,,,,,,,,,,,,,,,,,,,2008-09-30,F,,,,,43.31Z,NAFRev2,O,5.182762,48.069272,0.62,street,Rue des Herbues 52000 Verbiesles,52514_0032,G,RUE DES HERBUES,
316319615,00019,31631961500019,O,,NN,,,,true,1,,,,,,52000,VERBIESLES,,,52514,,,,,,,,,,,,,,,,,,,1995-09-30,F,,,,,45.4A,NAF1993,O,,,0,,,,,,
319124095,00047,31912409500047,O,1983-11-10,NN,,,2008-11-07T00:34:58,false,4,,5,,RUE,DE LETANG BAS,52000,VERBIESLES,,,52514,,,,,,,,,,,,,,,,,,,1995-04-26,F,,,,,45.4J,NAF1993,N,5.184606,48.06873,0.49,housenumber,5 Rue de la Marne 52000 Verbiesles,52514_0042_00005,G,5 RUE DE LA MARNE,
319124095,00054,31912409500054,O,1995-04-26,NN,,,2008-11-07T00:34:58,true,3,COTEAU DES BUIS,,,RTE,LAVILLE AUX BOIS,52000,VERBIESLES,,,52514,,,,,,,,,,,,,,,,,,,2007-11-30,F,,,,,45.4J,NAFRev1,N,5.2019593,48.092306,0.82,poi.runway,(Piste) Laville-aux-Bois,https://osm.org/way/568458031,G,,
322230061,00010,32223006100010,O,,NN,,,,true,1,,,,,,52000,VERBIESLES,,,52514,,,,,,,,,,,,,,,,,,,,F,,,,,62.43,NAP,N,,,0,,,,,,
322298431,00014,32229843100014,O,,NN,,,,true,1,,,,,,52000,VERBIESLES,,,52514,,,,,,,,,,,,,,,,,,,,F,,,,,62.43,NAP,N,,,0,,,,,,
339365793,00019,33936579300019,O,,NN,,,,true,1,,,,,,52000,VERBIESLES,,,52514,,,,,,,,,,,,,,,,,,,1987-07-01,F,,,,,80.02,NAP,N,,,0,,,,,,
348390816,00018,34839081600018,O,1988-10-17,NN,,,2014-07-08T00:51:39,true,6,,6,,RUE,LOTISSEMENT DU VIEUX VAL,52000,VERBIESLES,,,52514,,,,,,,,,,,,,,,,,,,2013-12-03,F,,,,,43.32B,NAFRev2,N,5.189093,48.073113,0.61,housenumber,6 Rue du Vieux Val 52000 Verbiesles,52514_0060_00006,G,6 RUE DU VIEUX VAL,
349390302,00017,34939030200017,O,1988-12-22,NN,,,2013-06-27T08:26:12,true,3,,,,,,52000,VERBIESLES,,,52514,,,,,,,,,,,,,,,,,,,2008-01-01,A,,,,,68.20B,NAFRev2,N,,,0,,,,,,
350233508,00026,35023350800026,O,1995-10-01,NN,,,,true,3,,,,,LA BOURSIERE,52000,VERBIESLES,,,52514,,,,,,,,,,,,,,,,,,,1997-01-06,F,,,,,74.4A,NAF1993,N,5.18493,48.073502,0.92,street,Rue de la Boursiere 52000 Verbiesles,52514_0007,G,RUE DE LA BOURSIERE,
351458955,00017,35145895500017,O,1989-05-27,,,,,false,4,,,,CHE,DIT DE DEHUT,52000,VERBIESLES,,,52514,,,,,,,,,,,,,,,,,,,1995-12-01,F,,,,,02.0B,NAF1993,N,5.183165,48.068067,0.47,street,Rue Dehut 52000 Verbiesles,52514_0020,G,RUE DEHUT,
352656789,00018,35265678900018,O,1989-10-01,12,2019,,2022-04-10T03:34:08,true,6,,2,,RTE,DE LUZY,52000,VERBIESLES,,,52514,,,,,,,,,,,,,,,,,,,2008-01-01,A,,,,,43.99C,NAFRev2,O,5.187991,48.066249,0.8,housenumber,2 Route de Luzy 52000 Verbiesles,52514_oywpq1_00002,G,2 ROUTE DE LUZY,
377483953,00024,37748395300024,O,1900-01-01,NN,,,2011-04-28T00:44:04,false,3,,1,,RUE,VIEUX VAL,52000,VERBIESLES,,,52514,,,,,,,,,,,,,,,,,,,1995-12-31,F,,,,,51.1L,NAF1993,N,5.187405,48.073836,0.88,housenumber,1 Rue du Vieux Val 52000 Verbiesles,52514_0060_00001,G,1 RUE DU VIEUX VAL,
381202845,00024,38120284500024,O,2009-12-21,,,,2012-11-09T00:46:35,true,2,,6,,RUE,DE LA MARNE,52000,VERBIESLES,,,52514,,,,,,,,,,,,,,,,,,,2011-08-12,F,,,,,46.18Z,NAFRev2,N,5.184388,48.069238,0.94,housenumber,6 Rue de la Marne 52000 Verbiesles,52514_0042_00006,G,6 RUE DE LA MARNE,
382909406,00037,38290940600037,O,1998-11-02,NN,,,,true,4,,11,,RUE,DE LA VALLEE,52000,VERBIESLES,,,52514,,,,,,,,,,,,,,,,,,,2003-12-25,F,,,,,74.8F,NAFRev1,N,5.189703,48.071948,0.94,housenumber,11 Rue de la Vallee 52000 Verbiesles,52514_0059_00011,G,11 RUE DE LA VALLEE,
388345340,00029,38834534000029,O,1995-03-31,NN,,,2008-01-04T23:08:02,true,3,,,,,VAL DES ESCHOLIERS,52000,VERBIESLES,,,52514,,,,,,,,,,,,,,,,,,,2008-01-01,A,,,,,94.92Z,NAFRev2,N,5.1669947,48.0786227,0.89,poi.3,Château du Val-des-Escholiers (Patrimoine national) Verbiesles,https://osm.org/node/2469204851,G,,
398854224,00019,39885422400019,O,1994-10-01,NN,,,2013-09-10T11:38:32,false,5,VAL DES ESCHOLIERS,,,,,52000,VERBIESLES,,,52514,,,,,,,,,,,,,,,,,,,2012-07-09,F,,,,,01.11Z,NAFRev2,N,,,0,,,,,,
398854224,00027,39885422400027,O,1996-12-18,02,2019,,2021-10-27T08:25:04,true,2,,,,,VAL DES ESCHOLIERS,52000,VERBIESLES,,,52514,,,,,,,,,,,,,,,,,,,2013-12-31,A,,,,,01.11Z,NAFRev2,O,5.1669947,48.0786227,0.89,poi.3,Château du Val-des-Escholiers (Patrimoine national) Verbiesles,https://osm.org/node/2469204851,G,,
400806923,00019,40080692300019,O,1994-01-01,NN,,,2016-01-12T00:16:07,true,3,,,,,,52000,VERBIESLES,,,52514,,,,,,,,,,,,,,,,,,,2008-01-01,A,,,,,02.10Z,NAFRev2,N,,,0,,,,,,
402611586,00023,40261158600023,O,1999-01-15,NN,,,,true,1,,2,,RUE,DU VIEUX VAL,52000,VERBIESLES,,,52514,,,,,,,,,,,,,,,,,,,1999-12-31,F,,,,,45.4A,NAF1993,O,5.187637,48.07375,0.94,housenumber,2 Rue du Vieux Val 52000 Verbiesles,52514_0060_00002,G,2 RUE DU VIEUX VAL,
402806137,00012,40280613700012,O,1988-01-01,NN,,,2008-01-04T20:10:26,true,4,,,,,,52000,VERBIESLES,,,52514,,,,,,,,,,,,,,,,,,,2008-01-01,A,,,,,01.11Z,NAFRev2,N,,,0,,,,,,
404539637,00029,40453963700029,O,1998-01-24,NN,,9602AB,2015-03-17T00:47:01,true,3,,27,,RUE,DES LAVOIRS,52000,VERBIESLES,,,52514,,,,,,,,,,,,,,,,,,,2008-01-01,A,,,,,96.02A,NAFRev2,N,5.185115,48.072269,0.95,housenumber,27 Rue des Lavoirs 52000 Verbiesles,52514_0035_00027,G,27 RUE DES LAVOIRS,
404931784,00023,40493178400023,O,2012-01-10,,,,2021-02-23T11:29:14,true,1,,9,,RUE,DU VIEUX VAL,52000,VERBIESLES,,,52514,,,,,,,,,,,,,,,,,,,2012-01-10,A,L'ART DU PASSE,,,,47.89Z,NAFRev2,N,5.190308,48.072629,0.94,housenumber,9 Rue du Vieux Val 52000 Verbiesles,52514_0060_00009,G,9 RUE DU VIEUX VAL,
422099093,00011,42209909300011,O,1999-02-25,NN,,,2006-11-25T16:19:52,true,3,,5,,RUE,DU VIEUX VAL,52000,VERBIESLES,,,52514,,,,,,,,,,,,,,,,,,,2005-06-01,F,,,,,55.3B,NAFRev1,N,5.188744,48.073268,0.94,housenumber,5 Rue du Vieux Val 52000 Verbiesles,52514_0060_00005,G,5 RUE DU VIEUX VAL,
422154021,00014,42215402100014,O,1987-01-01,NN,,,2008-01-05T00:17:14,true,3,,,,,,52000,VERBIESLES,,,52514,,,,,,,,,,,,,,,,,,,2008-01-01,A,,,,,01.11Z,NAFRev2,N,,,0,,,,,,
422765370,00016,42276537000016,O,1999-04-22,NN,,,2008-01-05T20:43:21,true,3,,14,,RUE,DU VIEUX VAL,52000,VERBIESLES,,,52514,,,,,,,,,,,,,,,,,,,2008-01-01,A,,,,,68.20B,NAFRev2,N,5.191294,48.072138,0.94,housenumber,14 Rue du Vieux Val 52000 Verbiesles,52514_0060_00014,G,14 RUE DU VIEUX VAL,
423551092,00012,42355109200012,O,1999-07-05,,,,,true,1,,,,RUE,N 19,52000,VERBIESLES,,,52514,,,,,,,,,,,,,,,,,,,2000-12-31,F,,,,,45.4J,NAF1993,N,5.18425,48.069464,0.41,street,Rue de la Marne 52000 Verbiesles,52514_0042,G,RUE DE LA MARNE,
424518553,00013,42451855300013,O,1999-09-01,NN,,,2012-02-16T09:04:32,false,4,,21,,RUE,DEHUT,52000,VERBIESLES,,,52514,,,,,,,,,,,,,,,,,,,2010-04-17,F,,,,,01.11Z,NAFRev2,N,5.181923,48.067828,0.94,housenumber,21 Rue Dehut 52000 Verbiesles,52514_0020_00021,G,21 RUE DEHUT,
424518553,00021,42451855300021,O,2012-02-01,,,,2021-02-23T11:46:44,true,1,,3,,RUE,DES SOURCES,52000,VERBIESLES,,,52514,,,,,,,,,,,,,,,,,,,2012-02-01,A,,,,ETF GRIONI,02.40Z,NAFRev2,N,5.185628,48.069024,0.94,housenumber,3 Rue des Sources 52000 Verbiesles,52514_0055_00003,G,3 RUE DES SOURCES,
431169069,00017,43116906900017,O,1985-01-01,NN,,,,true,3,,,,,,52000,VERBIESLES,,,52514,,,,,,,,,,,,,,,,,,,2003-01-01,F,,,,,01.3Z,NAF1993,N,,,0,,,,,,
432283976,00012,43228397600012,O,2000-07-01,NN,,,2011-09-14T19:46:06,true,6,,,,,LE VAL DES ESCHOLIERS,52000,VERBIESLES,,,52514,,,,,,,,,,,,,,,,,,,2010-12-31,F,,,,,85.51Z,NAFRev2,N,5.1669947,48.0786227,0.78,poi.3,Château du Val-des-Escholiers (Patrimoine national) Verbiesles,https://osm.org/node/2469204851,G,,
435226717,00013,43522671700013,O,2000-02-01,NN,,,,true,1,,11,,RUE,DES TILLEULS,52000,VERBIESLES,,,52514,,,,,,,,,,,,,,,,,,,2000-03-27,F,,,,,92.3A,NAF1993,N,5.1869,48.068594,0.94,housenumber,11 Rue des Tilleuls 52000 Verbiesles,52514_0056_00011,G,11 RUE DES TILLEULS,
439230764,00011,43923076400011,O,2001-10-03,NN,,4322BB,2021-02-23T13:19:54,true,3,,12,,RUE,DE LA MARNE,52000,VERBIESLES,,,52514,,,,,,,,,,,,,,,,,,,2008-01-01,A,,,,,43.22B,NAFRev2,N,5.184054,48.069851,0.94,housenumber,12 Rue de la Marne 52000 Verbiesles,52514_0042_00012,G,12 RUE DE LA MARNE,
439419946,00017,43941994600017,O,2001-10-01,NN,,,2022-02-04T08:45:41,true,7,,11,,RUE,DEHUT,52000,VERBIESLES,,,52514,,,,,,,,,,,,,,,,,,,2022-02-01,A,,,,,43.22A,NAFRev2,O,5.183128,48.067974,0.94,housenumber,11 Rue Dehut 52000 Verbiesles,52514_0020_00011,G,11 RUE DEHUT,
439419946,00025,43941994600025,O,2010-03-01,NN,,4322AZ,2018-09-29T12:21:50,false,3,,14,,RUE,DES SOURCES,52000,VERBIESLES,,,52514,,,,,,,,,,,,,,,,,,,2018-04-01,F,,,,,43.22A,NAFRev2,N,5.185056,48.069849,0.94,housenumber,14 Rue des Sources 52000 Verbiesles,52514_0055_00014,G,14 RUE DES SOURCES,
442289724,00027,44228972400027,O,2011-03-10,,,,2020-08-01T03:58:44,true,2,,7,,RUE,DES TILLEULS,52000,VERBIESLES,,,52514,,,,,,,,,,,,,,,,,,,2020-07-22,F,,,,,68.20B,NAFRev2,N,5.18654,48.068836,0.94,housenumber,7 Rue des Tilleuls 52000 Verbiesles,52514_0056_00007,G,7 RUE DES TILLEULS,
450423488,00011,45042348800011,O,2003-10-01,NN,,,2008-01-05T21:29:42,true,3,,8,,RUE,DU VIEUX VAL,52000,VERBIESLES,,,52514,,,,,,,,,,,,,,,,,,,2008-01-01,A,,,,,68.20B,NAFRev2,N,5.189849,48.072805,0.94,housenumber,8 Rue du Vieux Val 52000 Verbiesles,52514_0060_00008,G,8 RUE DU VIEUX VAL,
454068024,00016,45406802400016,O,2004-07-01,NN,,,2013-04-10T08:29:29,false,3,,2,,RUE,DES SOURCES,52000,VERBIESLES,,,52514,,,,,,,,,,,,,,,,,,,2004-12-25,F,,,,,20.4Z,NAFRev1,N,5.18581,48.068948,0.94,housenumber,2 Rue des Sources 52000 Verbiesles,52514_0055_00002,G,2 RUE DES SOURCES,
490822053,00024,49082205300024,O,2008-07-01,,,,2013-06-07T08:36:07,false,3,,7,,RUE,DES LAVOIRS,52000,VERBIESLES,,,52514,,,,,,,,,,,,,,,,,,,2013-05-21,F,,,,,46.69C,NAFRev2,,5.184376,48.071008,0.95,housenumber,7 Rue des Lavoirs 52000 Verbiesles,52514_0035_00007,G,7 RUE DES LAVOIRS,
498756493,00017,49875649300017,O,2007-07-01,,,,2010-04-06T09:55:01,false,2,MAIRIE,2,,RUE,DE LA MARNE,52000,VERBIESLES,,,52514,,,,,,,,,,,,,,,,,,,2007-10-31,F,,,,,60.2E,NAFRev1,N,5.184054,48.069851,0.94,housenumber,2 Rue de la Marne 52000 Verbiesles,52514_0042_00002,G,2 RUE DE LA MARNE,
503406308,00034,50340630800034,O,2017-11-17,02,2019,,2021-10-27T08:07:11,true,1,,14,,RUE,DES HERBUES,52000,VERBIESLES,,,52514,,,,,,,,,,,,,,,,,,,2017-11-17,A,,,,,43.32A,NAFRev2,O,5.181887,48.069039,0.94,housenumber,14 Rue des Herbues 52000 Verbiesles,52514_0032_00014,G,14 RUE DES HERBUES,
508347762,00017,50834776200017,O,2008-10-01,NN,,,2014-07-10T01:30:29,true,2,LOTISSEMENT LES HERBUES,16,,RUE,DEHUT,52000,VERBIESLES,,,52514,,,,,,,,,,,,,,,,,,,2012-03-31,F,,,,,43.31Z,NAFRev2,O,5.182435,48.067913,0.94,housenumber,16 Rue Dehut 52000 Verbiesles,52514_0020_00016,G,16 RUE DEHUT,
512794140,00024,51279414000024,O,2014-10-31,,,,2017-02-16T03:51:02,true,2,,5,,RUE,DU VIEUX VAL,52000,VERBIESLES,,,52514,,,,,,,,,,,,,,,,,,,2016-12-31,F,,,,,43.22B,NAFRev2,N,5.188744,48.073268,0.94,housenumber,5 Rue du Vieux Val 52000 Verbiesles,52514_0060_00005,G,5 RUE DU VIEUX VAL,
513914317,00013,51391431700013,O,2009-08-20,,,,2016-01-28T08:20:22,true,2,,23,,RUE,DES SOURCES,52000,VERBIESLES,,,52514,,,,,,,,,,,,,,,,,,,2015-06-30,F,,,,,86.90F,NAFRev2,N,5.184723,48.070374,0.94,housenumber,23 Rue des Sources 52000 Verbiesles,52514_0055_00023,G,23 RUE DES SOURCES,
519688451,00011,51968845100011,O,2010-02-01,,,,2012-11-10T01:42:21,true,2,,6,,RUE,DE L'EGLISE,52000,VERBIESLES,,,52514,,,,,,,,,,,,,,,,,,,2011-11-23,F,,,,,47.19B,NAFRev2,N,5.186123,48.069944,0.94,housenumber,6 Rue de l’Eglise 52000 Verbiesles,52514_0025_00006,G,6 RUE DE L EGLISE,
531461739,00025,53146173900025,O,2014-02-01,NN,,,2021-02-23T15:50:39,true,1,,5,,RUE,DES HERBUES,52000,VERBIESLES,,,52514,,,,,,,,,,,,,,,,,,,2014-02-01,A,,,,SP2L,43.91A,NAFRev2,N,5.182134,48.069087,0.94,housenumber,5 Rue des Herbues 52000 Verbiesles,52514_0032_00005,G,5 RUE DES HERBUES,
539974402,00023,53997440200023,O,2012-04-01,NN,,,2016-04-26T05:14:02,false,2,,16,,RUE,DEHUT,52000,VERBIESLES,,,52514,,,,,,,,,,,,,,,,,,,2015-02-01,F,,,,,43.31Z,NAFRev2,O,5.182435,48.067913,0.94,housenumber,16 Rue Dehut 52000 Verbiesles,52514_0020_00016,G,16 RUE DEHUT,
582136263,00032,58213626300032,O,1952-10-02,,,,,false,3,,,,,LE VAL DES ECOLIERS,52000,VERBIESLES,,,52514,,,,,,,,,,,,,,,,,,,1992-12-22,F,,,,,01.1A,NAF1993,N,5.188486,48.072389,0.3,street,Rue de la Vallee 52000 Verbiesles,52514_0059,G,RUE DE LA VALLEE,
753571447,00014,75357144700014,O,2008-01-19,,,,2012-09-03T13:42:54,true,1,,5,,RUE,DEHUT,52000,VERBIESLES,,,52514,,,,,,,,,,,,,,,,,,,2008-01-19,A,,,,,94.99Z,NAFRev2,N,5.183834,48.068143,0.94,housenumber,5 Rue Dehut 52000 Verbiesles,52514_0020_00005,G,5 RUE DEHUT,
780462107,00027,78046210700027,O,1981-07-15,NN,,,,true,3,,,,RTE,DE LUZY,52000,VERBIESLES,,,52514,,,,,,,,,,,,,,,,,,,1998-12-25,F,,,,,70.2C,NAF1993,N,5.187644,48.067186,0.78,street,Route de Luzy 52000 Verbiesles,52514_oywpq1,G,ROUTE DE LUZY,
780494043,00018,78049404300018,O,,NN,,,,true,1,,,,,,52000,VERBIESLES,,,52514,,,,,,,,,,,,,,,,,,,1978-12-31,F,,,,,70.2C,NAF1993,N,,,0,,,,,,
789859824,00011,78985982400011,O,2012-11-02,,,,2016-01-29T09:09:32,false,2,,5,,RUE,DEHUT,52000,VERBIESLES,,,52514,,,,,,,,,,,,,,,,,,,2016-01-26,F,,,,,94.99Z,NAFRev2,N,5.183834,48.068143,0.94,housenumber,5 Rue Dehut 52000 Verbiesles,52514_0020_00005,G,5 RUE DEHUT,
793129230,00017,79312923000017,O,2013-05-20,,,,2014-03-28T08:21:53,false,2,,5,,RUE,DEHUT,52000,VERBIESLES,,,52514,,,,,,,,,,,,,,,,,,,2014-03-01,F,,,,,70.22Z,NAFRev2,N,5.183834,48.068143,0.94,housenumber,5 Rue Dehut 52000 Verbiesles,52514_0020_00005,G,5 RUE DEHUT,
793465741,00023,79346574100023,O,2015-04-21,,,,2018-02-08T14:28:23,true,2,,5,,RUE,DES HERBUES,52000,VERBIESLES,,,52514,,,,,,,,,,,,,,,,,,,2015-12-31,F,,,,,47.89Z,NAFRev2,N,5.182134,48.069087,0.94,housenumber,5 Rue des Herbues 52000 Verbiesles,52514_0032_00005,G,5 RUE DES HERBUES,
798848057,00013,79884805700013,O,2012-11-09,,,,2013-12-02T17:40:29,true,1,,5,,RUE,DEHUT,52000,VERBIESLES,,,52514,,,,,,,,,,,,,,,,,,,2012-11-09,A,,,,,94.99Z,NAFRev2,N,5.183834,48.068143,0.94,housenumber,5 Rue Dehut 52000 Verbiesles,52514_0020_00005,G,5 RUE DEHUT,
804960979,00016,80496097900016,O,2014-09-01,,,,2014-10-03T10:29:37,true,1,,5,,RUE,DEHUT,52000,VERBIESLES,,,52514,,,,,,,,,,,,,,,,,,,2014-09-01,A,,,,,01.49Z,NAFRev2,N,5.183834,48.068143,0.94,housenumber,5 Rue Dehut 52000 Verbiesles,52514_0020_00005,G,5 RUE DEHUT,
804960979,00024,80496097900024,O,2014-10-01,,,,2016-11-08T14:49:53,false,2,,5,,RUE,DEHUT,52000,VERBIESLES,,,52514,,,,,,,,,,,,,,,,,,,2016-10-29,F,,,,,85.59B,NAFRev2,N,5.183834,48.068143,0.94,housenumber,5 Rue Dehut 52000 Verbiesles,52514_0020_00005,G,5 RUE DEHUT,
810641266,00012,81064126600012,O,2015-04-01,,,,2021-08-01T21:48:41,true,2,,11,,RUE,DES SOURCES,52000,VERBIESLES,,,52514,,,,,,,,,,,,,,,,,,,2020-12-31,A,,,,,71.12B,NAFRev2,N,5.185256,48.069428,0.94,housenumber,11 Rue des Sources 52000 Verbiesles,52514_0055_00011,G,11 RUE DES SOURCES,
824253009,00016,82425300900016,O,2016-12-01,,,,2021-06-06T20:30:19,true,2,,2,,RTE,DE LUZY SUR MARNE,52000,VERBIESLES,,,52514,,,,,,,,,,,,,,,,,,,2018-09-18,A,,,,,74.90A,NAFRev2,N,5.187971,48.066414,0.86,housenumber,2 Route de Luzy sur Marne 52000 Verbiesles,52514_0038_00002,G,2 ROUTE DE LUZY SUR MARNE,
828074344,00015,82807434400015,O,2017-03-01,,,9529ZF,2017-03-03T08:37:01,true,1,,31,,RUE,DE LA MARNE,52000,VERBIESLES,,,52514,,,,,,,,,,,,,,,,,,,2017-03-01,A,,,,LE P'TIT BRICOLEUR,95.29Z,NAFRev2,N,5.182607,48.069968,0.94,housenumber,31 Rue de la Marne 52000 Verbiesles,52514_0042_00031,G,31 RUE DE LA MARNE,
830168407,00021,83016840700021,O,2017-06-01,,,,2021-02-26T03:34:34,false,2,MAISON ECLUSIERE 20,,,,VAL DES ECOLIERS,52000,VERBIESLES,,,52514,,,,,,,,,,,,,,,,,,,2021-01-14,F,,,,,81.30Z,NAFRev2,N,5.185171,48.072156,0.31,street,Rue des Lavoirs 52000 Verbiesles,52514_0035,G,RUE DES LAVOIRS,
831552120,00014,83155212000014,O,2017-09-01,,,,2021-07-08T08:39:15,true,2,,,,RTE,NATIONAL 19,52000,VERBIESLES,,,52514,,,,,,,,,,,,,,,,,,,2020-12-31,F,,,,,93.29Z,NAFRev2,N,,,0,,,,,,
832562664,00017,83256266400017,O,2017-10-10,,,,2017-10-13T08:23:57,true,1,,27,,RUE,DE LA MARNE,52000,VERBIESLES,,,52514,,,,,,,,,,,,,,,,,,,2017-10-10,A,,,,,68.20B,NAFRev2,N,5.18324,48.070159,0.94,housenumber,27 Rue de la Marne 52000 Verbiesles,52514_0042_00027,G,27 RUE DE LA MARNE,
832613525,00019,83261352500019,O,2017-11-01,01,2019,,2021-10-27T09:37:03,true,1,,14,,RUE,DES HERBUES,52000,VERBIESLES,,,52514,,,,,,,,,,,,,,,,,,,2017-11-01,A,,,,,71.11Z,NAFRev2,O,5.181887,48.069039,0.94,housenumber,14 Rue des Herbues 52000 Verbiesles,52514_0032_00014,G,14 RUE DES HERBUES,
832918718,00012,83291871800012,O,2017-10-30,,,,2017-10-27T08:36:11,true,1,,14,,,RUE DES HERBUES,52000,VERBIESLES,,,52514,,,,,,,,,,,,,,,,,,,2017-10-30,A,,,,,74.90A,NAFRev2,N,5.181887,48.069039,0.94,housenumber,14 Rue des Herbues 52000 Verbiesles,52514_0032_00014,G,14 RUE DES HERBUES,
833194434,00019,83319443400019,O,2017-10-27,,,,2018-06-27T04:23:00,true,1,,14,,RUE,DES HERBUES,52000,VERBIESLES,,,52514,,,,,,,,,,,,,,,,,,,2017-10-27,A,,,,,66.30Z,NAFRev2,N,5.181887,48.069039,0.94,housenumber,14 Rue des Herbues 52000 Verbiesles,52514_0032_00014,G,14 RUE DES HERBUES,
843691916,00012,84369191600012,O,2018-11-22,,,,2018-11-26T14:43:42,true,1,,7,,RUE,DES LAVOIRS,52000,VERBIESLES,,,52514,,,,,,,,,,,,,,,,,,,2018-11-22,A,,,,,68.20B,NAFRev2,N,5.184376,48.071008,0.95,housenumber,7 Rue des Lavoirs 52000 Verbiesles,52514_0035_00007,G,7 RUE DES LAVOIRS,
844441469,00013,84444146900013,O,2018-11-26,,,,2019-12-25T03:41:02,true,2,,24,,RUE,DES LAVOIRS,52000,VERBIESLES,,,52514,,,,,,,,,,,,,,,,,,,2019-11-26,F,,,,PET SIDE,47.91A,NAFRev2,N,5.186693,48.073622,0.95,housenumber,24 Rue des Lavoirs 52000 Verbiesles,52514_0035_00024,G,24 RUE DES LAVOIRS,
846010726,00012,84601072600012,O,,NN,,,,true,1,,,,,,52000,VERBIESLES,,,52514,,,,,,,,,,,,,,,,,,,1987-01-01,F,,,,,62.41,NAP,N,,,0,,,,,,
847210176,00016,84721017600016,O,,NN,,,,true,1,,,,,,52000,VERBIESLES,,,52514,,,,,,,,,,,,,,,,,,,,F,,,,,81.21,NAP,N,,,0,,,,,,
847310323,00039,84731032300039,O,1985-01-01,NN,,,2021-09-01T14:54:32,true,7,,8,,RUE,DES LAVOIRS,52000,VERBIESLES,,,52514,,,,,,,,,,,,,,,,,,,2008-07-10,F,,,,,47.99B,NAFRev2,O,5.184929,48.071501,0.95,housenumber,8 Rue des Lavoirs 52000 Verbiesles,52514_0035_00008,G,8 RUE DES LAVOIRS,
852447499,00017,85244749900017,O,2019-08-05,,,,2021-02-10T14:54:28,false,2,,1,,RTE,DE LUCY,52000,VERBIESLES,,,52514,,,,,,,,,,,,,,,,,,,2021-02-01,F,,,,,86.21Z,NAFRev2,N,5.187296,48.068122,0.61,housenumber,1 Route de Luzy 52000 Verbiesles,52514_oywpq1_00001,G,1 ROUTE DE LUZY,
852649318,00015,85264931800015,O,2019-07-22,,,,2021-03-04T08:43:07,false,2,,10,,RUE,DEHUT,52000,VERBIESLES,,,52514,,,,,,,,,,,,,,,,,,,2021-02-01,F,,,,,86.90E,NAFRev2,N,5.183092,48.068051,0.94,housenumber,10 Rue Dehut 52000 Verbiesles,52514_0020_00010,G,10 RUE DEHUT,
879344414,00021,87934441400021,O,2020-01-17,,,,2021-02-23T18:13:15,true,1,,4,,RUE,DES HERBUES,52000,VERBIESLES,,,52514,,,,,,,,,,,,,,,,,,,2020-01-17,A,,,,,85.51Z,NAFRev2,N,5.182701,48.069343,0.94,housenumber,4 Rue des Herbues 52000 Verbiesles,52514_0032_00004,G,4 RUE DES HERBUES,
902156710,00011,90215671000011,O,2021-07-19,,,,2021-08-10T08:41:26,true,1,,15,,RUE,DES TILLEULS,52000,VERBIESLES,,,52514,,,,,,,,,,,,,,,,,,,2021-07-19,A,,,,,47.99A,NAFRev2,N,5.187204,48.068282,0.94,housenumber,15 Rue des Tilleuls 52000 Verbiesles,52514_0056_00015,G,15 RUE DES TILLEULS,
912931250,00019,91293125000019,O,2022-04-15,,,,2022-04-28T08:57:56,true,1,,23,,RUE,DES LAVOIRS,52000,VERBIESLES,,,52514,,,,,,,,,,,,,,,,,,,2022-04-15,A,,,,,47.99A,NAFRev2,N,5.184876,48.071769,0.95,housenumber,23 Rue des Lavoirs 52000 Verbiesles,52514_0035_00023,G,23 RUE DES LAVOIRS,
913030094,00019,91303009400019,O,2022-04-21,,,,2022-05-03T04:08:53,true,1,,7,,RUE,DES HERBUES,52000,VERBIESLES,,,52514,,,,,,,,,,,,,,,,,,,2022-04-21,A,,,,,68.20B,NAFRev2,N,5.182036,48.069012,0.94,housenumber,7 Rue des Herbues 52000 Verbiesles,52514_0032_00007,G,7 RUE DES HERBUES,
