siren,nic,siret,statutDiffusionEtablissement,dateCreationEtablissement,trancheEffectifsEtablissement,anneeEffectifsEtablissement,activitePrincipaleRegistreMetiersEtablissement,dateDernierTraitementEtablissement,etablissementSiege,nombrePeriodesEtablissement,complementAdresseEtablissement,numeroVoieEtablissement,indiceRepetitionEtablissement,typeVoieEtablissement,libelleVoieEtablissement,codePostalEtablissement,libelleCommuneEtablissement,libelleCommuneEtrangerEtablissement,distributionSpecialeEtablissement,codeCommuneEtablissement,codeCedexEtablissement,libelleCedexEtablissement,codePaysEtrangerEtablissement,libellePaysEtrangerEtablissement,complementAdresse2Etablissement,numeroVoie2Etablissement,indiceRepetition2Etablissement,typeVoie2Etablissement,libelleVoie2Etablissement,codePostal2Etablissement,libelleCommune2Etablissement,libelleCommuneEtranger2Etablissement,distributionSpeciale2Etablissement,codeCommune2Etablissement,codeCedex2Etablissement,libelleCedex2Etablissement,codePaysEtranger2Etablissement,libellePaysEtranger2Etablissement,dateDebut,etatAdministratifEtablissement,enseigne1Etablissement,enseigne2Etablissement,enseigne3Etablissement,denominationUsuelleEtablissement,activitePrincipaleEtablissement,nomenclatureActivitePrincipaleEtablissement,caractereEmployeurEtablissement,longitude,latitude,geo_score,geo_type,geo_adresse,geo_id,geo_ligne,geo_l4,geo_l5
217700368,00012,21770036800012,O,1983-03-01,01,2019,,2021-10-27T08:10:35,true,3,,,,,,77970,BOISDON,,,77036,,,,,,,,,,,,,,,,,,,2008-01-01,A,MAIRIE,,,,84.11Z,NAFRev2,N,,,0,,,,,,
267700409,00019,26770040900019,O,1983-03-01,NN,,,2020-06-23T14:36:54,true,4,,,,,MAIRIE,77970,BOISDON,,,77036,,,,,,,,,,,,,,,,,,,2019-12-31,F,CCAS,,,,88.99B,NAFRev2,N,3.0709671,50.6304695,0.92,poi.townhall,Hôtel de Ville Lille,https://osm.org/way/40917078,G,,
297700353,00016,29770035300016,O,1983-08-10,NN,,,2008-08-06T11:08:12,true,4,,,,,,77970,BOISDON,,,77036,,,,,,,,,,,,,,,,,,,2008-07-24,F,,,,,42.99Z,NAFRev2,N,,,0,,,,,,
300877370,00019,30087737000019,O,1974-01-01,NN,,,2014-07-08T00:10:58,true,4,,2,,,GRANDE RUE,77970,BOISDON,,,77036,,,,,,,,,,,,,,,,,,,2009-09-30,F,,,,,16.10A,NAFRev2,N,3.223336,48.684708,0.78,housenumber,2 Rue Grande 77970 Boisdon,77036_0020_00002,G,2 RUE GRANDE,
309492791,00020,30949279100020,O,1984-03-21,NN,,,,true,1,,,,,RUE GRANDE,77970,BOISDON,,,77036,,,,,,,,,,,,,,,,,,,1998-11-15,F,,,,,74.8F,NAF1993,N,3.227359,48.684021,0.94,street,Rue Grande 77970 Boisdon,77036_0020,G,RUE GRANDE,
347760597,00034,34776059700034,O,2002-04-30,NN,,,2015-07-10T10:55:24,false,4,,6,,RUE,DU PRESBYTERE,77970,BOISDON,,,77036,,,,,,,,,,,,,,,,,,,2015-06-14,F,,,,,01.11Z,NAFRev2,N,3.225669,48.68559,0.94,housenumber,6 Rue du Presbytère 77970 Boisdon,77036_0050_00006,G,6 RUE DU PRESBYTERE,
379826944,00017,37982694400017,O,1990-11-01,NN,,,2022-03-28T19:36:22,true,3,,11,,RUE,DU LAVOIR,77970,BOISDON,,,77036,,,,,,,,,,,,,,,,,,,2008-01-01,A,,,,,01.11Z,NAFRev2,N,3.222586,48.683614,0.93,housenumber,11 Rue du Lavoir 77970 Boisdon,77036_0025_00011,G,11 RUE DU LAVOIR,
381108083,00019,38110808300019,O,,NN,,,,true,1,,11,,RUE,DU LAVOIR,77970,BOISDON,,,77036,,,,,,,,,,,,,,,,,,,1992-06-30,F,,,,,51.5L,NAF1993,N,3.222586,48.683614,0.93,housenumber,11 Rue du Lavoir 77970 Boisdon,77036_0025_00011,G,11 RUE DU LAVOIR,
405115254,00014,40511525400014,O,1986-01-01,NN,,,2008-01-04T20:50:44,true,3,,,,,,77970,BOISDON,,,77036,,,,,,,,,,,,,,,,,,,2008-01-01,A,,,,,01.11Z,NAFRev2,N,,,0,,,,,,
420700569,00023,42070056900023,O,2012-12-19,,,,2013-03-27T04:43:58,true,2,,5,,RUE,DU LAVOIR,77970,BOISDON,,,77036,,,,,,,,,,,,,,,,,,,2012-12-31,F,,,,,45.32Z,NAFRev2,O,3.222802,48.684138,0.93,housenumber,5 Rue du Lavoir 77970 Boisdon,77036_0025_00005,G,5 RUE DU LAVOIR,
447547159,00031,44754715900031,O,2014-02-01,,,,2018-10-18T10:53:03,false,2,,6,,RUE,DE PARIS,77970,BOISDON,,,77036,,,,,,,,,,,,,,,,,,,2018-10-01,F,,,,,90.03B,NAFRev2,N,3.221824,48.684501,0.94,housenumber,6 Rue de Paris 77970 Boisdon,77036_0040_00006,G,6 RUE DE PARIS,
447547159,00049,44754715900049,O,2018-10-01,,,,2021-02-23T13:28:47,true,1,,3,,RUE,DES MOLINARDS,77970,BOISDON,,,77036,,,,,,,,,,,,,,,,,,,2018-10-01,A,,,,,90.03B,NAFRev2,N,3.22246,48.684869,0.94,housenumber,3 Rue des Molinards 77970 Boisdon,77036_0030_00003,G,3 RUE DES MOLINARDS,
447548454,00027,44754845400027,O,2012-12-19,,,,2013-05-07T09:10:02,true,2,,5,,RUE,DU LAVOIR,77970,BOISDON,,,77036,,,,,,,,,,,,,,,,,,,2013-03-15,F,,,,,68.20B,NAFRev2,N,3.222802,48.684138,0.93,housenumber,5 Rue du Lavoir 77970 Boisdon,77036_0025_00005,G,5 RUE DU LAVOIR,
498244359,00028,49824435900028,O,2018-04-19,,,4789ZP,2020-11-10T03:45:35,true,2,,9,,RUE,DU PRESBYTERE,77970,BOISDON,,,77036,,,,,,,,,,,,,,,,,,,2020-07-06,F,,,,FLEURS DIRECT EXOTIQUE,47.89Z,NAFRev2,N,3.225587,48.685426,0.94,housenumber,9 Rue du Presbytère 77970 Boisdon,77036_0050_00009,G,9 RUE DU PRESBYTERE,
498276047,00020,49827604700020,O,2009-04-01,NN,,4399DC,2018-09-29T12:49:27,true,2,,29,,,GRANDE RUE,77970,BOISDON,,,77036,,,,,,,,,,,,,,,,,,,2016-12-31,F,,,,,43.99D,NAFRev2,O,3.229043,48.683695,0.79,housenumber,29 Rue Grande 77970 Boisdon,77036_0020_00029,G,29 RUE GRANDE,
500033154,00021,50003315400021,O,2022-02-01,,,4520AA,2022-03-09T10:21:16,true,1,,20,,RUE,GRANDE,77970,BOISDON,,,77036,,,,,,,,,,,,,,,,,,,2022-02-01,A,,,,AFGAUTO,45.11Z,NAFRev2,N,3.2266,48.684236,0.94,housenumber,20 Rue Grande 77970 Boisdon,77036_0020_00020,G,20 RUE GRANDE,
520144957,00013,52014495700013,O,2010-02-04,,,2899BZ,2020-07-02T12:15:00,true,2,,12,,RUE,GRANDE,77970,BOISDON,,,77036,,,,,,,,,,,,,,,,,,,2017-10-01,F,,,,,33.20B,NAFRev2,N,3.225196,48.68452,0.94,housenumber,12 Rue Grande 77970 Boisdon,77036_0020_00012,G,12 RUE GRANDE,
520407545,00018,52040754500018,O,2010-01-26,,,,2020-07-22T04:08:05,false,2,,29,,,GRANDE RUE,77970,BOISDON,,,77036,,,,,,,,,,,,,,,,,,,2020-07-21,F,,,,,68.20B,NAFRev2,N,3.229043,48.683695,0.79,housenumber,29 Rue Grande 77970 Boisdon,77036_0020_00029,G,29 RUE GRANDE,
528468770,00011,52846877000011,O,2010-01-01,,,,2010-11-22T13:55:40,true,1,,11,,RUE,DU PRESBYTERE,77970,BOISDON,,,77036,,,,,,,,,,,,,,,,,,,2010-01-01,A,,,,,01.49Z,NAFRev2,N,3.225683,48.68571,0.94,housenumber,11 Rue du Presbytère 77970 Boisdon,77036_0050_00011,G,11 RUE DU PRESBYTERE,
789613379,00013,78961337900013,O,2012-10-24,02,2019,4211ZB,2022-05-05T14:14:56,true,3,,10,,RUE,GRANDE RUE,77970,BOISDON,,,77036,,,,,,,,,,,,,,,,,,,2016-10-19,A,,,,,43.12A,NAFRev2,O,3.224904,48.684554,0.89,housenumber,10 Rue Grande 77970 Boisdon,77036_0020_00010,G,10 RUE GRANDE,
790814230,00013,79081423000013,O,2013-02-01,,,,2020-09-28T03:32:53,true,2,,12,,RTE,DE VILLEFLOND,77970,BOISDON,,,77036,,,,,,,,,,,,,,,,,,,2015-12-31,F,,,,,88.10A,NAFRev2,N,3.220914,48.684726,0.34,housenumber,12 Rue de Paris 77970 Boisdon,77036_0040_00012,G,12 RUE DE PARIS,
799126693,00016,79912669300016,O,2014-01-01,NN,,,2017-05-04T09:44:22,true,3,,30,,,GRANDE RUE,77970,BOISDON,,,77036,,,,,,,,,,,,,,,,,,,2015-03-09,A,PRESTIGE MINOT TRANSPORT LOGISTIQUE,,,PRESTIGGE MINOT,49.39B,NAFRev2,N,3.228211,48.683822,0.79,housenumber,30 Rue Grande 77970 Boisdon,77036_0020_00030,G,30 RUE GRANDE,
809207145,00032,80920714500032,O,2020-09-07,,,9602AB,2021-02-23T17:25:26,true,1,,4,,RUE,DE PARIS,77970,BOISDON,,,77036,,,,,,,,,,,,,,,,,,,2020-09-07,A,,,,LINDA COIFFURE,96.02A,NAFRev2,N,3.222243,48.684373,0.94,housenumber,4 Rue de Paris 77970 Boisdon,77036_0040_00004,G,4 RUE DE PARIS,
814616611,00012,81461661100012,O,2015-10-10,,,,2015-11-12T04:06:34,true,1,,10,,,GRANDE RUE,77970,BOISDON,,,77036,,,,,,,,,,,,,,,,,,,2015-10-10,A,,,,,68.20B,NAFRev2,N,3.224904,48.684554,0.79,housenumber,10 Rue Grande 77970 Boisdon,77036_0020_00010,G,10 RUE GRANDE,
828181388,00012,82818138800012,O,2017-02-27,03,2019,4312AZ,2022-06-24T12:23:04,true,2,,10,,,GRANDE RUE,77970,BOISDON,,,77036,,,,,,,,,,,,,,,,,,,2018-04-01,A,,,,,43.12A,NAFRev2,O,3.224904,48.684554,0.79,housenumber,10 Rue Grande 77970 Boisdon,77036_0020_00010,G,10 RUE GRANDE,
828643106,00010,82864310600010,O,2017-01-05,,,,2020-07-21T15:50:57,false,2,,4,,RUE,DE PARIS,77970,BOISDON,,,77036,,,,,,,,,,,,,,,,,,,2020-07-01,F,,,,,86.90D,NAFRev2,N,3.222243,48.684373,0.94,housenumber,4 Rue de Paris 77970 Boisdon,77036_0040_00004,G,4 RUE DE PARIS,
837544329,00019,83754432900019,O,2018-02-14,,,,2018-07-28T04:00:23,true,1,,10,,,GRANDE RUE,77970,BOISDON,,,77036,,,,,,,,,,,,,,,,,,,2018-02-14,A,,,,,49.41B,NAFRev2,O,3.224904,48.684554,0.79,housenumber,10 Rue Grande 77970 Boisdon,77036_0020_00010,G,10 RUE GRANDE,
842718959,00013,84271895900013,O,2018-09-13,,,,2018-10-01T15:02:58,true,1,,8,,RUE,GRANDE,77970,BOISDON,,,77036,,,,,,,,,,,,,,,,,,,2018-09-13,A,,,,,85.51Z,NAFRev2,N,3.224408,48.684607,0.94,housenumber,8 Rue Grande 77970 Boisdon,77036_0020_00008,G,8 RUE GRANDE,
902997204,00018,90299720400018,O,2021-08-25,,,4932ZB,2021-09-10T08:55:08,true,1,,8,,RUE,DE PARIS,77970,BOISDON,,,77036,,,,,,,,,,,,,,,,,,,2021-08-25,A,,,,CHAUFFEUR PRIVE,49.32Z,NAFRev2,N,3.221458,48.684588,0.94,housenumber,8 Rue de Paris 77970 Boisdon,77036_0040_00008,G,8 RUE DE PARIS,
907478820,00018,90747882000018,O,2021-11-15,,,,2022-04-08T04:00:32,true,1,,10,,,GRANDE RUE ,77970,BOISDON,,,77036,,,,,,,,,,,,,,,,,,,2021-11-15,A,,,,,64.20Z,NAFRev2,N,3.224904,48.684554,0.79,housenumber,10 Rue Grande 77970 Boisdon,77036_0020_00010,G,10 RUE GRANDE,
907557771,00017,90755777100017,O,2021-11-19,,,,2022-03-08T03:49:32,true,2,,10,,,GRANDE RUE ,77970,BOISDON,,,77036,,,,,,,,,,,,,,,,,,,2022-02-01,A,,,,,68.20A,NAFRev2,N,3.224904,48.684554,0.79,housenumber,10 Rue Grande 77970 Boisdon,77036_0020_00010,G,10 RUE GRANDE,
