siren,nic,siret,statutDiffusionEtablissement,dateCreationEtablissement,trancheEffectifsEtablissement,anneeEffectifsEtablissement,activitePrincipaleRegistreMetiersEtablissement,dateDernierTraitementEtablissement,etablissementSiege,nombrePeriodesEtablissement,complementAdresseEtablissement,numeroVoieEtablissement,indiceRepetitionEtablissement,typeVoieEtablissement,libelleVoieEtablissement,codePostalEtablissement,libelleCommuneEtablissement,libelleCommuneEtrangerEtablissement,distributionSpecialeEtablissement,codeCommuneEtablissement,codeCedexEtablissement,libelleCedexEtablissement,codePaysEtrangerEtablissement,libellePaysEtrangerEtablissement,complementAdresse2Etablissement,numeroVoie2Etablissement,indiceRepetition2Etablissement,typeVoie2Etablissement,libelleVoie2Etablissement,codePostal2Etablissement,libelleCommune2Etablissement,libelleCommuneEtranger2Etablissement,distributionSpeciale2Etablissement,codeCommune2Etablissement,codeCedex2Etablissement,libelleCedex2Etablissement,codePaysEtranger2Etablissement,libellePaysEtranger2Etablissement,dateDebut,etatAdministratifEtablissement,enseigne1Etablissement,enseigne2Etablissement,enseigne3Etablissement,denominationUsuelleEtablissement,activitePrincipaleEtablissement,nomenclatureActivitePrincipaleEtablissement,caractereEmployeurEtablissement,longitude,latitude,geo_score,geo_type,geo_adresse,geo_id,geo_ligne,geo_l4,geo_l5
210900072,00013,21090007200013,O,1983-03-01,01,2019,,2021-10-27T08:06:37,true,3,,,,,,09240,ALLIERES,,,09007,,,,,,,,,,,,,,,,,,,2008-01-01,A,MAIRIE,,,,84.11Z,NAFRev2,N,,,0,,,,,,
210900072,00021,21090007200021,O,1997-01-01,NN,,,2013-10-05T12:28:22,false,4,MAIRIE,,,,,09240,ALLIERES,,,09007,,,,,,,,,,,,,,,,,,,2012-12-25,F,SERVICE DES EAUX,,,,36.00Z,NAFRev2,N,,,0,,,,,,
260901335,00018,26090133500018,O,1984-09-17,NN,,,2019-01-17T14:53:23,true,5,MAIRIE,,,,,09240,ALLIERES,,,09007,,,,,,,,,,,,,,,,,,,2017-12-31,F,,,,,88.99B,NAFRev2,N,,,0,,,,,,
317133999,00035,31713399900035,O,1900-01-01,NN,,,2011-04-28T00:16:36,false,3,,,,,ORDAS,09240,ALLIERES,,,09007,,,,,,,,,,,,,,,,,,,1994-12-25,F,,,,,85.1C,NAF1993,N,1.357226,43.025782,0.93,street,Ordas 09240 Allières,09007_jlcl4c,G,ORDAS,
317133999,00050,31713399900050,O,2003-03-01,NN,,,2014-01-30T08:44:07,false,4,,,,,ORDAS D'EN HAUT,09240,ALLIERES,,,09007,,,,,,,,,,,,,,,,,,,2013-12-31,F,,,,,01.11Z,NAFRev2,N,1.356976,43.025738,0.91,street,Lieu Dit Ordas d’En Haut 09240 Allières,09007_4rl445,G,LIEU DIT ORDAS D EN HAUT,
317133999,00076,31713399900076,O,2012-09-01,,,,2014-01-30T08:44:07,true,2,,,,,ORDAS D EN HAUT,09240,ALLIERES,,,09007,,,,,,,,,,,,,,,,,,,2013-12-31,F,,,,,86.22C,NAFRev2,N,1.356976,43.025738,0.91,street,Lieu Dit Ordas d’En Haut 09240 Allières,09007_4rl445,G,LIEU DIT ORDAS D EN HAUT,
319618740,00017,31961874000017,O,1980-07-01,01,2019,,2021-10-27T08:21:19,true,4,,,,,,09240,ALLIERES,,,09007,,,,,,,,,,,,,,,,,,,2008-01-01,A,,,,,01.42Z,NAFRev2,N,,,0,,,,,,
331635763,00013,33163576300013,O,,NN,,,,true,1,,,,LD,THEZAUT,09240,ALLIERES,,,09007,,,,,,,,,,,,,,,,,,,,F,,,,,49.05,NAP,N,1.380175,43.038029,0.9,street,Lieu Dit Thezaut 09240 Allières,09007_g9q2fn,G,LIEU DIT THEZAUT,
340202365,00029,34020236500029,O,1989-09-01,,,,2006-11-25T10:37:44,false,3,,,,,CHATEAU DE MONTCRU,09240,ALLIERES,,,09007,,,,,,,,,,,,,,,,,,,1992-04-29,F,,,,,92.3B,NAF1993,N,1.368872,43.039745,0.4,street,Chateau la Barbe 09240 Allières,09007_1lt7qp,G,CHATEAU LA BARBE,
343477147,00015,34347714700015,O,1988-01-01,NN,,,2017-12-10T10:33:45,true,4,,,,,,09240,ALLIERES,,,09007,,,,,,,,,,,,,,,,,,,2017-11-01,F,,,,,01.42Z,NAFRev2,N,,,0,,,,,,
351414487,00022,35141448700022,O,1998-11-01,NN,,,2016-11-27T03:20:02,false,5,,,,LD,LES CANALS,09240,ALLIERES,,,09007,,,,,,,,,,,,,,,,,,,2016-06-01,F,,,,,01.45Z,NAFRev2,N,1.345445,43.038574,0.66,street,Lieu Dit Canals 09240 Allières,09007_udqkt2,G,LIEU DIT CANALS,
387885783,00028,38788578300028,O,1992-06-11,NN,,,2007-09-24T14:48:34,false,3,,,,,,09240,ALLIERES,,,09007,,,,,,,,,,,,,,,,,,,2007-06-30,F,,,,,01.1A,NAFRev1,N,,,0,,,,,,
392344875,00027,39234487500027,O,2003-01-01,NN,,,2008-01-05T00:03:48,true,3,,,,,LA BARBE,09240,ALLIERES,,,09007,,,,,,,,,,,,,,,,,,,2008-01-01,A,,,,,01.49Z,NAFRev2,N,1.368279,43.038943,0.93,street,La Barbe 09240 Allières,09007_c2szn1,G,LA BARBE,
398307389,00013,39830738900013,O,1994-06-01,NN,,,2008-01-04T18:46:55,true,3,MR PUECH DENIS,,,,THEZAUT,09240,ALLIERES,,,09007,,,,,,,,,,,,,,,,,,,2008-01-01,A,,,,,94.99Z,NAFRev2,N,1.380175,43.038029,0.9,street,Lieu Dit Thezaut 09240 Allières,09007_g9q2fn,G,LIEU DIT THEZAUT,
404980591,00014,40498059100014,O,1973-01-01,NN,,,,true,1,,,,,MONTEILLAS,09240,ALLIERES,,,09007,,,,,,,,,,,,,,,,,,,2000-03-31,F,,,,,01.1A,NAF1993,N,1.36141,43.031383,0.93,street,Monteillas 09240 Allières,09007_76je9s,G,MONTEILLAS,
404980609,00014,40498060900014,O,1966-01-01,NN,,,2008-01-04T20:48:44,true,3,,,,,CANALS,09240,ALLIERES,,,09007,,,,,,,,,,,,,,,,,,,2008-01-01,A,,,,,68.20B,NAFRev2,N,1.345445,43.038574,0.9,street,Lieu Dit Canals 09240 Allières,09007_udqkt2,G,LIEU DIT CANALS,
408203743,00013,40820374300013,O,1992-04-01,NN,,,2006-10-28T03:32:39,true,3,,,,,LA BOUICHE,09240,ALLIERES,,,09007,,,,,,,,,,,,,,,,,,,2006-02-28,F,,,,,01.1A,NAFRev1,N,1.366273,43.036425,0.91,street,Lieu Dit la Bouiche 09240 Allières,09007_cn3vli,G,LIEU DIT LA BOUICHE,
420911802,00015,42091180200015,O,1998-10-31,NN,,,2018-11-20T04:18:23,true,3,,,,,PEDAILLERES,09240,ALLIERES,,,09007,,,,,,,,,,,,,,,,,,,2008-01-01,A,,,,,68.20B,NAFRev2,N,1.358282,43.035807,0.91,street,Lieu Dit Pedailleres 09240 Allières,09007_7geawv,G,LIEU DIT PEDAILLERES,
430070854,00012,43007085400012,O,2000-04-01,NN,,,2008-01-05T01:47:49,true,3,,,,,MONTEILLAS,09240,ALLIERES,,,09007,,,,,,,,,,,,,,,,,,,2008-01-01,A,,,,,01.42Z,NAFRev2,N,1.36141,43.031383,0.93,street,Monteillas 09240 Allières,09007_76je9s,G,MONTEILLAS,
438643256,00011,43864325600011,O,2001-07-01,,,,2008-11-24T20:35:40,true,4,,,,,CHATEAU DE MONTCRU,09240,ALLIERES,,,09007,,,,,,,,,,,,,,,,,,,2004-12-25,F,,,,,20.1A,NAFRev1,O,1.368872,43.039745,0.4,street,Chateau la Barbe 09240 Allières,09007_1lt7qp,G,CHATEAU LA BARBE,
479997785,00056,47999778500056,O,2022-01-02,,,,2021-11-16T15:56:33,false,1,,,,,LA BARAKA,09240,ALLIERES,,,09007,,,,,,,,,,,,,,,,,,,2022-01-02,A,,,,,01.49Z,NAFRev2,N,1.368279,43.038943,0.55,street,La Barbe 09240 Allières,09007_c2szn1,G,LA BARBE,
480075449,00011,48007544900011,O,1998-07-08,NN,,,2013-04-25T10:47:05,true,4,,,,,LE PRESBYTERE,09240,ALLIERES,,,09007,,,,,,,,,,,,,,,,,,,2013-04-12,F,,,,,90.01Z,NAFRev2,N,1.375642,43.029192,0.4,street,Lieu Dit le Casteras 09240 Allières,09007_pp8qg2,G,LIEU DIT LE CASTERAS,
482321551,00038,48232155100038,O,2022-03-31,,,,2022-05-07T12:26:15,true,1,,,,,LIEUDIT COUMEBERE,09240,ALLIERES,,,09007,,,,,,,,,,,,,,,,,,,2022-03-31,A,,,,,82.99Z,NAFRev2,N,,,0,,,,,,
484001995,00014,48400199500014,O,2005-06-01,,,,2019-06-01T09:36:31,false,2,CHATEAU DE MONTCRU,,,,,09240,ALLIERES,,,09007,,,,,,,,,,,,,,,,,,,2008-01-01,A,,,,,68.20A,NAFRev2,N,1.368872,43.039745,0.4,street,Chateau la Barbe 09240 Allières,09007_1lt7qp,D,CHATEAU LA BARBE,
484001995,00022,48400199500022,O,2006-04-15,01,2019,1610AQ,2021-10-27T08:21:34,true,5,,,,,CHATEAU DE MONTCRU,09240,ALLIERES,,,09007,,,,,,,,,,,,,,,,,,,2020-01-01,A,,,,,47.99A,NAFRev2,O,1.368872,43.039745,0.4,street,Chateau la Barbe 09240 Allières,09007_1lt7qp,G,CHATEAU LA BARBE,
484316070,00016,48431607000016,O,2005-09-19,,,,2021-02-23T13:49:33,true,5,,,,,LE PRESBYTERE,09240,ALLIERES,,,09007,,,,,,,,,,,,,,,,,,,2017-09-30,A,ATELIER ETINCELLES,,,,90.03B,NAFRev2,N,1.375642,43.029192,0.4,street,Lieu Dit le Casteras 09240 Allières,09007_pp8qg2,G,LIEU DIT LE CASTERAS,
490240884,00018,49024088400018,O,2006-02-01,,,,2016-01-12T00:26:44,true,2,,,,LD,LES CANALS,09240,ALLIERES,,,09007,,,,,,,,,,,,,,,,,,,2008-01-01,A,,,,,01.42Z,NAFRev2,N,1.345445,43.038574,0.66,street,Lieu Dit Canals 09240 Allières,09007_udqkt2,G,LIEU DIT CANALS,
498965797,00042,49896579700042,O,2017-03-17,,,,2021-02-23T14:07:13,true,1,,,,,CHATEAU DE MONTCRU,09240,ALLIERES,,,09007,,,,,,,,,,,,,,,,,,,2017-03-17,A,,,,DES ARBRES ... ET DES HOMMES,81.30Z,NAFRev2,N,1.368872,43.039745,0.4,street,Chateau la Barbe 09240 Allières,09007_1lt7qp,G,CHATEAU LA BARBE,
509593026,00032,50959302600032,O,2016-01-01,,,,2021-05-19T13:17:41,true,1,MONTEILLAS,,,,,09240,ALLIERES,,,09007,,,,,,,,,,,,,,,,,,,2016-01-01,A,,,,,71.11Z,NAFRev2,N,1.36141,43.031383,0.93,street,Monteillas 09240 Allières,09007_76je9s,D,MONTEILLAS,
509813986,00023,50981398600023,O,2015-07-06,,,5610CQ,2021-02-23T15:16:36,true,2,,,,,ESCOUGNALS,09240,ALLIERES,,,09007,,,,,,,,,,,,,,,,,,,2016-04-06,A,,,,,56.10C,NAFRev2,N,1.356013,43.035326,0.93,street,Escougnals 09240 Allières,09007_qn6rx0,G,ESCOUGNALS,
509928644,00012,50992864400012,O,2009-01-01,,,,2017-02-08T09:48:52,false,2,,,,LD,ORDAS,09240,ALLIERES,,,09007,,,,,,,,,,,,,,,,,,,2016-05-11,F,,,,,01.42Z,NAFRev2,N,1.357226,43.025782,0.93,street,Ordas 09240 Allières,09007_jlcl4c,G,ORDAS,
511444093,00013,51144409300013,O,2009-04-01,,,,2009-03-31T08:24:24,true,1,,,,,CAP DE LA SERRE,09240,ALLIERES,,,09007,,,,,,,,,,,,,,,,,,,2009-04-01,A,,,,,35.11Z,NAFRev2,N,-0.0913323,43.0690625,0.9,poi.wayside_cross,Cap de la Serre (Calvaire) Ségus,https://osm.org/node/1573014278,G,,
511444093,00021,51144409300021,O,2013-05-15,,,,2013-06-06T15:21:32,false,1,,,,LD,MONTCRU,09240,ALLIERES,,,09007,,,,,,,,,,,,,,,,,,,2013-05-15,A,,,,,35.11Z,NAFRev2,N,1.376167,43.031698,0.58,street,Moncru 09240 Allières,09007_ixbqid,G,MONCRU,
518209945,00014,51820994500014,O,1993-07-17,,,,2010-02-12T12:38:48,true,1,,,,LD,ESCOUGNALS,09240,ALLIERES,,,09007,,,,,,,,,,,,,,,,,,,1993-07-17,A,,,,,55.20Z,NAFRev2,N,1.356013,43.035326,0.93,street,Escougnals 09240 Allières,09007_qn6rx0,G,ESCOUGNALS,
519342133,00013,51934213300013,O,2010-01-06,,,,2012-11-10T01:39:21,false,3,,,,,ESCOUGNALS,09240,ALLIERES,,,09007,,,,,,,,,,,,,,,,,,,2010-12-01,F,,,,,31.09B,NAFRev2,N,1.356013,43.035326,0.93,street,Escougnals 09240 Allières,09007_qn6rx0,G,ESCOUGNALS,
530686930,00039,53068693000039,O,2013-07-01,,,,2021-02-23T15:49:14,true,1,LA BARBE AUX ABEILLES,,,,,09240,ALLIERES,,,09007,,,,,,,,,,,,,,,,,,,2013-07-01,A,LA BARAKA MIEL,,,,01.49Z,NAFRev2,N,1.368279,43.038943,0.49,street,La Barbe 09240 Allières,09007_c2szn1,D,LA BARBE,
753411198,00017,75341119800017,O,2012-08-23,,,4322AZ,2015-03-18T01:37:12,false,2,,,,,ORDAS D'EN HAUT,09240,ALLIERES,,,09007,,,,,,,,,,,,,,,,,,,2014-04-28,F,,,,,43.22A,NAFRev2,N,1.356976,43.025738,0.91,street,Lieu Dit Ordas d’En Haut 09240 Allières,09007_4rl445,G,LIEU DIT ORDAS D EN HAUT,
799668280,00016,79966828000016,O,2014-01-20,,,,2014-12-11T10:27:03,false,2,,,,,CHATEAU DE MONTCRU,09240,ALLIERES,,,09007,,,,,,,,,,,,,,,,,,,2014-12-06,F,,,,,86.90F,NAFRev2,N,1.368872,43.039745,0.4,street,Chateau la Barbe 09240 Allières,09007_1lt7qp,G,CHATEAU LA BARBE,
799668280,00040,79966828000040,O,2015-12-03,,,,2017-02-15T15:09:57,false,2,,1,,CHE,DE MONTCRU,09240,ALLIERES,,,09007,,,,,,,,,,,,,,,,,,,2016-08-01,F,,,,,86.90F,NAFRev2,N,1.376167,43.031698,0.34,street,Moncru 09240 Allières,09007_ixbqid,G,MONCRU,
799668280,00057,79966828000057,O,2016-03-01,,,,2016-09-22T04:40:33,false,2,,,,,CHATEAU DE MONTCRU,09240,ALLIERES,,,09007,,,,,,,,,,,,,,,,,,,2016-08-01,F,,,,,01.49Z,NAFRev2,N,1.368872,43.039745,0.4,street,Chateau la Barbe 09240 Allières,09007_1lt7qp,G,CHATEAU LA BARBE,
800677999,00016,80067799900016,O,2014-02-03,NN,,,2022-04-25T19:36:08,false,4,,,,,CHATEAU DE MONTCRU,09240,ALLIERES,,,09007,,,,,,,,,,,,,,,,,,,2018-08-08,F,,,,,16.10A,NAFRev2,N,1.368872,43.039745,0.4,street,Chateau la Barbe 09240 Allières,09007_1lt7qp,G,CHATEAU LA BARBE,
812412906,00032,81241290600032,O,2022-02-15,,,,2022-03-05T12:31:24,true,1,,,,,COUMEBERE,09240,ALLIERES,,,09007,,,,,,,,,,,,,,,,,,,2022-02-15,A,,,,,90.03A,NAFRev2,N,,,0,,,,,,
812885473,00015,81288547300015,O,2015-08-01,,,1610AQ,2022-01-19T04:01:05,true,3,,,,,CHATEAU DE MONTCRU,09240,ALLIERES,,,09007,,,,,,,,,,,,,,,,,,,2022-01-01,A,,,,LAMER PAYSAGES,81.30Z,NAFRev2,N,1.368872,43.039745,0.4,street,Chateau la Barbe 09240 Allières,09007_1lt7qp,G,CHATEAU LA BARBE,
834316333,00014,83431633300014,O,2017-12-07,,,,2018-01-03T03:43:23,true,1,,,,,SELLERIE DE MONTCRU,09240,ALLIERES,,,09007,,,,,,,,,,,,,,,,,,,2017-12-07,A,,,,,68.20A,NAFRev2,N,,,0,,,,,,
885241570,00013,88524157000013,O,2020-07-01,,,,2020-07-29T11:43:25,true,2,,,,,LA NOUGARASSE,09240,ALLIERES,,,09007,,,,,,,,,,,,,,,,,,,2020-07-29,A,,,,,47.22Z,NAFRev2,N,1.365034,43.035574,0.91,street,Ferme la Nougarasse 09240 Allières,09007_d5tqgl,G,FERME LA NOUGARASSE,
893630764,00015,89363076400015,O,2020-03-24,,,,2021-02-04T08:40:22,true,1,ORDAS D'EN HAUT,,,,,09240,ALLIERES,,,09007,,,,,,,,,,,,,,,,,,,2020-03-24,A,,,,,88.99B,NAFRev2,N,1.356976,43.025738,0.91,street,Lieu Dit Ordas d’En Haut 09240 Allières,09007_4rl445,D,LIEU DIT ORDAS D EN HAUT,
901818294,00018,90181829400018,O,2021-01-15,,,,2021-07-28T11:27:40,true,1,,,,,LE CASTERAS,09240,ALLIERES,,,09007,,,,,,,,,,,,,,,,,,,2021-01-15,A,,,,,85.51Z,NAFRev2,N,1.375642,43.029192,0.91,street,Lieu Dit le Casteras 09240 Allières,09007_pp8qg2,G,LIEU DIT LE CASTERAS,
