siren,nic,siret,statutDiffusionEtablissement,dateCreationEtablissement,trancheEffectifsEtablissement,anneeEffectifsEtablissement,activitePrincipaleRegistreMetiersEtablissement,dateDernierTraitementEtablissement,etablissementSiege,nombrePeriodesEtablissement,complementAdresseEtablissement,numeroVoieEtablissement,indiceRepetitionEtablissement,typeVoieEtablissement,libelleVoieEtablissement,codePostalEtablissement,libelleCommuneEtablissement,libelleCommuneEtrangerEtablissement,distributionSpecialeEtablissement,codeCommuneEtablissement,codeCedexEtablissement,libelleCedexEtablissement,codePaysEtrangerEtablissement,libellePaysEtrangerEtablissement,complementAdresse2Etablissement,numeroVoie2Etablissement,indiceRepetition2Etablissement,typeVoie2Etablissement,libelleVoie2Etablissement,codePostal2Etablissement,libelleCommune2Etablissement,libelleCommuneEtranger2Etablissement,distributionSpeciale2Etablissement,codeCommune2Etablissement,codeCedex2Etablissement,libelleCedex2Etablissement,codePaysEtranger2Etablissement,libellePaysEtranger2Etablissement,dateDebut,etatAdministratifEtablissement,enseigne1Etablissement,enseigne2Etablissement,enseigne3Etablissement,denominationUsuelleEtablissement,activitePrincipaleEtablissement,nomenclatureActivitePrincipaleEtablissement,caractereEmployeurEtablissement,longitude,latitude,geo_score,geo_type,geo_adresse,geo_id,geo_ligne,geo_l4,geo_l5
213100761,00013,21310076100013,O,1983-03-01,02,2019,,2021-10-27T08:07:45,true,4,,,,,,31210,BORDES-DE-RIVIERE,,,31076,,,,,,,,,,,,,,,,,,,2008-01-01,A,MAIRIE,,,,84.11Z,NAFRev2,O,,,0,,,,,,
213100761,00021,21310076100021,O,1983-12-21,01,2019,,2021-10-27T08:07:45,false,4,,,,,LE VILLAGE,31210,BORDES-DE-RIVIERE,,,31076,,,,,,,,,,,,,,,,,,,2008-04-04,A,ECOLE ELEMENTAIRE PUBLIQUE,,,,85.20Z,NAFRev2,N,0.63086,43.10597,0.77,street,Vlge Village 31210 Bordes-de-Rivière,31076_d0uyar,G,VLGE VILLAGE,
213100761,00039,21310076100039,O,2005-01-01,,,,2019-11-14T14:00:30,false,3,MAIRIE,,,,,31210,BORDES-DE-RIVIERE,,,31076,,,,,,,,,,,,,,,,,,,2008-12-02,F,LOTISSEMENT COMMUNAL,,,,42.99Z,NAFRev2,N,0.636335,43.107466,0.64,street,Chemin de la Prairie 31210 Bordes-de-Rivière,31076_0054,D,CHEMIN DE LA PRAIRIE,
263102071,00010,26310207100010,O,1984-06-19,NN,,,2019-11-14T14:00:30,true,4,,,,,MAIRIE,31210,BORDES-DE-RIVIERE,,,31076,,,,,,,,,,,,,,,,,,,1996-12-25,F,CCAS,,,,85.3K,NAF1993,N,0.636335,43.107466,0.64,street,Chemin de la Prairie 31210 Bordes-de-Rivière,31076_0054,G,CHEMIN DE LA PRAIRIE,
293101416,00015,29310141600015,O,1984-06-06,NN,,,2019-11-14T14:00:30,true,3,,,,,MAIRIE,31210,BORDES-DE-RIVIERE,,,31076,,,,,,,,,,,,,,,,,,,2008-01-01,A,,,,,42.99Z,NAFRev2,N,0.636335,43.107466,0.64,street,Chemin de la Prairie 31210 Bordes-de-Rivière,31076_0054,G,CHEMIN DE LA PRAIRIE,
293101903,00012,29310190300012,O,1995-12-13,NN,,,2019-11-14T14:00:30,true,4,MAIRIE,,,,,31210,BORDES-DE-RIVIERE,,,31076,,,,,,,,,,,,,,,,,,,2003-10-30,F,,,,,70.1C,NAFRev1,N,0.636335,43.107466,0.64,street,Chemin de la Prairie 31210 Bordes-de-Rivière,31076_0054,D,CHEMIN DE LA PRAIRIE,
314034182,00035,31403418200035,O,2011-08-01,,,,2021-02-23T10:40:25,true,1,,,,,LAS VIGNETOS,31210,BORDES-DE-RIVIERE,,,31076,,,,,,,,,,,,,,,,,,,2011-08-01,A,,,,,66.21Z,NAFRev2,N,0.633759,43.10742,0.94,street,Las Vignetos 31210 Bordes-de-Rivière,31076_59wh44,G,LAS VIGNETOS,
314848755,00018,31484875500018,O,,,,,2019-11-14T14:00:30,true,1,,,,,,31210,BORDES-DE-RIVIERE,,,31076,,,,,,,,,,,,,,,,,,,1984-12-25,F,,,,,62.11,NAP,N,,,0,,,,,,
314869645,00031,31486964500031,O,,,,,2019-11-14T14:00:30,true,1,,,,,,31210,BORDES-DE-RIVIERE,,,31076,,,,,,,,,,,,,,,,,,,1989-06-01,F,,,,,34.06,NAP,N,,,0,,,,,,
314956863,00018,31495686300018,O,,,,,2019-11-14T14:00:30,true,1,,,,,,31210,BORDES-DE-RIVIERE,,,31076,,,,,,,,,,,,,,,,,,,1984-12-25,F,,,,,67.04,NAP,N,,,0,,,,,,
317315489,00011,31731548900011,O,,NN,,,2019-11-14T14:00:30,true,1,,,,LD,LAS VIGNETTOS,31210,BORDES-DE-RIVIERE,,,31076,,,,,,,,,,,,,,,,,,,1987-03-31,F,,,,,80.08,NAP,N,0.633759,43.10742,0.81,street,Las Vignetos 31210 Bordes-de-Rivière,31076_59wh44,G,LAS VIGNETOS,
325818391,00030,32581839100030,O,,NN,,,2019-11-14T14:00:30,true,1,,,,,,31210,BORDES-DE-RIVIERE,,,31076,,,,,,,,,,,,,,,,,,,1987-09-09,F,,,,,67.01,NAP,N,,,0,,,,,,
331894428,00019,33189442800019,O,,NN,,,2019-11-14T14:00:30,true,1,,,,,,31210,BORDES-DE-RIVIERE,,,31076,,,,,,,,,,,,,,,,,,,,F,,,,,87.03,NAP,N,,,0,,,,,,
335110979,00028,33511097900028,O,2003-07-01,NN,,,2019-11-14T14:00:30,true,6,ROUTE NATIONALE 117,21,,LD,LAS VIGNETOS,31210,BORDES-DE-RIVIERE,,,31076,,,,,,,,,,,,,,,,,,,2015-12-31,F,,,,,47.78B,NAFRev2,N,0.63415,43.10685,0.88,housenumber,21 Chemin de Las Vignetos 31210 Bordes-de-Rivière,31076_0061_00021,G,21 CHEMIN DE LAS VIGNETOS,
337790729,00012,33779072900012,O,,,,,2019-11-14T14:00:30,true,1,,,,,SERRES DE RIVIERE,31210,BORDES-DE-RIVIERE,,,31076,,,,,,,,,,,,,,,,,,,1988-03-17,F,,,,,55.71,NAP,N,0.631422,43.129855,0.88,street,Route de la Serre 31210 Bordes-de-Rivière,31076_0057,G,ROUTE DE LA SERRE,
338103518,00019,33810351800019,O,1986-03-01,01,2019,,2021-10-27T08:31:41,true,4,,,,,,31210,BORDES-DE-RIVIERE,,,31076,,,,,,,,,,,,,,,,,,,2012-12-31,A,,,,,01.50Z,NAFRev2,O,,,0,,,,,,
340337344,00014,34033734400014,O,1987-01-01,NN,,,2019-11-14T14:00:30,true,3,,,,,,31210,BORDES-DE-RIVIERE,,,31076,,,,,,,,,,,,,,,,,,,1996-12-25,F,,,,,01.2A,NAF1993,N,,,0,,,,,,
343078713,00058,34307871300058,O,2010-03-17,NN,,,2019-11-14T14:00:30,false,2,54 D,54,D,HAM,DE LASSERRE,31210,BORDES-DE-RIVIERE,,,31076,,,,,,,,,,,,,,,,,,,2013-05-01,F,,,,,70.22Z,NAFRev2,O,0.639558,43.127983,0.92,street,Hameau de Lasserre 31210 Bordes-de-Rivière,31076_B030,G,HAMEAU DE LASSERRE,
344945886,00028,34494588600028,O,1999-07-13,NN,,,2019-11-14T14:00:30,true,3,,,,,LE BOURDALATS,31210,BORDES-DE-RIVIERE,,,31076,,,,,,,,,,,,,,,,,,,2008-01-01,A,,,,,66.22Z,NAFRev2,N,0.634035,43.119844,0.74,street,Route des Bourdalats 31210 Bordes-de-Rivière,31076_0024,G,ROUTE DES BOURDALATS,
344945886,00036,34494588600036,O,2001-01-01,NN,,,2019-11-14T14:00:30,false,4,,,,,LES BOURDALATS,31210,BORDES-DE-RIVIERE,,,31076,,,,,,,,,,,,,,,,,,,2015-12-31,F,,,,,01.11Z,NAFRev2,N,0.634035,43.119844,0.81,street,Route des Bourdalats 31210 Bordes-de-Rivière,31076_0024,G,ROUTE DES BOURDALATS,
345394324,00064,34539432400064,O,2010-01-01,,,,2019-11-14T14:00:30,false,2,,,,,LE VILLAGE,31210,BORDES-DE-RIVIERE,,,31076,,,,,,,,,,,,,,,,,,,2012-01-01,F,,,,,74.90B,NAFRev2,N,0.63086,43.10597,0.77,street,Vlge Village 31210 Bordes-de-Rivière,31076_d0uyar,G,VLGE VILLAGE,
352833818,00011,35283381800011,O,1990-01-01,NN,,,2019-11-14T14:00:30,true,4,,,,,,31210,BORDES-DE-RIVIERE,,,31076,,,,,,,,,,,,,,,,,,,2019-09-18,F,,,,,68.20B,NAFRev2,N,,,0,,,,,,
353461361,00035,35346136100035,O,2001-07-01,NN,,,2019-11-14T14:00:30,true,5,VILLAGE,,,,,31210,BORDES-DE-RIVIERE,,,31076,,,,,,,,,,,,,,,,,,,2010-06-30,F,,,,,68.31Z,NAFRev2,N,0.633178,43.105814,0.94,street,Village 31210 Bordes-de-Rivière,31076_7byuyo,D,VILLAGE,
354084832,00014,35408483200014,O,1990-02-04,NN,,,2019-11-14T14:00:30,false,3,,,,,,31210,BORDES-DE-RIVIERE,,,31076,,,,,,,,,,,,,,,,,,,1993-12-01,F,,,,,85.1G,NAF1993,N,,,0,,,,,,
377577879,00010,37757787900010,O,1990-01-01,NN,,,2019-11-14T14:00:30,true,4,,,,,,31210,BORDES-DE-RIVIERE,,,31076,,,,,,,,,,,,,,,,,,,2009-03-31,F,,,,,01.11Z,NAFRev2,N,,,0,,,,,,
383891611,00022,38389161100022,O,2013-05-01,,,,2021-02-23T11:12:04,true,1,,,,,LAS VIGNETOS,31210,BORDES-DE-RIVIERE,,,31076,,,,,,,,,,,,,,,,,,,2013-05-01,A,,,,,68.20B,NAFRev2,N,0.633759,43.10742,0.94,street,Las Vignetos 31210 Bordes-de-Rivière,31076_59wh44,G,LAS VIGNETOS,
384726824,00012,38472682400012,O,1992-01-01,NN,,,2019-11-14T14:00:30,true,4,,,,,,31210,BORDES-DE-RIVIERE,,,31076,,,,,,,,,,,,,,,,,,,2013-12-31,F,,,,,01.50Z,NAFRev2,N,,,0,,,,,,
393167572,00014,39316757200014,O,1993-11-15,NN,,,2019-11-14T14:00:30,true,3,,,,,,31210,BORDES-DE-RIVIERE,,,31076,,,,,,,,,,,,,,,,,,,2004-12-31,F,,,,,70.2C,NAFRev1,N,,,0,,,,,,
394666762,00015,39466676200015,O,1993-01-01,NN,,,2019-11-14T14:00:30,true,4,,,,,,31210,BORDES-DE-RIVIERE,,,31076,,,,,,,,,,,,,,,,,,,2015-01-30,F,,,,,01.42Z,NAFRev2,N,,,0,,,,,,
394768360,00015,39476836000015,O,1993-01-01,NN,,,2019-11-14T14:00:30,true,3,,,,,,31210,BORDES-DE-RIVIERE,,,31076,,,,,,,,,,,,,,,,,,,2008-01-01,A,,,,,01.11Z,NAFRev2,N,,,0,,,,,,
398226852,00018,39822685200018,O,1993-05-06,,,,2019-11-14T14:00:30,true,3,,,,,,31210,BORDES-DE-RIVIERE,,,31076,,,,,,,,,,,,,,,,,,,2008-01-01,A,,,,,94.99Z,NAFRev2,N,,,0,,,,,,
398422642,00015,39842264200015,O,1994-08-01,NN,,,2019-11-14T14:00:30,true,1,,,,,,31210,BORDES-DE-RIVIERE,,,31076,,,,,,,,,,,,,,,,,,,2001-01-31,F,,,,,01.3Z,NAF1993,N,,,0,,,,,,
399287366,00013,39928736600013,O,1995-01-01,NN,,,2022-04-27T04:22:57,true,4,,,,,,31210,BORDES-DE-RIVIERE,,,31076,,,,,,,,,,,,,,,,,,,2020-12-31,F,,,,,01.42Z,NAFRev2,N,,,0,,,,,,
400690244,00019,40069024400019,O,1994-01-01,NN,,,2019-11-14T14:00:30,true,1,,,,,,31210,BORDES-DE-RIVIERE,,,31076,,,,,,,,,,,,,,,,,,,2000-12-31,F,,,,,01.3Z,NAF1993,N,,,0,,,,,,
400900882,00012,40090088200012,O,,NN,,,2019-11-14T14:00:30,true,1,,,,,LE VILLAGE,31210,BORDES-DE-RIVIERE,,,31076,,,,,,,,,,,,,,,,,,,1996-02-29,F,,,,,18.2C,NAF1993,O,0.63086,43.10597,0.77,street,Vlge Village 31210 Bordes-de-Rivière,31076_d0uyar,G,VLGE VILLAGE,
403700677,00012,40370067700012,O,1996-01-01,NN,,,2019-11-14T14:00:30,false,4,,,,,,31210,BORDES-DE-RIVIERE,,,31076,,,,,,,,,,,,,,,,,,,2001-12-31,F,,,,,01.3Z,NAF1993,N,,,0,,,,,,
403700677,00020,40370067700020,O,2005-04-01,,,,2021-02-23T11:28:01,true,2,,,,LD,BOURDALATS,31210,BORDES-DE-RIVIERE,,,31076,,,,,,,,,,,,,,,,,,,2008-01-01,A,,,,,01.11Z,NAFRev2,N,0.634035,43.119844,0.92,street,Route des Bourdalats 31210 Bordes-de-Rivière,31076_0024,G,ROUTE DES BOURDALATS,
404018434,00013,40401843400013,O,1968-01-01,NN,,,2019-11-14T14:00:30,true,3,,,,,LA BOURDETTE,31210,BORDES-DE-RIVIERE,,,31076,,,,,,,,,,,,,,,,,,,2008-01-01,A,,,,,01.42Z,NAFRev2,N,0.645811,43.144547,0.91,street,Chemin de la Bourdette 31210 Bordes-de-Rivière,31076_0025,G,CHEMIN DE LA BOURDETTE,
404018442,00016,40401844200016,O,,NN,,,2019-11-14T14:00:30,true,1,,,,,,31210,BORDES-DE-RIVIERE,,,31076,,,,,,,,,,,,,,,,,,,1997-06-30,F,,,,,01.3Z,NAF1993,N,,,0,,,,,,
404018459,00010,40401845900010,O,1976-01-01,NN,,,2021-02-23T11:28:18,true,3,,,,,,31210,BORDES-DE-RIVIERE,,,31076,,,,,,,,,,,,,,,,,,,2008-01-01,A,,,,,01.41Z,NAFRev2,N,,,0,,,,,,
404018467,00013,40401846700013,O,1989-04-01,NN,,,2019-11-14T14:00:30,true,4,,,,,,31210,BORDES-DE-RIVIERE,,,31076,,,,,,,,,,,,,,,,,,,1999-12-25,F,,,,,01.2A,NAF1993,N,,,0,,,,,,
404018475,00016,40401847500016,O,1974-01-01,NN,,,2019-11-14T14:00:30,true,4,,,,,,31210,BORDES-DE-RIVIERE,,,31076,,,,,,,,,,,,,,,,,,,2000-12-31,F,,,,,01.3Z,NAF1993,N,,,0,,,,,,
404018483,00010,40401848300010,O,1983-01-01,NN,,,2019-11-14T14:00:30,true,4,,,,,,31210,BORDES-DE-RIVIERE,,,31076,,,,,,,,,,,,,,,,,,,2010-12-31,F,,,,,01.11Z,NAFRev2,N,,,0,,,,,,
404040404,00026,40404040400026,O,2000-01-01,,,,2019-11-14T14:00:30,true,4,,,,,,31210,BORDES-DE-RIVIERE,,,31076,,,,,,,,,,,,,,,,,,,2016-12-31,F,,,,,01.11Z,NAFRev2,N,,,0,,,,,,
404046591,00024,40404659100024,O,1989-01-01,,,,2019-11-14T14:00:30,true,3,,,,LD,PETIT,31210,BORDES-DE-RIVIERE,,,31076,,,,,,,,,,,,,,,,,,,2008-01-01,A,,,,,01.11Z,NAFRev2,N,0.647682,43.144364,0.91,street,Chemin de Petit 31210 Bordes-de-Rivière,31076_0050,G,CHEMIN DE PETIT,
405283904,00010,40528390400010,O,1980-01-01,NN,,,2019-11-14T14:00:30,true,1,,,,,,31210,BORDES-DE-RIVIERE,,,31076,,,,,,,,,,,,,,,,,,,2000-01-04,F,,,,,01.3Z,NAF1993,N,,,0,,,,,,
405283912,00013,40528391200013,O,1969-01-01,NN,,,2019-11-14T14:00:30,true,3,,,,LD,LES BOURDALATS,31210,BORDES-DE-RIVIERE,,,31076,,,,,,,,,,,,,,,,,,,2008-01-01,A,,,,,01.11Z,NAFRev2,N,0.634035,43.119844,0.81,street,Route des Bourdalats 31210 Bordes-de-Rivière,31076_0024,G,ROUTE DES BOURDALATS,
413748864,00035,41374886400035,O,2011-01-01,,,4334ZC,2021-04-22T10:15:52,false,3,,,,LD,LES BOURDALATS,31210,BORDES-DE-RIVIERE,,,31076,,,,,,,,,,,,,,,,,,,2014-01-28,F,,,,,43.34Z,NAFRev2,O,0.634035,43.119844,0.81,street,Route des Bourdalats 31210 Bordes-de-Rivière,31076_0024,G,ROUTE DES BOURDALATS,
413945098,00023,41394509800023,O,1997-07-01,,,,2019-11-14T14:00:30,true,4,,,,,LE VILLAGE,31210,BORDES-DE-RIVIERE,,,31076,,,,,,,,,,,,,,,,,,,2012-01-01,A,,,,,01.50Z,NAFRev2,N,0.63086,43.10597,0.77,street,Vlge Village 31210 Bordes-de-Rivière,31076_d0uyar,G,VLGE VILLAGE,
415371913,00021,41537191300021,O,2012-01-31,,,,2021-02-23T11:37:53,true,1,CHEZ MADAME MICHELLE GARROS,,,,,31210,BORDES-DE-RIVIERE,,,31076,,,,,,,,,,,,,,,,,,,2012-01-31,A,,,,,68.20B,NAFRev2,N,,,0,,,,,,
420217630,00011,42021763000011,O,1998-08-01,NN,,,2019-11-14T14:00:30,true,4,,,,,,31210,BORDES-DE-RIVIERE,,,31076,,,,,,,,,,,,,,,,,,,2012-01-01,A,,,,,01.45Z,NAFRev2,N,,,0,,,,,,
420920589,00017,42092058900017,O,1997-01-01,NN,,,2019-11-14T14:00:30,true,5,,,,,,31210,BORDES-DE-RIVIERE,,,31076,,,,,,,,,,,,,,,,,,,2011-12-25,F,,,,,01.11Z,NAFRev2,N,,,0,,,,,,
425097094,00014,42509709400014,O,1999-10-29,NN,,,2019-11-14T14:00:30,true,3,,,,RUE,DE DEVANT,31210,BORDES-DE-RIVIERE,,,31076,,,,,,,,,,,,,,,,,,,2008-01-01,A,,,,,68.20B,NAFRev2,N,0.63215,43.10559,0.94,street,Rue de Devant 31210 Bordes-de-Rivière,31076_0034,G,RUE DE DEVANT,
425252202,00014,42525220200014,O,1984-01-01,NN,,,2019-11-14T14:00:30,true,6,,,,,VILLAGE,31210,BORDES-DE-RIVIERE,,,31076,,,,,,,,,,,,,,,,,,,2014-12-31,F,,,,,96.09Z,NAFRev2,N,0.633178,43.105814,0.94,street,Village 31210 Bordes-de-Rivière,31076_7byuyo,G,VILLAGE,
429459308,00012,42945930800012,O,2000-01-15,NN,,,2019-11-14T14:00:30,true,4,VILLAGE,,,,,31210,BORDES-DE-RIVIERE,,,31076,,,,,,,,,,,,,,,,,,,2003-10-30,F,,,,,85.1C,NAFRev1,N,0.633178,43.105814,0.94,street,Village 31210 Bordes-de-Rivière,31076_7byuyo,D,VILLAGE,
429502073,00019,42950207300019,O,2000-01-05,,,,2019-11-14T14:00:30,true,4,,,,,,31210,BORDES-DE-RIVIERE,,,31076,,,,,,,,,,,,,,,,,,,2011-12-31,F,,,,,01.45Z,NAFRev2,N,,,0,,,,,,
429569601,00017,42956960100017,O,2000-01-01,NN,,,2019-11-14T14:00:30,true,4,,,,LD,LES BOURDALATS,31210,BORDES-DE-RIVIERE,,,31076,,,,,,,,,,,,,,,,,,,2014-12-31,F,,,,,01.11Z,NAFRev2,N,0.634035,43.119844,0.81,street,Route des Bourdalats 31210 Bordes-de-Rivière,31076_0024,G,ROUTE DES BOURDALATS,
430507699,00014,43050769900014,O,1991-01-01,,,,2019-11-14T14:00:30,true,1,,,,,,31210,BORDES-DE-RIVIERE,,,31076,,,,,,,,,,,,,,,,,,,1999-12-31,F,,,,,01.3Z,NAF1993,N,,,0,,,,,,
430510107,00013,43051010700013,O,1982-01-01,NN,,,2019-11-14T14:00:30,true,3,,,,,,31210,BORDES-DE-RIVIERE,,,31076,,,,,,,,,,,,,,,,,,,2008-01-01,A,,,,,01.42Z,NAFRev2,N,,,0,,,,,,
432537835,00014,43253783500014,O,1999-07-12,NN,,,2020-08-25T10:20:37,true,5,CHEZ MR ET MME GABORIAN,,,,LES BOURDALATS,31210,BORDES-DE-RIVIERE,,,31076,,,,,,,,,,,,,,,,,,,2018-07-02,A,,,,,94.99Z,NAFRev2,O,0.634035,43.119844,0.81,street,Route des Bourdalats 31210 Bordes-de-Rivière,31076_0024,G,ROUTE DES BOURDALATS,
433131398,00011,43313139800011,O,2000-08-28,NN,,,2019-11-14T14:00:30,true,7,,,,,MAIRIE,31210,BORDES-DE-RIVIERE,,,31076,,,,,,,,,,,,,,,,,,,2011-03-31,A,,,,,90.01Z,NAFRev2,N,0.636335,43.107466,0.64,street,Chemin de la Prairie 31210 Bordes-de-Rivière,31076_0054,G,CHEMIN DE LA PRAIRIE,
433552098,00017,43355209800017,O,2001-01-01,NN,,,2019-11-14T14:00:30,true,3,,,,,VILLAGE,31210,BORDES-DE-RIVIERE,,,31076,,,,,,,,,,,,,,,,,,,2008-01-01,A,,,,,01.42Z,NAFRev2,N,0.633178,43.105814,0.94,street,Village 31210 Bordes-de-Rivière,31076_7byuyo,G,VILLAGE,
434131553,00019,43413155300019,O,2001-02-01,NN,,,2019-11-14T14:00:30,true,5,,,,,LES ESPONNES,31210,BORDES-DE-RIVIERE,,,31076,,,,,,,,,,,,,,,,,,,2013-01-01,A,,,,,01.11Z,NAFRev2,N,0.629218,43.108175,0.77,street,Impasse des Esponnes 31210 Bordes-de-Rivière,31076_0038,G,IMPASSE DES ESPONNES,
434407284,00018,43440728400018,O,2001-01-24,NN,,,2019-11-14T14:00:30,true,4,,,,,,31210,BORDES-DE-RIVIERE,,,31076,,,,,,,,,,,,,,,,,,,2013-12-31,F,,,,,68.20B,NAFRev2,N,,,0,,,,,,
435010848,00032,43501084800032,O,2011-10-28,,,,2019-11-14T14:00:30,false,2,,,,,LE VILLAGE,31210,BORDES-DE-RIVIERE,,,31076,,,,,,,,,,,,,,,,,,,2014-05-26,F,,,,,81.22Z,NAFRev2,N,0.63086,43.10597,0.77,street,Vlge Village 31210 Bordes-de-Rivière,31076_d0uyar,G,VLGE VILLAGE,
439464488,00014,43946448800014,O,1979-10-25,NN,,,2019-11-14T14:00:30,true,3,,,,,MAIRIE,31210,BORDES-DE-RIVIERE,,,31076,,,,,,,,,,,,,,,,,,,2008-01-01,A,,,,,94.99Z,NAFRev2,N,0.636335,43.107466,0.64,street,Chemin de la Prairie 31210 Bordes-de-Rivière,31076_0054,G,CHEMIN DE LA PRAIRIE,
439887886,00042,43988788600042,O,2021-09-01,,,,2021-11-06T14:35:12,true,1,,18,,CHE,DES ESBINETS,31210,BORDES-DE-RIVIERE,,,31076,,,,,,,,,,,,,,,,,,,2021-09-01,A,,,,,85.51Z,NAFRev2,N,0.629633,43.119462,0.85,housenumber,18 Chemin des Esbinets 31210 Bordes-de-Rivière,31076_0037_00018,G,18 CHEMIN DES ESBINETS,
440806354,00013,44080635400013,O,2002-02-01,NN,,,2019-11-14T14:00:30,true,5,,,,LD,LES ESPONNES,31210,BORDES-DE-RIVIERE,,,31076,,,,,,,,,,,,,,,,,,,2013-03-15,F,,,,,01.11Z,NAFRev2,N,0.629218,43.108175,0.77,street,Impasse des Esponnes 31210 Bordes-de-Rivière,31076_0038,G,IMPASSE DES ESPONNES,
442579959,00010,44257995900010,O,2002-07-01,NN,,,2019-11-14T14:00:30,true,3,,,,,LES SERRES,31210,BORDES-DE-RIVIERE,,,31076,,,,,,,,,,,,,,,,,,,2008-01-01,A,,,,,68.20B,NAFRev2,N,0.631422,43.129855,0.56,street,Route de la Serre 31210 Bordes-de-Rivière,31076_0057,G,ROUTE DE LA SERRE,
443613799,00016,44361379900016,O,2002-10-07,NN,,,2019-11-14T14:00:30,true,3,,,,,LES BOURDALATS,31210,BORDES-DE-RIVIERE,,,31076,,,,,,,,,,,,,,,,,,,2006-03-31,F,,,,,45.3A,NAFRev1,N,0.634035,43.119844,0.81,street,Route des Bourdalats 31210 Bordes-de-Rivière,31076_0024,G,ROUTE DES BOURDALATS,
448288506,00034,44828850600034,O,2014-01-15,,,,2019-11-14T14:00:30,false,2,,,,,LES CHAMPS DE LA COMME,31210,BORDES-DE-RIVIERE,,,31076,,,,,,,,,,,,,,,,,,,2019-10-01,F,,,,RENOV' MAISON,43.39Z,NAFRev2,N,0.634536,43.127433,0.94,street,Les Champs de la Comme 31210 Bordes-de-Rivière,31076_B013,G,LES CHAMPS DE LA COMME,
448339770,00019,44833977000019,O,2003-04-01,NN,,,2019-11-14T14:00:30,true,3,COTE DU MOURAS,,,,LA SERRE DE BORDES,31210,BORDES-DE-RIVIERE,,,31076,,,,,,,,,,,,,,,,,,,2003-12-25,F,,,,,70.3A,NAFRev1,N,0.631422,43.129855,0.92,street,Route de la Serre 31210 Bordes-de-Rivière,31076_0057,G,ROUTE DE LA SERRE,
448398966,00029,44839896600029,O,2019-06-01,,,,2021-02-23T13:30:02,true,1,,8,,CHE,DES ESBINETS - LES BOURDALATS,31210,BORDES-DE-RIVIERE,,,31076,,,,,,,,,,,,,,,,,,,2019-06-01,A,,,,,68.20B,NAFRev2,N,0.631438,43.119686,0.58,housenumber,8 Chemin des Esbinets 31210 Bordes-de-Rivière,31076_0037_00008,G,8 CHEMIN DES ESBINETS,
451186415,00019,45118641500019,O,2003-11-18,NN,,,2019-11-14T14:00:30,true,3,,,,,RESIDENCE DES BOURDALATS,31210,BORDES-DE-RIVIERE,,,31076,,,,,,,,,,,,,,,,,,,2008-01-01,A,,,,,68.20B,NAFRev2,N,0.630408,43.119845,0.63,street,Pres des Bourdalats 31210 Bordes-de-Rivière,31076_B046,G,PRES DES BOURDALATS,
479281149,00027,47928114900027,O,2006-08-31,,,,2019-11-14T14:00:30,false,2,METAIRIE SOU VILLE,,,LD,LES BOURDALATS,31210,BORDES-DE-RIVIERE,,,31076,,,,,,,,,,,,,,,,,,,2007-04-30,F,,,,,92.3F,NAFRev1,N,0.634035,43.119844,0.81,street,Route des Bourdalats 31210 Bordes-de-Rivière,31076_0024,G,ROUTE DES BOURDALATS,
479971293,00010,47997129300010,O,2004-12-06,NN,,,2019-11-14T14:00:30,false,3,,,,RUE,DE DEVANT,31210,BORDES-DE-RIVIERE,,,31076,,,,,,,,,,,,,,,,,,,2006-03-06,F,,,,,74.1G,NAFRev1,O,0.63215,43.10559,0.94,street,Rue de Devant 31210 Bordes-de-Rivière,31076_0034,G,RUE DE DEVANT,
484454913,00019,48445491300019,O,2005-10-03,,,,2019-11-14T14:00:30,true,3,,,,RUE,DE L ECOLE,31210,BORDES-DE-RIVIERE,,,31076,,,,,,,,,,,,,,,,,,,2011-12-16,F,,,,,43.33Z,NAFRev2,N,0.633972,43.109989,0.75,street,Impasse de l’Ecole 31210 Bordes-de-Rivière,31076_0035,G,IMPASSE DE L ECOLE,
489313494,00028,48931349400028,O,2009-07-03,,,,2019-11-14T14:00:30,false,2,,,,,VILLAGE,31210,BORDES-DE-RIVIERE,,,31076,,,,,,,,,,,,,,,,,,,2011-04-30,F,,,,,43.12A,NAFRev2,N,0.633178,43.105814,0.94,street,Village 31210 Bordes-de-Rivière,31076_7byuyo,G,VILLAGE,
498884568,00011,49888456800011,O,2007-07-09,,,,2019-11-14T14:00:30,true,3,,,,,CHAMP DE LA COUMME,31210,BORDES-DE-RIVIERE,,,31076,,,,,,,,,,,,,,,,,,,2008-10-31,F,,,,,43.34Z,NAFRev2,N,0.634536,43.127433,0.69,street,Les Champs de la Comme 31210 Bordes-de-Rivière,31076_B013,G,LES CHAMPS DE LA COMME,
501045157,00028,50104515700028,O,2010-02-16,,,,2019-11-14T14:00:30,false,2,,,,,LE VILLAGE,31210,BORDES-DE-RIVIERE,,,31076,,,,,,,,,,,,,,,,,,,2010-12-31,F,,,,,43.31Z,NAFRev2,N,0.63086,43.10597,0.77,street,Vlge Village 31210 Bordes-de-Rivière,31076_d0uyar,G,VLGE VILLAGE,
501045157,00036,50104515700036,O,2018-01-10,,,,2021-02-23T14:10:58,true,1,,17,,RUE,DE DEVANT,31210,BORDES-DE-RIVIERE,,,31076,,,,,,,,,,,,,,,,,,,2018-01-10,A,,,,,43.31Z,NAFRev2,N,0.63181,43.1057,0.94,housenumber,17 Rue de Devant 31210 Bordes-de-Rivière,31076_0034_00017,G,17 RUE DE DEVANT,
502760374,00012,50276037400012,O,2008-03-01,,,,2019-11-14T14:00:30,true,1,,,,RUE,DU DEVANT,31210,BORDES-DE-RIVIERE,,,31076,,,,,,,,,,,,,,,,,,,2008-03-01,A,,,,,68.20B,NAFRev2,N,0.63215,43.10559,0.75,street,Rue de Devant 31210 Bordes-de-Rivière,31076_0034,G,RUE DE DEVANT,
503566226,00018,50356622600018,O,2008-04-08,,,,2019-11-14T14:00:30,true,2,,,,,LES BOURDALATS,31210,BORDES-DE-RIVIERE,,,31076,,,,,,,,,,,,,,,,,,,2010-06-25,F,,,,,96.09Z,NAFRev2,N,0.634035,43.119844,0.81,street,Route des Bourdalats 31210 Bordes-de-Rivière,31076_0024,G,ROUTE DES BOURDALATS,
511892937,00018,51189293700018,O,2009-04-01,,,,2019-11-14T14:00:30,true,1,,,,LD,LES BOURDALATS,31210,BORDES-DE-RIVIERE,,,31076,,,,,,,,,,,,,,,,,,,2009-04-01,A,,,,,01.42Z,NAFRev2,N,0.634035,43.119844,0.81,street,Route des Bourdalats 31210 Bordes-de-Rivière,31076_0024,G,ROUTE DES BOURDALATS,
517429064,00010,51742906400010,O,2009-11-01,,,,2019-11-14T14:00:30,true,1,,,,,LE VILLAGE,31210,BORDES-DE-RIVIERE,,,31076,,,,,,,,,,,,,,,,,,,2009-11-01,A,,,,,81.30Z,NAFRev2,N,0.63086,43.10597,0.77,street,Vlge Village 31210 Bordes-de-Rivière,31076_d0uyar,G,VLGE VILLAGE,
517436804,00028,51743680400028,O,2011-10-01,NN,,,2019-11-14T14:00:30,false,2,,6,,LOT,LA VIGNETOS,31210,BORDES-DE-RIVIERE,,,31076,,,,,,,,,,,,,,,,,,,2012-10-01,F,COTES & RENOVATION,,,,43.91A,NAFRev2,O,0.634319,43.109391,0.63,street,Lotissement de Las Vignetos 31210 Bordes-de-Rivière,31076_1x4ok6,G,LOTISSEMENT DE LAS VIGNETOS,
518006150,00024,51800615000024,O,2014-01-01,,,,2021-02-23T15:28:57,true,1,,1,,,LAS VIGNETOS,31210,BORDES-DE-RIVIERE,,,31076,,,,,,,,,,,,,,,,,,,2014-01-01,A,,,,,95.29Z,NAFRev2,N,0.634689,43.10958,0.92,housenumber,1 Lotissement de Las Vignetos 31210 Bordes-de-Rivière,31076_1x4ok6_00001,G,1 LOTISSEMENT DE LAS VIGNETOS,
523021590,00022,52302159000022,O,2016-01-15,01,2019,,2021-10-27T08:30:38,false,3,LA SERRES DE BORDES,,,,LE PLAN DU BOSC,31210,BORDES-DE-RIVIERE,,,31076,,,,,,,,,,,,,,,,,,,2021-04-21,F,,,,,43.99C,NAFRev2,O,0.63234,43.131375,0.76,street,Chemin du Plan du Bosc 31210 Bordes-de-Rivière,31076_0051,G,CHEMIN DU PLAN DU BOSC,
523100725,00010,52310072500010,O,2010-06-07,,,,2019-11-14T14:00:30,false,2,LAS VIGNETOS,,,RUE,PRINCIPALE,31210,BORDES-DE-RIVIERE,,,31076,,,,,,,,,,,,,,,,,,,2016-06-23,F,,,,,68.20B,NAFRev2,N,0.632677,43.106867,0.95,street,Rue Principale 31210 Bordes-de-Rivière,31076_0055,G,RUE PRINCIPALE,
523710929,00010,52371092900010,O,2010-07-13,,,4332AA,2019-11-14T14:00:30,true,2,LE BEDAT,,,,LA SERRE DE BORDES,31210,BORDES-DE-RIVIERE,,,31076,,,,,,,,,,,,,,,,,,,2018-03-25,A,,,,,43.32A,NAFRev2,O,0.631422,43.129855,0.92,street,Route de la Serre 31210 Bordes-de-Rivière,31076_0057,G,ROUTE DE LA SERRE,
524497542,00026,52449754200026,O,2010-11-01,,,,2019-11-14T14:00:30,false,3,,,,QUA,DE LA SERRE DE BORDES,31210,BORDES-DE-RIVIERE,,,31076,,,,,,,,,,,,,,,,,,,2011-10-01,F,,,,,82.99Z,NAFRev2,N,0.631422,43.129855,0.78,street,Route de la Serre 31210 Bordes-de-Rivière,31076_0057,G,ROUTE DE LA SERRE,
524596418,00011,52459641800011,O,2010-09-15,,,4391AZ,2019-11-14T14:00:30,false,2,L ENCLOS PUGET,,,RUE,DE DEVANT,31210,BORDES-DE-RIVIERE,,,31076,,,,,,,,,,,,,,,,,,,2015-12-01,F,,,,,43.91A,NAFRev2,N,0.63215,43.10559,0.94,street,Rue de Devant 31210 Bordes-de-Rivière,31076_0034,G,RUE DE DEVANT,