siren,nic,siret,statutDiffusionEtablissement,dateCreationEtablissement,trancheEffectifsEtablissement,anneeEffectifsEtablissement,activitePrincipaleRegistreMetiersEtablissement,dateDernierTraitementEtablissement,etablissementSiege,nombrePeriodesEtablissement,complementAdresseEtablissement,numeroVoieEtablissement,indiceRepetitionEtablissement,typeVoieEtablissement,libelleVoieEtablissement,codePostalEtablissement,libelleCommuneEtablissement,libelleCommuneEtrangerEtablissement,distributionSpecialeEtablissement,codeCommuneEtablissement,codeCedexEtablissement,libelleCedexEtablissement,codePaysEtrangerEtablissement,libellePaysEtrangerEtablissement,complementAdresse2Etablissement,numeroVoie2Etablissement,indiceRepetition2Etablissement,typeVoie2Etablissement,libelleVoie2Etablissement,codePostal2Etablissement,libelleCommune2Etablissement,libelleCommuneEtranger2Etablissement,distributionSpeciale2Etablissement,codeCommune2Etablissement,codeCedex2Etablissement,libelleCedex2Etablissement,codePaysEtranger2Etablissement,libellePaysEtranger2Etablissement,dateDebut,etatAdministratifEtablissement,enseigne1Etablissement,enseigne2Etablissement,enseigne3Etablissement,denominationUsuelleEtablissement,activitePrincipaleEtablissement,nomenclatureActivitePrincipaleEtablissement,caractereEmployeurEtablissement,longitude,latitude,geo_score,geo_type,geo_adresse,geo_id,geo_ligne,geo_l4,geo_l5
210202743,00014,21020274300014,O,1983-03-01,02,2020,,2022-08-29T09:05:40,true,4,,46,,CHS,BRUNEHAUT,02420,ESTREES,,,02291,,,,,,,,,,,,,,,,,,,2008-01-01,A,MAIRIE,,,,84.11Z,NAFRev2,O,3.287468,49.967495,0.73,housenumber,46 Rue de la Chaussee Brunehaut 02420 Estrées,02291_0010_00046,G,46 RUE DE LA CHAUSSEE BRUNEHAUT,
210202743,00022,21020274300022,O,1983-12-21,02,2020,,2022-08-29T09:05:40,false,3,,46,,CHS,BRUNEHAUT,02420,ESTREES,,,02291,,,,,,,,,,,,,,,,,,,2008-01-01,A,ECOLE PRIMAIRE PUBLIQUE,,,,85.20Z,NAFRev2,N,3.287468,49.967495,0.73,housenumber,46 Rue de la Chaussee Brunehaut 02420 Estrées,02291_0010_00046,G,46 RUE DE LA CHAUSSEE BRUNEHAUT,
210202743,00030,21020274300030,O,1995-12-25,NN,,,2013-10-05T12:33:00,false,3,MAIRIE,46,,CHS,BRUNEHAUT,02420,ESTREES,,,02291,,,,,,,,,,,,,,,,,,,2012-12-25,F,SERVICE DES EAUX,,,,36.00Z,NAFRev2,N,3.287468,49.967495,0.73,housenumber,46 Rue de la Chaussee Brunehaut 02420 Estrées,02291_0010_00046,G,46 RUE DE LA CHAUSSEE BRUNEHAUT,
260202866,00018,26020286600018,O,1983-03-01,NN,,,2008-01-04T18:54:49,true,3,MAIRIE,46,,CHS,BRUNEHAUT,02420,ESTREES,,,02291,,,,,,,,,,,,,,,,,,,2008-01-01,A,CCAS,,,,88.99B,NAFRev2,N,3.287468,49.967495,0.73,housenumber,46 Rue de la Chaussee Brunehaut 02420 Estrées,02291_0010_00046,G,46 RUE DE LA CHAUSSEE BRUNEHAUT,
270200918,00018,27020091800018,O,,,,,,true,1,,,,,,02420,ESTREES,,,02291,,,,,,,,,,,,,,,,,,,1995-12-25,F,,,,,41.0Z,NAF1993,N,,,0,,,,,,
304893530,00010,30489353000010,O,,NN,,,,true,1,,,,,,02420,ESTREES,,,02291,,,,,,,,,,,,,,,,,,,,F,,,,,62.41,NAP,N,,,0,,,,,,
306173774,00010,30617377400010,O,1976-01-01,NN,,,2008-11-07T00:21:55,true,4,,29,,RTE,NATIONALE,02420,ESTREES,,,02291,,,,,,,,,,,,,,,,,,,1993-12-25,F,,,,,45.4J,NAF1993,N,1.2279812,49.230352,0.77,poi,Route Nationale (Pont) Saint-Pierre-du-Vauvray,https://osm.org/way/95838375,G,,
306376625,00019,30637662500019,O,1976-01-01,NN,,,2019-11-21T08:25:28,false,5,,5,,RUE,DE JONCOURT,02420,ESTREES,,,02291,,,,,,,,,,,,,,,,,,,2011-04-30,F,,,,,43.99C,NAFRev2,O,3.28886,49.966374,0.94,housenumber,5 Rue de Joncourt 02420 Estrées,02291_0030_00005,G,5 RUE DE JONCOURT,
306376625,00027,30637662500027,O,2019-12-02,,,,2020-01-01T03:48:09,true,1,,24,,RUE,DE LA CHAUSSEE BRUNEHAUT,02420,ESTREES,,,02291,,,,,,,,,,,,,,,,,,,2019-12-02,A,,,,DE STEUR YVES,47.91A,NAFRev2,N,3.284101,49.96584,0.95,housenumber,24 Rue de la Chaussee Brunehaut 02420 Estrées,02291_0010_00024,G,24 RUE DE LA CHAUSSEE BRUNEHAUT,
306423286,00013,30642328600013,O,,,,,,true,1,,,,RTE,NATIONALE,02420,ESTREES,,,02291,,,,,,,,,,,,,,,,,,,1984-12-25,F,,,,,87.01,NAP,N,1.2279812,49.230352,0.77,poi,Route Nationale (Pont) Saint-Pierre-du-Vauvray,https://osm.org/way/95838375,G,,
308017375,00012,30801737500012,O,1976-01-01,NN,,,2007-08-02T04:14:38,false,4,,69,,CHS,BRUNEHAUT,02420,ESTREES,,,02291,,,,,,,,,,,,,,,,,,,2005-01-01,F,,,,,25.1E,NAFRev1,N,3.290051,49.968922,0.73,housenumber,69 Rue de la Chaussee Brunehaut 02420 Estrées,02291_0010_00069,G,69 RUE DE LA CHAUSSEE BRUNEHAUT,
311363469,00025,31136346900025,O,1997-08-01,NN,,,,false,4,,31,,,CHAUSSEE BRUNEHAUT,02420,ESTREES,,,02291,,,,,,,,,,,,,,,,,,,2002-03-03,F,,,,,15.8C,NAF1993,O,3.286698,49.966933,0.9,housenumber,31 Rue de la Chaussee Brunehaut 02420 Estrées,02291_0010_00031,G,31 RUE DE LA CHAUSSEE BRUNEHAUT,
314068305,00015,31406830500015,O,,,,,,true,1,,7,,RUE,DU CATELET,02420,ESTREES,,,02291,,,,,,,,,,,,,,,,,,,,F,,,,,01.07,NAP,N,3.284027,49.963484,0.62,housenumber,7 Ruelle du Chateau 02420 Estrées,02291_0007_00007,G,7 RUELLE DU CHATEAU,
314068347,00017,31406834700017,O,1978-01-01,,,,2007-01-18T09:13:33,true,4,,84,,RUE,NATIONALE,02420,ESTREES,,,02291,,,,,,,,,,,,,,,,,,,1998-12-25,F,,,,,01.3Z,NAF1993,N,,,0,,,,,,
318151768,00013,31815176800013,O,,NN,,,,true,1,,1,,RUE,DE JONCOURT,02420,ESTREES,,,02291,,,,,,,,,,,,,,,,,,,1989-01-01,F,,,,,81.21,NAP,N,3.287392,49.967104,0.94,housenumber,1 Rue de Joncourt 02420 Estrées,02291_0030_00001,G,1 RUE DE JONCOURT,
319090379,00011,31909037900011,O,,NN,,,,true,1,,15,,RUE,DE L'ABBAYE,02420,ESTREES,,,02291,,,,,,,,,,,,,,,,,,,1998-08-17,F,,,,,45.3A,NAF1993,N,3.285421,49.968207,0.95,housenumber,15 Rue de l’Abbaye 02420 Estrées,02291_0002_00015,G,15 RUE DE L ABBAYE,
323244079,00022,32324407900022,O,1997-04-01,01,2020,,2022-08-29T09:17:51,true,4,,33,,RUE,DE L'ABBAYE,02420,ESTREES,,,02291,,,,,,,,,,,,,,,,,,,2008-01-01,A,,,,,01.11Z,NAFRev2,N,3.283259,49.968622,0.95,housenumber,33 Rue de l’Abbaye 02420 Estrées,02291_0002_00033,G,33 RUE DE L ABBAYE,
331122085,00011,33112208500011,O,1984-11-01,NN,,,2008-11-07T00:49:46,false,4,,31,,,GRANDE RUE,02420,ESTREES,,,02291,,,,,,,,,,,,,,,,,,,1997-06-24,F,,,,,15.8C,NAF1993,O,3.283751,49.968415,0.33,housenumber,31 Rue de l’Abbaye 02420 Estrées,02291_0002_00031,G,31 RUE DE L ABBAYE,
335245981,00022,33524598100022,O,1988-01-01,NN,,,,true,3,,,,,,02420,ESTREES,,,02291,,,,,,,,,,,,,,,,,,,1994-03-30,F,,,,,51.1R,NAF1993,N,,,0,,,,,,
339305054,00019,33930505400019,O,1986-10-07,NN,,,2006-12-15T00:29:22,false,3,,41,,RTE,NATIONALE,02420,ESTREES,,,02291,,,,,,,,,,,,,,,,,,,1992-01-04,F,,,,,85.1G,NAF1993,N,1.2279812,49.230352,0.77,poi,Route Nationale (Pont) Saint-Pierre-du-Vauvray,https://osm.org/way/95838375,G,,
345114243,00016,34511424300016,O,1988-04-01,NN,,,,false,4,,1,,RUE,JONCOURT,02420,ESTREES,,,02291,,,,,,,,,,,,,,,,,,,1998-01-01,F,,,,,70.2C,NAF1993,N,3.287392,49.967104,0.94,housenumber,1 Rue de Joncourt 02420 Estrées,02291_0030_00001,G,1 RUE DE JONCOURT,
352526479,00014,35252647900014,O,1989-12-04,,,,,true,3,,59,,RUE,DE L INDUSTRIE,02420,ESTREES,,,02291,,,,,,,,,,,,,,,,,,,1991-12-25,F,,,,,69.11,NAP,N,3.291068,49.969646,0.82,street,Rue de l’Industrie 02420 Estrées,02291_0025,G,RUE DE L INDUSTRIE,
353471469,00018,35347146900018,O,,NN,,,,true,1,,33,,RUE,NATIONALE,02420,ESTREES,,,02291,,,,,,,,,,,,,,,,,,,1993-12-31,F,,,,,74.8F,NAF1993,N,,,0,,,,,,
356000224,03691,35600022403691,O,1991-01-01,NN,,,2009-10-17T12:43:56,false,4,,1,,RUE,ABBAYE,02420,ESTREES,,,02291,,,,,,,,,,,,,,,,,,,2009-03-18,F,BUREAU DE POSTE,,,,53.10Z,NAFRev2,O,3.286535,49.967699,0.87,housenumber,1 Rue de l’Abbaye 02420 Estrées,02291_0002_00001,G,1 RUE DE L ABBAYE,
380839415,00011,38083941500011,O,1900-01-01,NN,,,2011-04-28T00:47:00,false,4,,37,,RUE,DE L'INDUSTRIE,02420,ESTREES,,,02291,,,,,,,,,,,,,,,,,,,1992-12-25,F,,,,,45.4M,NAF1993,N,3.291068,49.969646,0.82,street,Rue de l’Industrie 02420 Estrées,02291_0025,G,RUE DE L INDUSTRIE,
382511517,00015,38251151700015,O,1900-01-01,NN,,,2016-03-18T09:43:39,false,3,,22,B,RUE,NATIONALE,02420,ESTREES,,,02291,,,,,,,,,,,,,,,,,,,1991-12-25,F,,,,,64.11,NAP,N,,,0,,,,,,
383423761,00014,38342376100014,O,1991-10-03,01,2020,4520AA,2022-08-29T09:10:28,true,4,,66,,RTE,NATIONALE,02420,ESTREES,,,02291,,,,,,,,,,,,,,,,,,,2008-01-01,A,,,,,45.11Z,NAFRev2,O,1.2279812,49.230352,0.77,poi,Route Nationale (Pont) Saint-Pierre-du-Vauvray,https://osm.org/way/95838375,G,,
384235917,00018,38423591700018,O,1991-06-26,NN,,,,false,3,,84,,RTE,NATIONALE,02420,ESTREES,,,02291,,,,,,,,,,,,,,,,,,,1993-06-01,F,,,,,85.1G,NAF1993,N,1.2279812,49.230352,0.77,poi,Route Nationale (Pont) Saint-Pierre-du-Vauvray,https://osm.org/way/95838375,G,,
385139928,00027,38513992800027,O,1997-08-20,,,,,true,1,,37,,RUE,DE LA CHAUSSEE BRUNEHAUT,02420,ESTREES,,,02291,,,,,,,,,,,,,,,,,,,1998-09-28,F,,,,,52.1B,NAF1993,N,3.287534,49.96742,0.95,housenumber,37 Rue de la Chaussee Brunehaut 02420 Estrées,02291_0010_00037,G,37 RUE DE LA CHAUSSEE BRUNEHAUT,
388753550,00010,38875355000010,O,1992-09-28,NN,,,2014-01-11T12:46:43,true,4,,3,,RUE,DE L ABBAYE,02420,ESTREES,,,02291,,,,,,,,,,,,,,,,,,,2013-12-25,F,,,,,01.11Z,NAFRev2,N,3.286354,49.967807,0.95,housenumber,3 Rue de l’Abbaye 02420 Estrées,02291_0002_00003,G,3 RUE DE L ABBAYE,
390414506,00019,39041450600019,O,1993-01-01,NN,,,2008-01-04T23:39:42,true,3,,84,,RTE,NATIONALE,02420,ESTREES,,,02291,,,,,,,,,,,,,,,,,,,2008-01-01,A,,,,,68.20A,NAFRev2,N,1.2279812,49.230352,0.77,poi,Route Nationale (Pont) Saint-Pierre-du-Vauvray,https://osm.org/way/95838375,G,,
390976835,00020,39097683500020,O,2003-07-02,NN,,,2006-11-25T12:04:45,false,3,,2,,RUE,DE JONCOURT,02420,ESTREES,,,02291,,,,,,,,,,,,,,,,,,,2004-04-28,F,AU RENDEZ VOUS DES CHINEURS,,,,52.5Z,NAFRev1,N,3.287894,49.966926,0.94,housenumber,2 Rue de Joncourt 02420 Estrées,02291_0030_00002,G,2 RUE DE JONCOURT,
391265006,00018,39126500600018,O,1992-12-31,NN,,,2007-03-14T11:50:27,true,3,,52,,RTE,NATIONALE,02420,ESTREES,,,02291,,,,,,,,,,,,,,,,,,,2006-12-31,F,,,,,01.1A,NAFRev1,N,1.2279812,49.230352,0.77,poi,Route Nationale (Pont) Saint-Pierre-du-Vauvray,https://osm.org/way/95838375,G,,
392551628,00028,39255162800028,O,2001-01-01,NN,,,,true,4,,73,,RUE,LA CHAUSSEE BRUNEHAUT,02420,ESTREES,,,02291,,,,,,,,,,,,,,,,,,,2003-03-07,F,,,,,51.4J,NAFRev1,N,3.29048,49.969119,0.95,housenumber,73 Rue de la Chaussee Brunehaut 02420 Estrées,02291_0010_00073,G,73 RUE DE LA CHAUSSEE BRUNEHAUT,
393657002,00019,39365700200019,O,1961-10-18,NN,,,2007-01-18T09:35:05,true,3,,7,,RTE,NATIONALE,02420,ESTREES,,,02291,,,,,,,,,,,,,,,,,,,2002-12-25,F,,,,,01.1A,NAF1993,N,1.2279812,49.230352,0.77,poi,Route Nationale (Pont) Saint-Pierre-du-Vauvray,https://osm.org/way/95838375,G,,
398283465,00019,39828346500019,O,1993-12-22,,,,2008-01-04T18:46:20,true,3,,8,,RUE,DE L'ABBAYE,02420,ESTREES,,,02291,,,,,,,,,,,,,,,,,,,2008-01-01,A,,,,,96.09Z,NAFRev2,N,3.284933,49.967976,0.95,housenumber,8 Rue de l’Abbaye 02420 Estrées,02291_0002_00008,G,8 RUE DE L ABBAYE,
398892802,00024,39889280200024,O,2003-06-01,NN,,,2006-11-25T12:36:46,false,3,,11,,RUE,DE L'ABBAYE,02420,ESTREES,,,02291,,,,,,,,,,,,,,,,,,,2006-02-01,F,,,,,92.3K,NAFRev1,N,3.285636,49.968321,0.95,housenumber,11 Rue de l’Abbaye 02420 Estrées,02291_0002_00011,G,11 RUE DE L ABBAYE,
399034636,00015,39903463600015,O,1994-02-01,NN,,,2012-10-31T04:52:09,true,4,,41,,CHS,BRUNEHAUT,02420,ESTREES,,,02291,,,,,,,,,,,,,,,,,,,2012-04-30,F,,,,,01.11Z,NAFRev2,N,3.28807,49.967747,0.73,housenumber,41 Rue de la Chaussee Brunehaut 02420 Estrées,02291_0010_00041,G,41 RUE DE LA CHAUSSEE BRUNEHAUT,
401360268,00031,40136026800031,O,2003-12-15,,,,2014-07-08T01:31:59,true,3,,7,,RUE,DE L'ABBAYE,02420,ESTREES,,,02291,,,,,,,,,,,,,,,,,,,2008-02-28,F,,,,,93.29Z,NAFRev2,N,3.285769,49.968202,0.95,housenumber,7 Rue de l’Abbaye 02420 Estrées,02291_0002_00007,G,7 RUE DE L ABBAYE,
408657641,00010,40865764100010,O,1996-07-01,02,2020,,2022-08-29T09:26:11,true,3,,7,,RTE,NATIONALE,02420,ESTREES,,,02291,,,,,,,,,,,,,,,,,,,2008-01-01,A,,,,,01.47Z,NAFRev2,N,1.2279812,49.230352,0.77,poi,Route Nationale (Pont) Saint-Pierre-du-Vauvray,https://osm.org/way/95838375,G,,
408869527,00015,40886952700015,O,1996-01-01,NN,,,,true,1,,50,,RUE,NATIONALE,02420,ESTREES,,,02291,,,,,,,,,,,,,,,,,,,2002-01-02,F,,,,,01.1A,NAF1993,N,,,0,,,,,,
423486919,00032,42348691900032,O,2010-02-26,,,,2015-05-05T10:26:15,false,2,,35,,,CHAUSSEE BRUNEHAUT,02420,ESTREES,,,02291,,,,,,,,,,,,,,,,,,,2015-03-31,F,,,,,46.19B,NAFRev2,N,3.287371,49.967324,0.9,housenumber,35 Rue de la Chaussee Brunehaut 02420 Estrées,02291_0010_00035,G,35 RUE DE LA CHAUSSEE BRUNEHAUT,
423704105,00026,42370410500026,O,2009-11-09,,,,2021-02-23T11:45:44,true,1,,102,,CHS,BRUNEHAUT,02420,ESTREES,,,02291,,,,,,,,,,,,,,,,,,,2009-11-09,A,,,,,47.99A,NAFRev2,N,3.294293,49.971152,0.75,housenumber,102 Rue de la Chaussee Brunehaut 02420 Estrées,02291_0010_00102,G,102 RUE DE LA CHAUSSEE BRUNEHAUT,
424866150,00024,42486615000024,O,2010-02-12,,,,2016-02-28T03:55:37,true,2,,68,,RUE,LA CHAUSSEE BRUNEHAUT,02420,ESTREES,,,02291,,,,,,,,,,,,,,,,,,,2016-02-29,F,PLANET PIZZA,,,,56.10C,NAFRev2,N,3.289762,49.968957,0.95,housenumber,68 Rue de la Chaussee Brunehaut 02420 Estrées,02291_0010_00068,G,68 RUE DE LA CHAUSSEE BRUNEHAUT,
430273912,00013,43027391200013,O,2000-03-01,NN,,,2008-02-08T08:38:25,true,3,,5,,RUE,DE L ABBAYE,02420,ESTREES,,,02291,,,,,,,,,,,,,,,,,,,2008-01-01,A,,,,,01.11Z,NAFRev2,N,3.28601,49.968041,0.95,housenumber,5 Rue de l’Abbaye 02420 Estrées,02291_0002_00005,G,5 RUE DE L ABBAYE,
442511176,00053,44251117600053,O,2016-08-15,,,,2017-04-09T18:08:15,false,2,,68,,CHS,BRUNEHAUT,02420,ESTREES,,,02291,,,,,,,,,,,,,,,,,,,2017-04-09,A,,,,,56.10C,NAFRev2,O,3.289762,49.968957,0.73,housenumber,68 Rue de la Chaussee Brunehaut 02420 Estrées,02291_0010_00068,G,68 RUE DE LA CHAUSSEE BRUNEHAUT,
442692422,00011,44269242200011,O,2002-07-01,11,2020,,2022-08-29T09:18:46,true,3,,69,,RUE,LA CHAUSSEE BRUNEHAUT,02420,ESTREES,,,02291,,,,,,,,,,,,,,,,,,,2008-01-01,A,,,,,22.19Z,NAFRev2,O,3.290051,49.968922,0.95,housenumber,69 Rue de la Chaussee Brunehaut 02420 Estrées,02291_0010_00069,G,69 RUE DE LA CHAUSSEE BRUNEHAUT,
444227334,00018,44422733400018,O,2002-11-14,NN,,,2008-01-05T21:19:15,true,3,,69,,CHS,BRUNEHAUT,02420,ESTREES,,,02291,,,,,,,,,,,,,,,,,,,2008-01-01,A,,,,,68.20B,NAFRev2,N,3.290051,49.968922,0.73,housenumber,69 Rue de la Chaussee Brunehaut 02420 Estrées,02291_0010_00069,G,69 RUE DE LA CHAUSSEE BRUNEHAUT,
450721428,00016,45072142800016,O,2003-10-20,NN,,,2008-01-05T02:13:07,true,3,,22,,RUE,DE L ABBAYE,02420,ESTREES,,,02291,,,,,,,,,,,,,,,,,,,2008-01-01,A,,,,,68.20A,NAFRev2,N,3.283582,49.968391,0.95,housenumber,22 Rue de l’Abbaye 02420 Estrées,02291_0002_00022,G,22 RUE DE L ABBAYE,
452136179,00010,45213617900010,O,2004-02-01,NN,,,2020-06-23T03:47:31,true,4,,22,,RUE,DE L'ABBAYE,02420,ESTREES,,,02291,,,,,,,,,,,,,,,,,,,2020-02-13,F,,,,,68.20B,NAFRev2,N,3.283582,49.968391,0.95,housenumber,22 Rue de l’Abbaye 02420 Estrées,02291_0002_00022,G,22 RUE DE L ABBAYE,
483271888,00016,48327188800016,O,2005-01-01,,,,2008-01-05T01:05:23,true,2,,84,,CHS,BRUNEHAUT,02420,ESTREES,,,02291,,,,,,,,,,,,,,,,,,,2008-01-01,A,,,,,01.41Z,NAFRev2,N,3.292238,49.970198,0.73,housenumber,84 Rue de la Chaussee Brunehaut 02420 Estrées,02291_0010_00084,G,84 RUE DE LA CHAUSSEE BRUNEHAUT,
499318822,00016,49931882200016,O,2007-05-07,,,,2012-09-11T10:17:01,false,3,,,,,,02420,ESTREES,,,02291,,,,,,,,,,,,,,,,,,,2012-07-01,F,,,,,86.90D,NAFRev2,N,,,0,,,,,,
502008782,00018,50200878200018,O,2008-01-16,,,,2019-02-21T03:46:45,true,1,,84,,,CHAUSSEE BRUNEHAUT,02420,ESTREES,,,02291,,,,,,,,,,,,,,,,,,,2008-01-16,A,,,,,68.20B,NAFRev2,N,3.292238,49.970198,0.9,housenumber,84 Rue de la Chaussee Brunehaut 02420 Estrées,02291_0010_00084,G,84 RUE DE LA CHAUSSEE BRUNEHAUT,
503701104,00013,50370110400013,O,2008-05-12,,,4520AB,2019-01-11T04:19:30,true,2,,23,,RUE,DE L'ABBAYE,02420,ESTREES,,,02291,,,,,,,,,,,,,,,,,,,2018-12-01,F,GMA,,,,45.20A,NAFRev2,N,3.284412,49.968146,0.95,housenumber,23 Rue de l’Abbaye 02420 Estrées,02291_0002_00023,G,23 RUE DE L ABBAYE,
510576341,00018,51057634100018,O,2009-03-01,,,,2012-11-10T00:31:57,false,3,,43,,RUE,CHAUSSEE BRUNEHAUT,02420,ESTREES,,,02291,,,,,,,,,,,,,,,,,,,2010-04-25,F,,,,,95.11Z,NAFRev2,N,3.28807,49.967747,0.91,housenumber,43 Rue de la Chaussee Brunehaut 02420 Estrées,02291_0010_00043,G,43 RUE DE LA CHAUSSEE BRUNEHAUT,
512014705,00010,51201470500010,O,2009-05-04,NN,,,2011-04-23T17:55:56,true,2,,22,,RUE,DE L'ABBAYE,02420,ESTREES,,,02291,,,,,,,,,,,,,,,,,,,2010-04-30,F,,,,,43.39Z,NAFRev2,O,3.283582,49.968391,0.95,housenumber,22 Rue de l’Abbaye 02420 Estrées,02291_0002_00022,G,22 RUE DE L ABBAYE,
512883737,00011,51288373700011,O,2009-06-08,,,,2010-09-07T13:44:01,true,3,,37,,,CHAUSSEE BRUNEHAUT,02420,ESTREES,,,02291,,,,,,,,,,,,,,,,,,,2010-09-01,A,,,,,64.92Z,NAFRev2,N,3.287534,49.96742,0.9,housenumber,37 Rue de la Chaussee Brunehaut 02420 Estrées,02291_0010_00037,G,37 RUE DE LA CHAUSSEE BRUNEHAUT,
513177808,00021,51317780800021,O,2010-04-12,,,,2022-06-24T14:05:53,false,2,,43,,CHS,BRUNEHAUT,02420,ESTREES,,,02291,,,,,,,,,,,,,,,,,,,2011-01-14,F,,,,,47.81Z,NAFRev2,N,3.28807,49.967747,0.73,housenumber,43 Rue de la Chaussee Brunehaut 02420 Estrées,02291_0010_00043,G,43 RUE DE LA CHAUSSEE BRUNEHAUT,
515359149,00033,51535914900033,O,2019-04-15,,,3831ZA,2021-02-23T15:27:42,true,2,,9,,CHS,BRUNEHAUT,02420,ESTREES,,,02291,,,,,,,,,,,,,,,,,,,2019-05-09,A,,,,,38.31Z,NAFRev2,N,3.285042,49.965952,0.72,housenumber,9 Rue de la Chaussee Brunehaut 02420 Estrées,02291_0010_00009,G,9 RUE DE LA CHAUSSEE BRUNEHAUT,
518665757,00010,51866575700010,O,2009-12-03,,,,2012-11-10T01:33:52,false,2,,78,,CHS,BRUNEHAUT,02420,ESTREES,,,02291,,,,,,,,,,,,,,,,,,,2011-06-28,F,,,,,47.89Z,NAFRev2,N,3.291644,49.969923,0.73,housenumber,78 Rue de la Chaussee Brunehaut 02420 Estrées,02291_0010_00078,G,78 RUE DE LA CHAUSSEE BRUNEHAUT,
521526178,00012,52152617800012,O,2010-01-01,,,,2010-04-06T03:46:40,true,1,,5,,RUE,DE L'ABBAYE,02420,ESTREES,,,02291,,,,,,,,,,,,,,,,,,,2010-01-01,A,,,,,47.99A,NAFRev2,N,3.28601,49.968041,0.95,housenumber,5 Rue de l’Abbaye 02420 Estrées,02291_0002_00005,G,5 RUE DE L ABBAYE,
530560416,00014,53056041600014,O,2011-02-08,01,2020,4332AB,2022-08-29T09:31:31,true,2,,5,,RUE,DE JONCOURT,02420,ESTREES,,,02291,,,,,,,,,,,,,,,,,,,2011-04-29,A,,,,,43.32B,NAFRev2,O,3.28886,49.966374,0.94,housenumber,5 Rue de Joncourt 02420 Estrées,02291_0030_00005,G,5 RUE DE JONCOURT,
531349181,00010,53134918100010,O,2011-04-01,,,,2014-04-25T04:12:22,true,2,,60,,RUE,DE LA CHAUSSEE BRUNEHAUT,02420,ESTREES,,,02291,,,,,,,,,,,,,,,,,,,2013-09-27,F,,,,,01.11Z,NAFRev2,N,3.289102,49.96853,0.95,housenumber,60 Rue de la Chaussee Brunehaut 02420 Estrées,02291_0010_00060,G,60 RUE DE LA CHAUSSEE BRUNEHAUT,
531349207,00013,53134920700013,O,2011-04-01,,,,2018-07-12T03:54:09,true,2,,41,,RUE,DE LA CHAUSSEE BRUNEHAUT,02420,ESTREES,,,02291,,,,,,,,,,,,,,,,,,,2018-05-31,F,,,,,01.11Z,NAFRev2,N,3.28807,49.967747,0.95,housenumber,41 Rue de la Chaussee Brunehaut 02420 Estrées,02291_0010_00041,G,41 RUE DE LA CHAUSSEE BRUNEHAUT,
531349207,00021,53134920700021,O,2011-07-19,,,,2015-01-07T00:10:35,false,2,,41,,,CHAUSSEE BRUNEHAUT,02420,ESTREES,,,02291,,,,,,,,,,,,,,,,,,,2012-12-31,F,,,,,46.21Z,NAFRev2,N,3.28807,49.967747,0.9,housenumber,41 Rue de la Chaussee Brunehaut 02420 Estrées,02291_0010_00041,G,41 RUE DE LA CHAUSSEE BRUNEHAUT,
586270969,00015,58627096900015,O,,NN,,,,true,1,,,,RUE,DE LA GARE,02420,ESTREES,,,02291,,,,,,,,,,,,,,,,,,,1991-06-30,F,,,,,62.11,NAP,N,3.284412,49.968146,0.36,street,Rue de l’Abbaye 02420 Estrées,02291_0002,G,RUE DE L ABBAYE,
586271645,00010,58627164500010,O,,,,,,true,1,,,,RUE,DE L ABBAYE,02420,ESTREES,,,02291,,,,,,,,,,,,,,,,,,,1984-12-25,F,,,,,67.08,NAP,N,3.284412,49.968146,0.95,street,Rue de l’Abbaye 02420 Estrées,02291_0002,G,RUE DE L ABBAYE,
586371940,00014,58637194000014,O,1963-01-01,NN,,,,true,1,,66,,RTE,NATIONALE,02420,ESTREES,,,02291,,,,,,,,,,,,,,,,,,,2002-09-30,F,,,,,70.2C,NAF1993,N,1.2279812,49.230352,0.77,poi,Route Nationale (Pont) Saint-Pierre-du-Vauvray,https://osm.org/way/95838375,G,,
586372039,00014,58637203900014,O,,,,,,true,1,,31,,RUE,DE LA GARE,02420,ESTREES,,,02291,,,,,,,,,,,,,,,,,,,1985-12-25,F,,,,,38.40,NAP,N,3.283751,49.968415,0.43,housenumber,31 Rue de l’Abbaye 02420 Estrées,02291_0002_00031,G,31 RUE DE L ABBAYE,
586580326,00013,58658032600013,O,1900-01-01,,,,,true,2,,,,RUE,DE L INDUSTRIE,02420,ESTREES,,,02291,,,,,,,,,,,,,,,,,,,1984-12-25,F,,,,,31.12,NAP,N,3.291068,49.969646,0.93,street,Rue de l’Industrie 02420 Estrées,02291_0025,G,RUE DE L INDUSTRIE,
586680050,00018,58668005000018,O,,,,,,true,1,,,,RUE,DE L ABBAYE,02420,ESTREES,,,02291,,,,,,,,,,,,,,,,,,,,F,,,,,62.43,NAP,N,3.284412,49.968146,0.95,street,Rue de l’Abbaye 02420 Estrées,02291_0002,G,RUE DE L ABBAYE,
586970253,00017,58697025300017,O,,NN,,,,true,1,,,,RUE,DE L ABBAYE,02420,ESTREES,,,02291,,,,,,,,,,,,,,,,,,,,F,,,,,62.43,NAP,N,3.284412,49.968146,0.95,street,Rue de l’Abbaye 02420 Estrées,02291_0002,G,RUE DE L ABBAYE,
751552902,00015,75155290200015,O,2012-04-20,,,,2019-11-13T04:06:34,true,1,,54,,CHS,BRUNEHAUT,02420,ESTREES,,,02291,,,,,,,,,,,,,,,,,,,2012-04-20,A,,,,,68.20B,NAFRev2,N,3.288557,49.968173,0.73,housenumber,54 Rue de la Chaussee Brunehaut 02420 Estrées,02291_0010_00054,G,54 RUE DE LA CHAUSSEE BRUNEHAUT,
751554015,00022,75155401500022,O,2018-11-09,,,,2019-03-15T03:39:59,true,1,,68,,RUE,LA CHAUSSEE BRUNEHAUT,02420,ESTREES,,,02291,,,,,,,,,,,,,,,,,,,2018-11-09,A,NOUNA REGAL,,,,56.10C,NAFRev2,N,3.289762,49.968957,0.95,housenumber,68 Rue de la Chaussee Brunehaut 02420 Estrées,02291_0010_00068,G,68 RUE DE LA CHAUSSEE BRUNEHAUT,
780180279,00017,78018027900017,O,,NN,,,,true,1,,9,B,RUE,DE L ABBAYE,02420,ESTREES,,,02291,,,,,,,,,,,,,,,,,,,1987-10-21,F,,,,,55.60,NAP,N,3.285703,49.968261,0.95,interpolation,9 Rue de l’Abbaye 02420 Estrées,,G,7 RUE DE L ABBAYE,
780180295,00013,78018029500013,O,1900-01-01,NN,,,2007-10-29T13:40:42,true,3,,,,RUE,DE L INDUSTRIE,02420,ESTREES,,,02291,,,,,,,,,,,,,,,,,,,2007-10-29,F,,,,,92.3F,NAFRev1,N,3.291068,49.969646,0.93,street,Rue de l’Industrie 02420 Estrées,02291_0025,G,RUE DE L INDUSTRIE,
788398386,00011,78839838600011,O,1974-01-01,NN,,,2008-11-08T03:21:55,false,3,,52,,RUE,NATIONALE,02420,ESTREES,,,02291,,,,,,,,,,,,,,,,,,,2006-12-31,F,,,,,45.3C,NAFRev1,N,,,0,,,,,,
788398386,00029,78839838600029,O,2007-01-01,,,,2009-02-02T02:49:21,true,3,,52,,CHS,BRUNEHAUT,02420,ESTREES,,,02291,,,,,,,,,,,,,,,,,,,2008-01-01,F,,,,,01.11Z,NAFRev2,N,3.288319,49.968016,0.73,housenumber,52 Rue de la Chaussee Brunehaut 02420 Estrées,02291_0010_00052,G,52 RUE DE LA CHAUSSEE BRUNEHAUT,
799548201,00018,79954820100018,O,2013-12-06,,,,2021-09-23T08:37:43,true,2,,37,,CHS,BRUNEHAUT,02420,ESTREES,,,02291,,,,,,,,,,,,,,,,,,,2021-09-17,F,,,,,70.22Z,NAFRev2,N,3.287534,49.96742,0.73,housenumber,37 Rue de la Chaussee Brunehaut 02420 Estrées,02291_0010_00037,G,37 RUE DE LA CHAUSSEE BRUNEHAUT,
801348251,00019,80134825100019,O,2013-09-28,,,,2014-03-31T03:27:17,true,1,,60,,RUE,DE LA CHAUSSEE BRUNEHAUT,02420,ESTREES,,,02291,,,,,,,,,,,,,,,,,,,2013-09-28,A,,,,,01.11Z,NAFRev2,N,3.289102,49.96853,0.95,housenumber,60 Rue de la Chaussee Brunehaut 02420 Estrées,02291_0010_00060,G,60 RUE DE LA CHAUSSEE BRUNEHAUT,
805294196,00011,80529419600011,O,2014-07-07,,,,2015-12-28T13:38:18,false,2,,44,,CHS,BRUNEHAUT,02420,ESTREES,,,02291,,,,,,,,,,,,,,,,,,,2015-11-16,F,,,,,86.90D,NAFRev2,N,3.286311,49.966808,0.73,housenumber,44 Rue de la Chaussee Brunehaut 02420 Estrées,02291_0010_00044,G,44 RUE DE LA CHAUSSEE BRUNEHAUT,
805294196,00029,80529419600029,O,2015-11-16,,,,2021-11-03T08:43:50,true,2,,1,B,RUE,D ABBAYE,02420,ESTREES,,,02291,,,,,,,,,,,,,,,,,,,2021-11-30,F,,,,,86.90D,NAFRev2,N,3.28683,49.967497,0.72,housenumber,1bis Rue de l’Abbaye 02420 Estrées,02291_0002_00001_bis,G,1BIS RUE DE L ABBAYE,
811081819,00013,81108181900013,O,2014-06-11,,,,2015-04-27T14:42:07,true,1,,,,,MAIRIE,02420,ESTREES,,,02291,,,,,,,,,,,,,,,,,,,2014-06-11,A,,,,,94.99Z,NAFRev2,N,3.0709671,50.6304695,0.92,poi.townhall,Hôtel de Ville Lille,https://osm.org/way/40917078,G,,