siren,nic,siret,statutDiffusionEtablissement,dateCreationEtablissement,trancheEffectifsEtablissement,anneeEffectifsEtablissement,activitePrincipaleRegistreMetiersEtablissement,dateDernierTraitementEtablissement,etablissementSiege,nombrePeriodesEtablissement,complementAdresseEtablissement,numeroVoieEtablissement,indiceRepetitionEtablissement,typeVoieEtablissement,libelleVoieEtablissement,codePostalEtablissement,libelleCommuneEtablissement,libelleCommuneEtrangerEtablissement,distributionSpecialeEtablissement,codeCommuneEtablissement,codeCedexEtablissement,libelleCedexEtablissement,codePaysEtrangerEtablissement,libellePaysEtrangerEtablissement,complementAdresse2Etablissement,numeroVoie2Etablissement,indiceRepetition2Etablissement,typeVoie2Etablissement,libelleVoie2Etablissement,codePostal2Etablissement,libelleCommune2Etablissement,libelleCommuneEtranger2Etablissement,distributionSpeciale2Etablissement,codeCommune2Etablissement,codeCedex2Etablissement,libelleCedex2Etablissement,codePaysEtranger2Etablissement,libellePaysEtranger2Etablissement,dateDebut,etatAdministratifEtablissement,enseigne1Etablissement,enseigne2Etablissement,enseigne3Etablissement,denominationUsuelleEtablissement,activitePrincipaleEtablissement,nomenclatureActivitePrincipaleEtablissement,caractereEmployeurEtablissement,longitude,latitude,geo_score,geo_type,geo_adresse,geo_id,geo_ligne,geo_l4,geo_l5
200051902,00019,20005190200019,O,2015-05-29,02,2020,,2022-08-29T09:05:11,true,1,MAIRIE D AUBRIVES,,,PL,LOUIS DEBETTE,08320,AUBRIVES,,,08028,,,,,,,,,,,,,,,,,,,2015-05-29,A,,,,,84.11Z,NAFRev2,O,4.762779,50.103132,0.83,street,Place Louis Debette 08320 Aubrives,08028_0022,G,PLACE LOUIS DEBETTE,
210800264,00017,21080026400017,O,1983-03-01,11,2020,,2022-08-29T09:05:49,true,3,,,,PL,LOUIS DEBETTE,08320,AUBRIVES,,,08028,,,,,,,,,,,,,,,,,,,2008-01-01,A,MAIRIE,,,,84.11Z,NAFRev2,O,4.762779,50.103132,0.83,street,Place Louis Debette 08320 Aubrives,08028_0022,G,PLACE LOUIS DEBETTE,
210800264,00025,21080026400025,O,1983-12-21,03,2020,,2022-08-29T09:05:49,false,3,,,,PL,LOUIS DEBETTE,08320,AUBRIVES,,,08028,,,,,,,,,,,,,,,,,,,2008-01-01,A,ECOLE PRIMAIRE PUBLIQUE,,,,85.20Z,NAFRev2,N,4.762779,50.103132,0.83,street,Place Louis Debette 08320 Aubrives,08028_0022,G,PLACE LOUIS DEBETTE,
210800264,00033,21080026400033,O,1983-12-21,01,2019,,2021-10-27T08:06:34,false,3,,,,RUE,DU GENERAL SARRAIL,08320,AUBRIVES,,,08028,,,,,,,,,,,,,,,,,,,2008-01-01,A,ECOLE MATERNELLE PUBLIQUE J LAMBEAU,,,,85.10Z,NAFRev2,N,4.763639,50.105934,0.95,street,Rue du Général Sarrail 08320 Aubrives,08028_0031,G,RUE DU GENERAL SARRAIL,
210800264,00041,21080026400041,O,1994-01-01,NN,,,2021-09-23T09:45:12,false,4,MAIRIE,60,,RUE,DU GENERAL SARRAIL,08320,AUBRIVES,,,08028,,,,,,,,,,,,,,,,,,,2020-01-01,F,SERVICE D'ASSAINISSEMENT,,,,37.00Z,NAFRev2,N,4.766025,50.108472,0.95,housenumber,60 Rue du Général Sarrail 08320 Aubrives,08028_0031_00060,G,60 RUE DU GENERAL SARRAIL,
210800264,00058,21080026400058,O,2001-01-01,NN,,,2008-01-04T18:24:42,false,3,MAIRIE,60,,RUE,DU GENERAL SARRAIL,08320,AUBRIVES,,,08028,,,,,,,,,,,,,,,,,,,2008-01-01,A,LOCATION D'IMMEUBLE,,,,68.20B,NAFRev2,N,4.766025,50.108472,0.95,housenumber,60 Rue du Général Sarrail 08320 Aubrives,08028_0031_00060,G,60 RUE DU GENERAL SARRAIL,
250800950,00017,25080095000017,O,1983-03-01,NN,,,2020-10-14T03:57:42,true,4,MAIRIE,60,,RUE,DU GENERAL SARRAIL,08320,AUBRIVES,,,08028,,,,,,,,,,,,,,,,,,,2020-10-09,F,,,,,36.00Z,NAFRev2,N,4.766025,50.108472,0.95,housenumber,60 Rue du Général Sarrail 08320 Aubrives,08028_0031_00060,G,60 RUE DU GENERAL SARRAIL,
250802014,00028,25080201400028,O,1995-11-01,,,,2011-04-23T04:19:07,false,4,MAIRIE,60,,RUE,DU GENERAL SARRAIL,08320,AUBRIVES,,,08028,,,,,,,,,,,,,,,,,,,2008-11-26,F,,,,,84.12Z,NAFRev2,O,4.766025,50.108472,0.95,housenumber,60 Rue du Général Sarrail 08320 Aubrives,08028_0031_00060,G,60 RUE DU GENERAL SARRAIL,
260800248,00015,26080024800015,O,1983-03-01,NN,,,2010-06-26T03:03:42,true,3,MAIRIE,60,,RUE,DU GENERAL SARRAIL,08320,AUBRIVES,,,08028,,,,,,,,,,,,,,,,,,,2008-01-01,A,CCAS,,,,88.99B,NAFRev2,N,4.766025,50.108472,0.95,housenumber,60 Rue du Général Sarrail 08320 Aubrives,08028_0031_00060,G,60 RUE DU GENERAL SARRAIL,
301719209,00019,30171920900019,O,,,,,,true,1,,,,,,08320,AUBRIVES,,,08028,,,,,,,,,,,,,,,,,,,1985-09-22,F,,,,,01.50,NAP,N,,,0,,,,,,
302751920,00018,30275192000018,O,,,,,,true,1,,,,,,08320,AUBRIVES,,,08028,,,,,,,,,,,,,,,,,,,1985-12-25,F,,,,,02.20,NAP,N,,,0,,,,,,
303265573,00012,30326557300012,O,1963-01-01,NN,,,2008-11-07T00:18:50,true,3,,9,,RUE,DU MARECHAL FOCH,08320,AUBRIVES,,,08028,,,,,,,,,,,,,,,,,,,2006-12-31,F,,,,,93.0D,NAFRev1,N,4.763412,50.102344,0.95,housenumber,9 Rue du Marechal Foch 08320 Aubrives,08028_a46f3i_00009,G,9 RUE DU MARECHAL FOCH,
304398563,00011,30439856300011,O,1976-01-01,22,2020,,2022-08-29T09:11:59,true,4,,,,RUE,DU GENERAL SARRAIL,08320,AUBRIVES,,,08028,,,,,,,,,,,,,,,,,,,2008-01-01,A,,,,,24.52Z,NAFRev2,O,4.763639,50.105934,0.95,street,Rue du Général Sarrail 08320 Aubrives,08028_0031,G,RUE DU GENERAL SARRAIL,
310594833,00017,31059483300017,O,,NN,,,,true,1,,,,RUE,DE LA BRASSERIE,08320,AUBRIVES,,,08028,,,,,,,,,,,,,,,,,,,1990-12-15,F,,,,,65.06,NAP,N,4.764096,50.100955,0.94,street,Rue de la Brasserie 08320 Aubrives,08028_0012,G,RUE DE LA BRASSERIE,
311590525,00011,31159052500011,O,,,,,,true,1,,,,RUE,VOTION,08320,AUBRIVES,,,08028,,,,,,,,,,,,,,,,,,,1985-12-25,F,,,,,86.07,NAP,N,4.763733,50.100207,0.85,street,Rue Constant Votion 08320 Aubrives,08028_0020,G,RUE CONSTANT VOTION,
311869408,00014,31186940800014,O,,NN,,,,true,1,,10,,RUE,PAUL VIENOT,08320,AUBRIVES,,,08028,,,,,,,,,,,,,,,,,,,1995-06-10,F,,,,,81.21,NAP,N,4.761618,50.103551,0.71,housenumber,10 Rue Pierre Viénot 08320 Aubrives,08028_0078_00010,G,10 RUE PIERRE VIENOT,
313273237,00039,31327323700039,O,2002-11-15,NN,,,2006-11-25T09:31:58,true,3,,3,,IMP,LALO,08320,AUBRIVES,,,08028,,,,,,,,,,,,,,,,,,,2005-12-31,F,,,,,52.6E,NAFRev1,N,4.751558,50.105072,0.76,housenumber,3 Impasse Edouard Lalo 08320 Aubrives,08028_0024_00003,G,3 IMPASSE EDOUARD LALO,
314011289,00019,31401128900019,O,,NN,,,,true,1,,,,PL,DE LA MAIRIE,08320,AUBRIVES,,,08028,,,,,,,,,,,,,,,,,,,,F,,,,,67.08,NAP,N,4.761841,50.103052,0.82,street,Place de la Mairie 08320 Aubrives,08028_0054,G,PLACE DE LA MAIRIE,
315045104,00025,31504510400025,O,,,,,,true,1,,,,PL,DE LA MAIRIE,08320,AUBRIVES,,,08028,,,,,,,,,,,,,,,,,,,1991-12-31,F,,,,,67.08,NAP,N,4.761841,50.103052,0.82,street,Place de la Mairie 08320 Aubrives,08028_0054,G,PLACE DE LA MAIRIE,
318471638,00045,31847163800045,O,1997-03-17,NN,,,2008-11-07T00:34:10,false,4,,6,,RUE,PIERRE VIENOT,08320,AUBRIVES,,,08028,,,,,,,,,,,,,,,,,,,2001-12-31,F,,,,,15.8C,NAF1993,O,4.762081,50.103401,0.95,housenumber,6 Rue Pierre Viénot 08320 Aubrives,08028_0078_00006,G,6 RUE PIERRE VIENOT,
322099458,00026,32209945800026,O,,,,,,true,1,,,,,CHALET N 14,08320,AUBRIVES,,,08028,,,,,,,,,,,,,,,,,,,1987-03-31,F,,,,,59.08,NAP,N,,,0,,,,,,
322359910,00039,32235991000039,O,2003-02-18,NN,,,2017-08-09T07:46:23,true,6,,35,B,RTE,DE HIERGES,08320,AUBRIVES,,,08028,,,,,,,,,,,,,,,,,,,2017-09-01,A,,,,AG PRODUCTIONS,93.29Z,NAFRev2,N,4.754109,50.10363,0.76,housenumber,35bis Route de Hierges 08320 Aubrives,08028_0037_00035_bis,G,35BIS ROUTE DE HIERGES,
324022094,00027,32402209400027,O,1988-05-01,NN,,,2019-11-18T19:49:21,true,4,,3,,RTE,DE HIERGES,08320,AUBRIVES,,,08028,,,,,,,,,,,,,,,,,,,2019-12-31,F,,,,,86.21Z,NAFRev2,N,4.761626,50.102891,0.84,housenumber,3 Route de Hierges 08320 Aubrives,08028_0037_00003,G,3 ROUTE DE HIERGES,
324806181,00016,32480618100016,O,,NN,,,,true,1,,,,RUE,DU GENERAL SARRAIL,08320,AUBRIVES,,,08028,,,,,,,,,,,,,,,,,,,,F,,,,,64.11,NAP,N,4.763639,50.105934,0.95,street,Rue du Général Sarrail 08320 Aubrives,08028_0031,G,RUE DU GENERAL SARRAIL,
326243672,00010,32624367200010,O,1982-12-29,NN,,,2008-01-04T19:15:03,true,4,,,,,CENSE LAHAYE,08320,AUBRIVES,,,08028,,,,,,,,,,,,,,,,,,,2008-01-01,A,,,,,01.50Z,NAFRev2,N,4.752568,50.12016,0.8,street,Cense la Haye 08320 Aubrives,08028_h5e8m6,G,CENSE LA HAYE,
326518511,00018,32651851100018,O,1981-06-01,NN,,,2017-05-04T03:48:13,false,4,,,,,,08320,AUBRIVES,,,08028,,,,,,,,,,,,,,,,,,,2015-08-26,F,,,,,02.40Z,NAFRev2,N,,,0,,,,,,
328153531,00046,32815353100046,O,1900-01-01,NN,,,2021-10-20T03:42:35,false,4,,,,,CARRIERE,08320,AUBRIVES,,,08028,,,,,,,,,,,,,,,,,,,2015-04-22,F,,,,,08.12Z,NAFRev2,N,7.3718773,43.7957934,0.71,poi.quarry,(Carrière) Blausasc,https://osm.org/way/41751925,G,,
331504571,00034,33150457100034,O,2016-09-15,,,9523ZZ,2020-01-31T19:33:34,true,2,,17,,RUE,PIERRE VIENOT,08320,AUBRIVES,,,08028,,,,,,,,,,,,,,,,,,,2019-12-31,F,,,,CORDONNERIE DE LA POINTE,95.23Z,NAFRev2,N,4.761265,50.103645,0.95,housenumber,17 Rue Pierre Viénot 08320 Aubrives,08028_0078_00017,G,17 RUE PIERRE VIENOT,
332831510,00034,33283151000034,O,2018-09-01,,,,2020-08-27T03:44:08,true,2,DOMAINE DE THYRISSART,,,,,08320,AUBRIVES,,,08028,,,,,,,,,,,,,,,,,,,2020-06-30,F,,,,,93.19Z,NAFRev2,O,,,0,,,,,,
333024461,00019,33302446100019,O,,NN,,,,true,1,,,,RUE,DU GENERAL SARRAIL,08320,AUBRIVES,,,08028,,,,,,,,,,,,,,,,,,,1991-09-30,F,,,,,02.20,NAP,N,4.763639,50.105934,0.95,street,Rue du Général Sarrail 08320 Aubrives,08028_0031,G,RUE DU GENERAL SARRAIL,
333662187,00017,33366218700017,O,,NN,,,,true,1,,,,RUE,DES TERRES ROUGES,08320,AUBRIVES,,,08028,,,,,,,,,,,,,,,,,,,,F,,,,,02.20,NAP,N,4.764699,50.112242,0.95,street,Rue des Terres Rouges 08320 Aubrives,08028_0111,G,RUE DES TERRES ROUGES,
334229531,00010,33422953100010,O,,NN,,,,true,1,,,,,R N 51,08320,AUBRIVES,,,08028,,,,,,,,,,,,,,,,,,,1995-12-31,F,,,,,55.1A,NAF1993,N,,,0,,,,,,
339652935,00018,33965293500018,O,,NN,,,,true,1,,,,RUE,DU GENERAIL SARRAIL,08320,AUBRIVES,,,08028,,,,,,,,,,,,,,,,,,,1988-03-01,F,,,,,21.08,NAP,N,4.763639,50.105934,0.95,street,Rue du Général Sarrail 08320 Aubrives,08028_0031,G,RUE DU GENERAL SARRAIL,
340273093,00021,34027309300021,O,1988-12-17,NN,,,2009-06-27T05:21:50,true,5,,6,,RUE,DES ORFEVRES,08320,AUBRIVES,,,08028,,,,,,,,,,,,,,,,,,,2008-03-31,F,,,,,43.91B,NAFRev2,O,4.764084,50.102382,0.94,housenumber,6 Rue des Orfèvres 08320 Aubrives,08028_0077_00006,G,6 RUE DES ORFEVRES,
341193472,00014,34119347200014,O,,NN,,,,true,1,,,,RTE,DE HIERGES,08320,AUBRIVES,,,08028,,,,,,,,,,,,,,,,,,,1989-09-30,F,,,,,64.24,NAP,N,4.755731,50.103508,0.83,street,Route de Hierges 08320 Aubrives,08028_0037,G,ROUTE DE HIERGES,
342601911,00023,34260191100023,O,,,,,,true,1,,,,PL,LOUIS DEBETTE,08320,AUBRIVES,,,08028,,,,,,,,,,,,,,,,,,,1994-05-25,F,,,,,52.2C,NAF1993,N,4.762779,50.103132,0.83,street,Place Louis Debette 08320 Aubrives,08028_0022,G,PLACE LOUIS DEBETTE,
345171334,00021,34517133400021,O,2010-02-01,,,,2012-11-09T00:38:32,true,2,,22,,RUE,DU MARECHAL FOCH,08320,AUBRIVES,,,08028,,,,,,,,,,,,,,,,,,,2012-01-16,F,,,,,81.30Z,NAFRev2,N,4.76306,50.10154,0.95,housenumber,22 Rue du Marechal Foch 08320 Aubrives,08028_a46f3i_00022,G,22 RUE DU MARECHAL FOCH,
349582759,00024,34958275900024,O,2000-01-10,NN,,,2008-01-04T23:06:17,true,3,,,,RUE,DU GENERAL SARRAIL,08320,AUBRIVES,,,08028,,,,,,,,,,,,,,,,,,,2007-10-11,F,,,,,55.3B,NAFRev1,N,4.763639,50.105934,0.95,street,Rue du Général Sarrail 08320 Aubrives,08028_0031,G,RUE DU GENERAL SARRAIL,
353039381,00010,35303938100010,O,,NN,,,,true,1,,20,,RUE,DU MARECHAL FOCH,08320,AUBRIVES,,,08028,,,,,,,,,,,,,,,,,,,1992-03-02,F,,,,,93.0D,NAF1993,N,4.763093,50.101594,0.95,housenumber,20 Rue du Marechal Foch 08320 Aubrives,08028_a46f3i_00020,G,20 RUE DU MARECHAL FOCH,
353461783,00014,35346178300014,O,1990-02-08,NN,,,,true,3,,,,,,08320,AUBRIVES,,,08028,,,,,,,,,,,,,,,,,,,1998-12-25,F,,,,,02.0B,NAF1993,N,,,0,,,,,,
356000216,03069,35600021603069,O,1991-01-01,NN,,,2006-11-25T11:18:53,false,3,,9,,RUE,GENERAL SARRAIL,08320,AUBRIVES,,,08028,,,,,,,,,,,,,,,,,,,2006-11-02,F,BUREAU DE POSTE,,,,64.1A,NAFRev1,O,4.76267,50.103825,0.91,housenumber,9 Rue du Général Sarrail 08320 Aubrives,08028_0031_00009,G,9 RUE DU GENERAL SARRAIL,
379041056,00027,37904105600027,O,1994-10-01,NN,,,2006-10-28T00:25:04,true,5,,,,RTE,N 51,08320,AUBRIVES,,,08028,,,,,,,,,,,,,,,,,,,2004-06-15,F,,,,,51.8M,NAFRev1,O,,,0,,,,,,
381374263,00022,38137426300022,O,2009-12-01,,,,2013-05-15T03:40:16,false,2,,22,,RUE,PIERRE VIENOT,08320,AUBRIVES,,,08028,,,,,,,,,,,,,,,,,,,2013-05-31,F,,,,,86.90E,NAFRev2,N,4.761232,50.103821,0.83,street,Rue Pierre Viénot 08320 Aubrives,08028_0078,G,RUE PIERRE VIENOT,
382540367,00010,38254036700010,O,1991-06-26,NN,,,2008-01-04T22:11:28,true,3,,,,,MAIRIE D AUBRIVE,08320,AUBRIVES,,,08028,,,,,,,,,,,,,,,,,,,2008-01-01,A,,,,,93.12Z,NAFRev2,N,4.761841,50.103052,0.76,street,Place de la Mairie 08320 Aubrives,08028_0054,G,PLACE DE LA MAIRIE,
382540433,00010,38254043300010,O,1991-01-01,NN,,,2018-09-14T10:04:16,true,5,MR EDOUARD FRANZETTI,,,,MAIRIE,08320,AUBRIVES,,,08028,,,,,,,,,,,,,,,,,,,2008-01-01,A,,,,,93.12Z,NAFRev2,N,4.761841,50.103052,0.91,street,Place de la Mairie 08320 Aubrives,08028_0054,G,PLACE DE LA MAIRIE,
382783751,00011,38278375100011,O,1991-08-19,NN,,,2006-11-25T11:38:53,false,4,,,,,MAIRIE,08320,AUBRIVES,,,08028,,,,,,,,,,,,,,,,,,,1993-12-25,F,,,,,92.6C,NAF1993,N,4.761841,50.103052,0.91,street,Place de la Mairie 08320 Aubrives,08028_0054,G,PLACE DE LA MAIRIE,
382783751,00029,38278375100029,O,1993-12-15,NN,,,2006-11-25T11:38:53,false,4,,12,,RUE,DE VILLERUPT,08320,AUBRIVES,,,08028,,,,,,,,,,,,,,,,,,,1999-03-15,F,,,,,92.6C,NAF1993,O,4.765116,50.105911,0.95,housenumber,12 Rue de Villerupt 08320 Aubrives,08028_0120_00012,G,12 RUE DE VILLERUPT,
382783751,00037,38278375100037,O,1999-03-15,00,2020,,2022-08-29T09:09:51,true,4,MAIRIE,,,PL,LOUIS DEBETTE,08320,AUBRIVES,,,08028,,,,,,,,,,,,,,,,,,,2020-10-21,A,,,,,93.12Z,NAFRev2,N,4.762779,50.103132,0.83,street,Place Louis Debette 08320 Aubrives,08028_0022,G,PLACE LOUIS DEBETTE,
383912425,00014,38391242500014,O,,NN,,,,true,1,,,,PL,DE LA MAIRIE,08320,AUBRIVES,,,08028,,,,,,,,,,,,,,,,,,,1996-06-30,F,,,,,55.1A,NAF1993,O,4.761841,50.103052,0.82,street,Place de la Mairie 08320 Aubrives,08028_0054,G,PLACE DE LA MAIRIE,
392420360,00019,39242036000019,O,,NN,,,,true,1,,16,,RUE,DU GENERAL SARRAIL,08320,AUBRIVES,,,08028,,,,,,,,,,,,,,,,,,,1994-10-06,F,,,,,52.1B,NAF1993,N,4.762905,50.104095,0.95,housenumber,16 Rue du Général Sarrail 08320 Aubrives,08028_0031_00016,G,16 RUE DU GENERAL SARRAIL,
392606471,00010,39260647100010,O,1993-09-02,NN,,,2018-05-17T03:44:04,true,4,,48,,RUE,DU GENRAL SARRAIL,08320,AUBRIVES,,,08028,,,,,,,,,,,,,,,,,,,2017-10-24,F,,,,,68.20B,NAFRev2,N,4.765011,50.107846,0.88,housenumber,48 Rue du Général Sarrail 08320 Aubrives,08028_0031_00048,G,48 RUE DU GENERAL SARRAIL,
395181449,00020,39518144900020,O,1995-01-01,NN,,,,false,4,,3,,IMP,GABRIEL FAURE,08320,AUBRIVES,,,08028,,,,,,,,,,,,,,,,,,,1998-07-01,F,,,,,92.3A,NAF1993,N,4.754312,50.105658,0.85,housenumber,3 Impasse Gabriel Faure 08320 Aubrives,08028_0llsmj_00003,G,3 IMPASSE GABRIEL FAURE,
395344856,00012,39534485600012,O,1993-09-02,NN,,,2015-03-13T11:00:18,true,8,,48,,RUE,GAL SARRAIL,08320,AUBRIVES,,,08028,,,,,,,,,,,,,,,,,,,2008-01-01,F,,,,,55.20Z,NAFRev2,O,4.765011,50.107846,0.81,housenumber,48 Rue du Général Sarrail 08320 Aubrives,08028_0031_00048,G,48 RUE DU GENERAL SARRAIL,
397537945,00016,39753794500016,O,,NN,,,,true,1,,16,,IMP,RAVEL,08320,AUBRIVES,,,08028,,,,,,,,,,,,,,,,,,,1997-09-30,F,,,,,52.6D,NAF1993,N,4.75387,50.104173,0.79,housenumber,16 Impasse Maurice Ravel 08320 Aubrives,08028_0061_00016,G,16 IMPASSE MAURICE RAVEL,
398453472,00019,39845347200019,O,1994-10-01,NN,,,,true,1,,5,,RUE,JEAN-CLAUDE DEVOUGE,08320,AUBRIVES,,,08028,,,,,,,,,,,,,,,,,,,1999-09-30,F,,,,,74.1E,NAF1993,N,4.760559,50.103903,0.95,housenumber,5 Rue Jean-Claude Devouge 08320 Aubrives,08028_0045_00005,G,5 RUE JEAN CLAUDE DEVOUGE,
398515767,00018,39851576700018,O,1994-10-03,NN,,,2016-04-13T03:52:40,true,6,,63,,RUE,DU GENRAL SARRAIL,08320,AUBRIVES,,,08028,,,,,,,,,,,,,,,,,,,2016-03-29,F,,,,,45.32Z,NAFRev2,N,4.764484,50.107604,0.88,housenumber,63 Rue du Général Sarrail 08320 Aubrives,08028_0031_00063,G,63 RUE DU GENERAL SARRAIL,
399500719,00014,39950071900014,O,1995-01-10,NN,,,2008-01-05T20:14:30,true,3,,8,,RUE,FRANCIS POULENC,08320,AUBRIVES,,,08028,,,,,,,,,,,,,,,,,,,2008-01-01,A,,,,,68.20B,NAFRev2,N,4.751786,50.104665,0.95,housenumber,8 Rue Francis Poulenc 08320 Aubrives,08028_0028_00008,G,8 RUE FRANCIS POULENC,
400121125,00019,40012112500019,O,,NN,,,,true,1,,16,,RUE,DU GENERAL SARRRAIL,08320,AUBRIVES,,,08028,,,,,,,,,,,,,,,,,,,1995-09-14,F,,,,,52.1B,NAF1993,N,4.762905,50.104095,0.92,housenumber,16 Rue du Général Sarrail 08320 Aubrives,08028_0031_00016,G,16 RUE DU GENERAL SARRAIL,
400496865,00033,40049686500033,O,2001-09-01,NN,,,2006-11-25T13:48:54,false,3,,3,,RUE,JEAN CLAUDE DEVOUGE,08320,AUBRIVES,,,08028,,,,,,,,,,,,,,,,,,,2005-10-31,F,,,,,60.2L,NAFRev1,N,4.76079,50.104056,0.95,housenumber,3 Rue Jean-Claude Devouge 08320 Aubrives,08028_0045_00003,G,3 RUE JEAN CLAUDE DEVOUGE,
401440599,00017,40144059900017,O,1995-06-21,NN,,,2021-03-19T19:32:44,false,5,,9,,RUE,PIERRE VIENOT,08320,AUBRIVES,,,08028,,,,,,,,,,,,,,,,,,,2008-01-01,F,,,,,96.02A,NAFRev2,N,4.761652,50.103442,0.95,housenumber,9 Rue Pierre Viénot 08320 Aubrives,08028_0078_00009,G,9 RUE PIERRE VIENOT,
401440599,00025,40144059900025,O,1998-09-01,NN,,,2008-11-08T01:11:20,false,4,,10,,RUE,PIERRE VIENOT,08320,AUBRIVES,,,08028,,,,,,,,,,,,,,,,,,,2003-02-16,F,,,,,93.0D,NAFRev1,N,4.761618,50.103551,0.95,housenumber,10 Rue Pierre Viénot 08320 Aubrives,08028_0078_00010,G,10 RUE PIERRE VIENOT,
401440599,00033,40144059900033,O,2006-03-01,,,,2021-03-19T19:32:44,true,3,,3,,RUE,DE LA CANTINE,08320,AUBRIVES,,,08028,,,,,,,,,,,,,,,,,,,2021-01-01,F,,,,,96.02A,NAFRev2,N,4.763487,50.10296,0.94,housenumber,3 Rue de la Cantine 08320 Aubrives,08028_0014_00003,G,3 RUE DE LA CANTINE,
402624787,00014,40262478700014,O,1995-09-15,NN,,,2008-04-26T13:19:59,false,4,MAIRIE,,,PL,LOUIS DEBETTE,08320,AUBRIVES,,,08028,,,,,,,,,,,,,,,,,,,2007-01-01,F,,,,,52.1B,NAFRev1,O,4.762779,50.103132,0.83,street,Place Louis Debette 08320 Aubrives,08028_0022,G,PLACE LOUIS DEBETTE,
402624787,00022,40262478700022,O,2007-01-01,NN,,,2019-06-24T13:25:11,true,3,MAIRIE D AUBRIVES,16,,PL,DE L EGLISE,08320,AUBRIVES,,,08028,,,,,,,,,,,,,,,,,,,2018-01-31,A,,,,,47.11B,NAFRev2,N,4.763516,50.101184,0.85,housenumber,16 Place de l’Eglise 08320 Aubrives,08028_0025_00016,G,16 PLACE DE L EGLISE,
402904536,00024,40290453600024,O,2010-05-01,,,,2017-06-27T10:58:39,false,3,IMPERATRICE EUGENIE,,,,RN 51,08320,AUBRIVES,,,08028,,,,,,,,,,,,,,,,,,,2014-12-31,F,,,,,55.10Z,NAFRev2,N,,,0,,,,,,
403267693,00014,40326769300014,O,1995-12-27,NN,,,,true,1,,,,RTE,N 51,08320,AUBRIVES,,,08028,,,,,,,,,,,,,,,,,,,1999-10-29,F,,,,,55.1A,NAF1993,O,,,0,,,,,,
403512866,00019,40351286600019,O,1996-02-01,NN,,,2008-01-05T20:20:05,true,3,,,,RTE,N 51,08320,AUBRIVES,,,08028,,,,,,,,,,,,,,,,,,,2008-01-01,A,,,,,68.20B,NAFRev2,N,,,0,,,,,,
407932516,00013,40793251600013,O,1996-07-01,NN,,,2009-06-27T08:10:05,true,4,,,,PL,DEBETTE,08320,AUBRIVES,,,08028,,,,,,,,,,,,,,,,,,,2007-08-09,F,,,,,55.1A,NAFRev1,N,4.762779,50.103132,0.76,street,Place Louis Debette 08320 Aubrives,08028_0022,G,PLACE LOUIS DEBETTE,
408024966,00017,40802496600017,O,1996-07-13,NN,,,,true,1,,,,RUE,DU GENERAL SARRAIL,08320,AUBRIVES,,,08028,,,,,,,,,,,,,,,,,,,1998-12-31,F,,,,,55.4A,NAF1993,O,4.763639,50.105934,0.95,street,Rue du Général Sarrail 08320 Aubrives,08028_0031,G,RUE DU GENERAL SARRAIL,
408566578,00014,40856657800014,O,1996-06-25,NN,,,2018-11-22T04:23:22,false,4,,,,RLE,RLE WASLET,08320,AUBRIVES,,,08028,,,,,,,,,,,,,,,,,,,2018-09-15,F,,,,,68.20B,NAFRev2,N,4.765017,50.101637,0.7,street,Ruelle Waslet 08320 Aubrives,08028_0125,G,RUELLE WASLET,
409027703,00019,40902770300019,O,1996-09-24,NN,,,2011-10-17T14:55:21,true,4,,33,,RUE,JEAN-CLAUDE DEVOUGE,08320,AUBRIVES,,,08028,,,,,,,,,,,,,,,,,,,2010-12-25,F,,,,,63.91Z,NAFRev2,N,4.759921,50.104531,0.95,housenumber,33 Rue Jean-Claude Devouge 08320 Aubrives,08028_0045_00033,G,33 RUE JEAN CLAUDE DEVOUGE,
411186703,00046,41118670300046,O,2016-06-05,,,4334ZC,2020-10-05T10:00:21,true,3,,12,,RUE,NEUVE,08320,AUBRIVES,,,08028,,,,,,,,,,,,,,,,,,,2020-03-01,A,,,,,43.34Z,NAFRev2,N,4.765104,50.105453,0.95,housenumber,12 Rue Neuve 08320 Aubrives,08028_0070_00012,G,12 RUE NEUVE,
411402811,00011,41140281100011,O,1997-04-02,NN,,,2019-06-24T13:29:33,false,4,,,,PL,DE LA MAIRIE,08320,AUBRIVES,,,08028,,,,,,,,,,,,,,,,,,,2017-08-16,F,,,,,47.24Z,NAFRev2,O,4.761841,50.103052,0.82,street,Place de la Mairie 08320 Aubrives,08028_0054,G,PLACE DE LA MAIRIE,
411402811,00029,41140281100029,O,2017-08-16,02,2020,,2022-08-29T09:28:18,true,2,,2,,PL,LOUIS DEBETTE,08320,AUBRIVES,,,08028,,,,,,,,,,,,,,,,,,,2020-09-04,A,AU PAIN GOURMAND,,,,56.10A,NAFRev2,O,4.762779,50.103132,0.85,housenumber,2 Place Louis Debette 08320 Aubrives,08028_0022_00002,G,2 PLACE LOUIS DEBETTE,
413086232,00019,41308623200019,O,1997-07-19,,,,,true,1,,15,,RUE,DES CHALETS,08320,AUBRIVES,,,08028,,,,,,,,,,,,,,,,,,,2000-10-30,F,,,,,52.2G,NAF1993,N,4.765138,50.112853,0.95,housenumber,15 Rue des Chalets 08320 Aubrives,08028_0015_00015,G,15 RUE DES CHALETS,
414084681,00025,41408468100025,O,2001-04-24,NN,,,2014-02-13T08:32:22,true,4,,2,,RUE,DES ORFEVRES,08320,AUBRIVES,,,08028,,,,,,,,,,,,,,,,,,,2014-01-01,F,,,,,90.03B,NAFRev2,N,4.764,50.102049,0.94,housenumber,2 Rue des Orfèvres 08320 Aubrives,08028_0077_00002,G,2 RUE DES ORFEVRES,
414916213,00021,41491621300021,O,2003-02-01,NN,,,2014-07-08T01:49:26,true,3,RN51,25,,,PIERRE ANDRE VIENOT,08320,AUBRIVES,,,08028,,,,,,,,,,,,,,,,,,,2008-01-01,A,,,,,43.21A,NAFRev2,N,4.759565,50.106782,0.65,housenumber,25 Rue Pierre Viénot 08320 Aubrives,08028_0078_00025,G,25 RUE PIERRE VIENOT,
414977264,00012,41497726400012,O,1998-01-05,NN,,,2014-07-08T01:49:33,false,4,,15,,RTE,DE HIERGES,08320,AUBRIVES,,,08028,,,,,,,,,,,,,,,,,,,2011-11-24,F,,,,,43.21A,NAFRev2,O,4.7593,50.102888,0.85,housenumber,15 Route de Hierges 08320 Aubrives,08028_0037_00015,G,15 ROUTE DE HIERGES,
418220588,00010,41822058800010,O,1998-03-16,NN,,,2010-04-18T07:51:50,false,4,,4,,RUE,DU MOULIN,08320,AUBRIVES,,,08028,,,,,,,,,,,,,,,,,,,2008-10-01,F,,,,,49.41B,NAFRev2,O,4.764271,50.101207,0.94,housenumber,4 Rue du Moulin 08320 Aubrives,08028_0064_00004,G,4 RUE DU MOULIN,
419666573,00011,41966657300011,O,1998-07-20,NN,,,2008-11-08T01:36:09,true,3,,21,,RUE,PIERRE VIENOT,08320,AUBRIVES,,,08028,,,,,,,,,,,,,,,,,,,2005-11-08,F,,,,,45.2V,NAFRev1,N,4.760185,50.105931,0.95,housenumber,21 Rue Pierre Viénot 08320 Aubrives,08028_0078_00021,G,21 RUE PIERRE VIENOT,
420932915,00010,42093291500010,O,1998-11-01,NN,,,2018-05-30T11:43:55,true,4,,,,RLE,RUELLE WASLET,08320,AUBRIVES,,,08028,,,,,,,,,,,,,,,,,,,2017-10-31,F,,,,,68.20B,NAFRev2,N,4.765017,50.101637,0.8,street,Ruelle Waslet 08320 Aubrives,08028_0125,G,RUELLE WASLET,
422534305,00012,42253430500012,O,1999-04-15,,,,2011-05-03T00:38:00,false,3,,11,,RUE,DES SPORTS,08320,AUBRIVES,,,08028,,,,,,,,,,,,,,,,,,,1999-12-30,F,,,,,55.3B,NAF1993,N,4.764897,50.105089,0.94,housenumber,11 Rue des Sports 08320 Aubrives,08028_0100_00011,G,11 RUE DES SPORTS,
423396928,00016,42339692800016,O,1999-06-01,NN,,,2013-07-10T08:32:09,false,4,,5,,RUE,FRANCIS POULENC,08320,AUBRIVES,,,08028,,,,,,,,,,,,,,,,,,,2002-09-30,F,,,,,93.0D,NAF1993,N,4.75089,50.104483,0.95,housenumber,5 Rue Francis Poulenc 08320 Aubrives,08028_0028_00005,G,5 RUE FRANCIS POULENC,
424602340,00012,42460234000012,O,1999-10-12,NN,,,2011-04-23T10:27:06,true,4,,,,RTE,N 51,08320,AUBRIVES,,,08028,,,,,,,,,,,,,,,,,,,2009-11-05,F,,,,,55.10Z,NAFRev2,O,,,0,,,,,,
428691166,00014,42869116600014,O,2000-01-04,NN,,,2011-05-03T00:40:33,false,4,,2,,PL,DE LA MAIRIE,08320,AUBRIVES,,,08028,,,,,,,,,,,,,,,,,,,2001-03-31,F,,,,,45.3F,NAF1993,N,4.761787,50.103238,0.84,housenumber,2 Place de la Mairie 08320 Aubrives,08028_0054_00002,G,2 PLACE DE LA MAIRIE,
429373723,00023,42937372300023,O,2009-04-30,,,,2010-04-23T10:55:42,false,2,FERME MON PLAISIR,,,RTE,DE BEAURAING,08320,AUBRIVES,,,08028,,,,,,,,,,,,,,,,,,,2009-04-30,F,,,,,01.42Z,NAFRev2,N,,,0,,,,,,