siren,nic,siret,statutDiffusionEtablissement,dateCreationEtablissement,trancheEffectifsEtablissement,anneeEffectifsEtablissement,activitePrincipaleRegistreMetiersEtablissement,dateDernierTraitementEtablissement,etablissementSiege,nombrePeriodesEtablissement,complementAdresseEtablissement,numeroVoieEtablissement,indiceRepetitionEtablissement,typeVoieEtablissement,libelleVoieEtablissement,codePostalEtablissement,libelleCommuneEtablissement,libelleCommuneEtrangerEtablissement,distributionSpecialeEtablissement,codeCommuneEtablissement,codeCedexEtablissement,libelleCedexEtablissement,codePaysEtrangerEtablissement,libellePaysEtrangerEtablissement,complementAdresse2Etablissement,numeroVoie2Etablissement,indiceRepetition2Etablissement,typeVoie2Etablissement,libelleVoie2Etablissement,codePostal2Etablissement,libelleCommune2Etablissement,libelleCommuneEtranger2Etablissement,distributionSpeciale2Etablissement,codeCommune2Etablissement,codeCedex2Etablissement,libelleCedex2Etablissement,codePaysEtranger2Etablissement,libellePaysEtranger2Etablissement,dateDebut,etatAdministratifEtablissement,enseigne1Etablissement,enseigne2Etablissement,enseigne3Etablissement,denominationUsuelleEtablissement,activitePrincipaleEtablissement,nomenclatureActivitePrincipaleEtablissement,caractereEmployeurEtablissement,longitude,latitude,geo_score,geo_type,geo_adresse,geo_id,geo_ligne,geo_l4,geo_l5
211003579,00011,21100357900011,O,1983-03-01,11,2020,,2022-08-29T09:05:53,true,4,,78,,RUE,DE L'EGLISE,10600,SAVIERES,,,10368,,,,,,,,,,,,,,,,,,,2008-01-01,A,MAIRIE,,,,84.11Z,NAFRev2,O,3.95128,48.40729,0.95,housenumber,78 Rue de l’Eglise 10600 Savières,10368_0009_00078,G,78 RUE DE L EGLISE,
211003579,00029,21100357900029,O,1983-12-21,03,2020,,2022-08-29T09:05:53,false,3,,78,,RUE,DE L'EGLISE,10600,SAVIERES,,,10368,,,,,,,,,,,,,,,,,,,2008-01-01,A,ECOLE PRIMAIRE PUBLIQUE,,,,85.20Z,NAFRev2,N,3.95128,48.40729,0.95,housenumber,78 Rue de l’Eglise 10600 Savières,10368_0009_00078,G,78 RUE DE L EGLISE,
211003579,00037,21100357900037,O,1983-12-21,NN,,,,false,4,,,,RUE,DE L'EGLISE,10600,SAVIERES,,,10368,,,,,,,,,,,,,,,,,,,1997-12-31,F,ECOLE PRIMAIRE PUBLIQUE GROUPE 2,,,,80.1Z,NAF1993,N,3.95128,48.40729,0.95,street,Rue de l’Eglise 10600 Savières,10368_0009,G,RUE DE L EGLISE,
251000634,00013,25100063400013,O,1983-03-01,NN,,,2017-05-04T01:35:14,true,5,MAIRIE,78,,RUE,DE L'EGLISE,10600,SAVIERES,,BP 10,10368,,,,,,,,,,,,,,,,,,,2016-12-31,F,,,,,36.00Z,NAFRev2,O,3.95128,48.40729,0.95,housenumber,78 Rue de l’Eglise 10600 Savières,10368_0009_00078,G,78 RUE DE L EGLISE,
261003628,00011,26100362800011,O,1983-03-01,NN,,,2010-06-26T03:04:16,true,3,MAIRIE,78,,RUE,DE L'EGLISE,10600,SAVIERES,,,10368,,,,,,,,,,,,,,,,,,,2008-01-01,A,CCAS,,,,88.99B,NAFRev2,N,3.95128,48.40729,0.95,housenumber,78 Rue de l’Eglise 10600 Savières,10368_0009_00078,G,78 RUE DE L EGLISE,
261007678,00012,26100767800012,O,1984-05-10,NN,,,2010-06-26T03:04:22,true,3,MAIRIE,78,,RUE,DE L'EGLISE,10600,SAVIERES,,,10368,,,,,,,,,,,,,,,,,,,2008-01-01,A,CDE,,,,88.99B,NAFRev2,N,3.95128,48.40729,0.95,housenumber,78 Rue de l’Eglise 10600 Savières,10368_0009_00078,G,78 RUE DE L EGLISE,
291003663,00015,29100366300015,O,1994-01-19,NN,,,2018-09-29T12:08:55,true,4,MAIRIE,78,,RUE,DE L'EGLISE,10600,SAVIERES,,,10368,,,,,,,,,,,,,,,,,,,2008-01-01,A,,,,,42.99Z,NAFRev2,O,3.95128,48.40729,0.95,housenumber,78 Rue de l’Eglise 10600 Savières,10368_0009_00078,G,78 RUE DE L EGLISE,
300233459,00019,30023345900019,O,,,,,,true,1,,,,,,10600,SAVIERES,,,10368,,,,,,,,,,,,,,,,,,,1984-12-25,F,,,,,86.06,NAP,N,,,0,,,,,,
300622644,00015,30062264400015,O,,,,,,true,1,,,,,,10600,SAVIERES,,,10368,,,,,,,,,,,,,,,,,,,1990-10-22,F,,,,,69.11,NAP,N,,,0,,,,,,
302346168,00016,30234616800016,O,1975-01-01,NN,,,2018-05-01T03:45:56,true,4,,,,,,10600,SAVIERES,,,10368,,,,,,,,,,,,,,,,,,,2018-04-30,F,,,,,93.21Z,NAFRev2,N,,,0,,,,,,
302764956,00017,30276495600017,O,,,,,,true,1,,,,,,10600,SAVIERES,,,10368,,,,,,,,,,,,,,,,,,,,F,,,,,69.11,NAP,N,,,0,,,,,,
304853948,00012,30485394800012,O,,,,,,true,1,,,,,,10600,SAVIERES,,,10368,,,,,,,,,,,,,,,,,,,1985-12-25,F,,,,,87.03,NAP,N,,,0,,,,,,
305914343,00028,30591434300028,O,1982-01-14,11,2020,,2022-08-29T09:12:24,true,5,,,,,MAIRIE,10600,SAVIERES,,,10368,,,,,,,,,,,,,,,,,,,2008-01-01,A,,,,,88.10A,NAFRev2,O,3.0709671,50.6304695,0.92,poi.townhall,Hôtel de Ville Lille,https://osm.org/way/40917078,G,,
306231127,00011,30623112700011,O,1984-11-01,NN,,,2008-11-07T00:21:59,true,5,,584,,,VOIE DES VIGNES,10600,SAVIERES,,,10368,,,,,,,,,,,,,,,,,,,2005-09-27,F,,,,,45.3E,NAFRev1,O,3.946819,48.402806,0.95,housenumber,584 Voie des Vignes 10600 Savières,10368_0022_00584,G,584 VOIE DES VIGNES,
312579683,00011,31257968300011,O,1978-01-01,NN,,,2008-11-07T00:27:44,true,4,,134,,RUE,DE L ENFER,10600,SAVIERES,,,10368,,,,,,,,,,,,,,,,,,,2006-03-31,F,,,,,50.2Z,NAFRev1,N,3.954025,48.406999,0.95,housenumber,134 Rue de l’Enfer 10600 Savières,10368_0010_00134,G,134 RUE DE L ENFER,
313579542,00017,31357954200017,O,,NN,,,,true,1,,,,,,10600,SAVIERES,,,10368,,,,,,,,,,,,,,,,,,,1996-12-31,F,,,,,55.4A,NAF1993,N,,,0,,,,,,
313954604,00010,31395460400010,O,1978-01-01,NN,,,2021-02-23T10:40:22,true,3,,78,,RUE,DE CHAVANNES,10600,SAVIERES,,,10368,,,,,,,,,,,,,,,,,,,2008-01-01,A,,,,,01.11Z,NAFRev2,N,3.956837,48.4044,0.95,housenumber,78 Rue de Chavannes 10600 Savières,10368_0006_00078,G,78 RUE DE CHAVANNES,
315712646,00019,31571264600019,O,,,,,,true,1,,,,,,10600,SAVIERES,,,10368,,,,,,,,,,,,,,,,,,,1984-12-25,F,,,,,67.01,NAP,N,,,0,,,,,,
316402981,00013,31640298100013,O,1979-01-01,NN,,,2015-05-14T04:56:05,true,7,,,,,MAIRIE,10600,SAVIERES,,,10368,,,,,,,,,,,,,,,,,,,2013-08-02,A,,,,,88.99B,NAFRev2,N,3.0709671,50.6304695,0.92,poi.townhall,Hôtel de Ville Lille,https://osm.org/way/40917078,G,,
316464205,00012,31646420500012,O,1979-01-01,NN,,,2015-08-09T03:17:35,true,4,,,,,CHEZ MR DANY BECARD,10600,SAVIERES,,,10368,,,,,,,,,,,,,,,,,,,2015-06-30,F,,,,,01.11Z,NAFRev2,N,,,0,,,,,,
317809903,00014,31780990300014,O,,NN,,,,true,1,,,,,,10600,SAVIERES,,,10368,,,,,,,,,,,,,,,,,,,1988-12-25,F,,,,,55.60,NAP,N,,,0,,,,,,
319824538,00015,31982453800015,O,1980-09-01,NN,,,2016-05-31T04:43:10,true,4,,502,,RTE,DE TROYES,10600,SAVIERES,,,10368,,,,,,,,,,,,,,,,,,,2008-01-01,F,,,,,01.47Z,NAFRev2,N,3.954902,48.40341,0.85,housenumber,502 Route de Troyes 10600 Savières,10368_0027_00502,G,502 ROUTE DE TROYES,
321778110,00023,32177811000023,O,1997-06-25,NN,,,2016-01-12T00:11:21,true,3,,,,,BLIVES,10600,SAVIERES,,,10368,,,,,,,,,,,,,,,,,,,2008-01-01,A,,,,,02.20Z,NAFRev2,N,3.933023,48.426538,0.94,street,Blives 10600 Savières,10368_rxzlst,G,BLIVES,
323791467,00026,32379146700026,O,1994-02-26,NN,,,2006-12-15T00:22:02,false,3,RATTACHEMENT MAIRIE,,,,MAIRIE,10600,SAVIERES,,,10368,,,,,,,,,,,,,,,,,,,1996-11-30,F,,,,,52.6D,NAF1993,N,3.0709671,50.6304695,0.92,poi.townhall,Hôtel de Ville Lille,https://osm.org/way/40917078,G,,
323791467,00059,32379146700059,O,2005-10-18,,,,2021-05-28T03:50:07,true,3,SDF COMMUNE DE RATTACHEMEN,,,,CHEZ MME AUBERT,10600,SAVIERES,,,10368,,,,,,,,,,,,,,,,,,,2020-12-31,F,,,,,47.81Z,NAFRev2,N,-0.8892663,43.2266256,0.78,poi.hostel,Chez Mme Ellisalt Michèle (Auberge) Mauléon-Licharre,https://osm.org/node/4335049471,G,,
324733492,00015,32473349200015,O,,,,,,true,1,,,,,,10600,SAVIERES,,,10368,,,,,,,,,,,,,,,,,,,1985-12-25,F,,,,,67.01,NAP,N,,,0,,,,,,
327153227,00027,32715322700027,O,1985-05-02,NN,,,,false,3,,,,,,10600,SAVIERES,,,10368,,,,,,,,,,,,,,,,,,,1992-08-09,F,,,,,60.2L,NAF1993,N,,,0,,,,,,
327815908,00014,32781590800014,O,,NN,,,,true,1,,,,,,10600,SAVIERES,,,10368,,,,,,,,,,,,,,,,,,,,F,,,,,86.06,NAP,N,,,0,,,,,,
328236153,00024,32823615300024,O,2019-09-01,,,4322AZ,2021-02-23T10:49:29,true,1,,667,,RTE,DE MAIZIERES,10600,SAVIERES,,,10368,,,,,,,,,,,,,,,,,,,2019-09-01,A,B3J,,,B3J,43.22A,NAFRev2,N,3.947115,48.41242,0.87,housenumber,667 Route de Maizières 10600 Savières,10368_0015_00667,G,667 ROUTE DE MAIZIERES,
328279088,00012,32827908800012,O,,NN,,,,true,1,,,,,SANS DOMICILE FIXE,10600,SAVIERES,,,10368,,,,,,,,,,,,,,,,,,,1989-07-01,F,,,,,92.7C,NAF1993,N,,,0,,,,,,
329748750,00018,32974875000018,O,1984-05-02,NN,,,2008-11-07T00:47:56,true,3,,,,,,10600,SAVIERES,,,10368,,,,,,,,,,,,,,,,,,,2007-05-31,F,,,,,45.2L,NAFRev1,N,,,0,,,,,,
331139402,00019,33113940200019,O,,,,,,true,1,,,,RUE,PRINCIPALE,10600,SAVIERES,,,10368,,,,,,,,,,,,,,,,,,,1986-03-23,F,,,,,55.72,NAP,N,3.951048,48.406597,0.31,street,Rue Royale 10600 Savières,10368_0145,G,RUE ROYALE,
331322420,00018,33132242000018,O,,NN,,,,true,1,,,,,,10600,SAVIERES,,,10368,,,,,,,,,,,,,,,,,,,,F,,,,,64.11,NAP,N,,,0,,,,,,
331635557,00019,33163555700019,O,1985-01-01,NN,,,,true,4,,,,,,10600,SAVIERES,,,10368,,,,,,,,,,,,,,,,,,,2003-10-31,F,,,,,01.1A,NAFRev1,N,,,0,,,,,,
335216909,00010,33521690900010,O,1986-03-15,NN,,,2013-07-25T08:55:33,true,4,,,,,,10600,SAVIERES,,,10368,,,,,,,,,,,,,,,,,,,2013-06-07,F,,,,,01.11Z,NAFRev2,N,,,0,,,,,,
337639462,00023,33763946200023,O,2006-03-01,,,,2021-02-23T10:54:25,true,2,,307,,RTE,DE TROYES,10600,SAVIERES,,,10368,,,,,,,,,,,,,,,,,,,2008-01-01,A,,,,,68.31Z,NAFRev2,N,3.954059,48.405042,0.85,housenumber,307 Route de Troyes 10600 Savières,10368_0027_00307,G,307 ROUTE DE TROYES,
337995914,00021,33799591400021,O,2001-11-16,NN,,,2008-01-04T21:16:06,true,3,MME PHILIPPAERTS,347,,RTE,DE TROYES,10600,SAVIERES,,,10368,,,,,,,,,,,,,,,,,,,2008-01-01,A,,,,,41.10D,NAFRev2,N,3.95424,48.40473,0.85,housenumber,347 Route de Troyes 10600 Savières,10368_0027_00347,G,347 ROUTE DE TROYES,
339078941,00046,33907894100046,O,1999-09-01,NN,,4321AB,2022-07-26T07:42:01,true,9,,124,,RTE,MAIZIERES,10600,SAVIERES,,,10368,,,,,,,,,,,,,,,,,,,2012-12-31,A,,,,,43.21A,NAFRev2,N,3.951224,48.408584,0.85,housenumber,124 Route de Maizières 10600 Savières,10368_0015_00124,G,124 ROUTE DE MAIZIERES,
342677770,00014,34267777000014,O,,NN,,,,true,1,,39,,RUE,DE L EGLISE,10600,SAVIERES,,,10368,,,,,,,,,,,,,,,,,,,1989-08-28,F,,,,,77.10,NAP,N,3.951608,48.407251,0.95,housenumber,39 Rue de l’Eglise 10600 Savières,10368_0009_00039,G,39 RUE DE L EGLISE,
342943073,00011,34294307300011,O,,NN,,,,true,1,,9,,RTE,DE CHAUCHIGNY,10600,SAVIERES,,,10368,,,,,,,,,,,,,,,,,,,1988-09-30,F,,,,,67.01,NAP,N,3.952119,48.407567,0.86,housenumber,9 Route de Chauchigny 10600 Savières,10368_0005_00009,G,9 ROUTE DE CHAUCHIGNY,
343367678,00012,34336767800012,O,,NN,,,,true,1,,,,,,10600,SAVIERES,,,10368,,,,,,,,,,,,,,,,,,,1988-06-30,F,,,,,58.09,NAP,N,,,0,,,,,,
343412854,00014,34341285400014,O,1987-12-23,NN,,,2008-01-04T22:15:13,true,3,CHEZ MME DANY BECARD,,,,,10600,SAVIERES,,,10368,,,,,,,,,,,,,,,,,,,2008-01-01,A,,,,,68.20B,NAFRev2,N,,,0,,,,,,
344002324,00020,34400232400020,O,2013-08-01,,,,2021-07-23T20:02:19,true,4,,155,,RUE,DE CHAVANNES,10600,SAVIERES,,,10368,,,,,,,,,,,,,,,,,,,2020-12-31,F,,,,,85.42Z,NAFRev2,N,3.957002,48.404218,0.95,housenumber,155 Rue de Chavannes 10600 Savières,10368_0006_00155,G,155 RUE DE CHAVANNES,
347999054,00039,34799905400039,O,1995-11-01,NN,,,2006-11-25T10:56:30,false,3,,690,,RTE,DE TROYES,10600,SAVIERES,,,10368,,,,,,,,,,,,,,,,,,,2000-12-25,F,,,,,70.2C,NAF1993,O,3.955992,48.401879,0.85,housenumber,690 Route de Troyes 10600 Savières,10368_0027_00690,G,690 ROUTE DE TROYES,
348226135,00013,34822613500013,O,1988-10-01,NN,,,2016-04-26T03:54:02,true,6,,,,RTE,DE MEZIERES,10600,SAVIERES,,,10368,,,,,,,,,,,,,,,,,,,2014-12-31,F,,,,,93.21Z,NAFRev2,O,3.946624,48.413361,0.55,street,Route de Maizières 10600 Savières,10368_0015,G,ROUTE DE MAIZIERES,
348986688,00011,34898668800011,O,1988-12-14,NN,,,2012-02-17T09:52:55,true,3,,131,,RUE,DE CHAVANNES,10600,SAVIERES,,,10368,,,,,,,,,,,,,,,,,,,2008-01-01,A,,,,,68.20B,NAFRev2,N,3.95687,48.404564,0.95,housenumber,131 Rue de Chavannes 10600 Savières,10368_0006_00131,G,131 RUE DE CHAVANNES,
353042872,00039,35304287200039,O,1998-03-01,NN,,,2021-03-16T09:13:52,true,4,,270,,RTE,DE MAIZIERES,10600,SAVIERES,,,10368,,,,,,,,,,,,,,,,,,,2021-02-17,A,,,,,46.19B,NAFRev2,N,3.949951,48.409402,0.87,housenumber,270 Route de Maizières 10600 Savières,10368_0015_00270,G,270 ROUTE DE MAIZIERES,
354096786,00018,35409678600018,O,1990-03-26,NN,,,2008-11-08T00:32:07,true,3,,261,,RUE,EPINCEY,10600,SAVIERES,,,10368,,,,,,,,,,,,,,,,,,,2003-12-31,F,,,,,18.2C,NAFRev1,N,3.94607,48.416098,0.89,housenumber,261 Rue d’Epincey 10600 Savières,10368_0011_00261,G,261 RUE D EPINCEY,
356000216,03853,35600021603853,O,1991-01-01,NN,,,2008-12-15T16:37:31,false,4,,525,,RUE,ROYALE,10600,SAVIERES,,,10368,,,,,,,,,,,,,,,,,,,2008-12-05,F,BUREAU DE POSTE,,,,53.10Z,NAFRev2,O,3.950417,48.407227,0.95,housenumber,525 Rue Royale 10600 Savières,10368_0145_00525,G,525 RUE ROYALE,
356000216,09231,35600021609231,O,2005-10-25,NN,,,2013-03-05T09:59:43,false,4,,525,,RUE,ROYALE,10600,SAVIERES,,,10368,,,,,,,,,,,,,,,,,,,2011-12-31,F,CENTRE COURRIER,,,,53.10Z,NAFRev2,O,3.950417,48.407227,0.95,housenumber,525 Rue Royale 10600 Savières,10368_0145_00525,G,525 RUE ROYALE,
377559588,00027,37755958800027,O,,NN,,,,true,1,,883,,,ROUTE DE MAIZIERES,10600,SAVIERES,,,10368,,,,,,,,,,,,,,,,,,,1991-03-06,F,,,,,55.72,NAP,N,3.945717,48.414209,0.96,housenumber,883 Route de Maizières 10600 Savières,10368_0015_00883,G,883 ROUTE DE MAIZIERES,
380257162,00012,38025716200012,O,1990-12-12,NN,,,2012-02-17T09:52:29,true,3,,131,,RUE,DE CHAVANNES,10600,SAVIERES,,,10368,,,,,,,,,,,,,,,,,,,2008-01-01,A,,,,,68.20B,NAFRev2,N,3.95687,48.404564,0.95,housenumber,131 Rue de Chavannes 10600 Savières,10368_0006_00131,G,131 RUE DE CHAVANNES,
380317693,00014,38031769300014,O,,NN,,,,true,1,,566,,RTE,DE TROYES,10600,SAVIERES,,,10368,,,,,,,,,,,,,,,,,,,1991-11-04,F,,,,,64.41,NAP,N,3.955542,48.402574,0.85,housenumber,566 Route de Troyes 10600 Savières,10368_0027_00566,G,566 ROUTE DE TROYES,
380886317,00011,38088631700011,O,,NN,,,,true,1,,83,,RUE,SAINT GILLES,10600,SAVIERES,,,10368,,,,,,,,,,,,,,,,,,,1991-02-15,F,,,,,64.23,NAP,N,3.94149,48.41965,0.83,street,Rue Saint Gilles 10600 Savières,10368_0023,G,RUE SAINT GILLES,
381239565,00017,38123956500017,O,1991-04-02,00,2020,,2022-08-29T09:08:24,true,5,,60,,CHE,DE BEUVE,10600,SAVIERES,,,10368,,,,,,,,,,,,,,,,,,,2020-04-30,F,,,,,81.30Z,NAFRev2,O,3.945374,48.419668,0.83,housenumber,60 Chemin de Beuve 10600 Savières,10368_0032_00060,G,60 CHEMIN DE BEUVE,
381809615,00010,38180961500010,O,1991-05-01,NN,,,,true,1,,59,,,FERME DES MARRONIERS,10600,SAVIERES,,,10368,,,,,,,,,,,,,,,,,,,1998-04-01,F,,,,,01.3Z,NAF1993,N,3.957538,48.404777,0.86,housenumber,59 Rue de la Ferme des Marronniers 10600 Savières,10368_0061_00059,G,59 RUE LA FERM DES MARRONNIERS,
385234711,00013,38523471100013,O,1965-10-01,NN,,,,true,1,,463,,RTE,DE MAIZIERES,10600,SAVIERES,,,10368,,,,,,,,,,,,,,,,,,,2001-03-01,F,,,,,70.2B,NAF1993,N,3.948265,48.410847,0.87,housenumber,463 Route de Maizières 10600 Savières,10368_0015_00463,G,463 ROUTE DE MAIZIERES,
388617607,00014,38861760700014,O,1992-09-15,NN,,,,true,1,,753,,RTE,DE MAIZIERES,10600,SAVIERES,,,10368,,,,,,,,,,,,,,,,,,,2001-03-01,F,,,,,70.2B,NAF1993,N,3.946635,48.413144,0.87,housenumber,753 Route de Maizières 10600 Savières,10368_0015_00753,G,753 ROUTE DE MAIZIERES,
388617763,00015,38861776300015,O,1992-09-15,NN,,,,true,1,,47,,RUE,ROYALE,10600,SAVIERES,,,10368,,,,,,,,,,,,,,,,,,,2001-03-01,F,,,,,70.2B,NAF1993,N,3.954006,48.403864,0.95,housenumber,47 Rue Royale 10600 Savières,10368_0145_00047,G,47 RUE ROYALE,
388712655,00017,38871265500017,O,1992-09-15,NN,,,2018-06-26T15:41:44,true,4,,47,,RUE,ROYALE,10600,SAVIERES,,,10368,,,,,,,,,,,,,,,,,,,2018-03-30,F,,,,,01.11Z,NAFRev2,N,3.954006,48.403864,0.95,housenumber,47 Rue Royale 10600 Savières,10368_0145_00047,G,47 RUE ROYALE,
389194267,00032,38919426700032,O,2011-02-14,,,,2021-02-23T11:15:09,true,6,,242,,RUE,DES GREVES,10600,SAVIERES,,,10368,,,,,,,,,,,,,,,,,,,2018-02-01,A,,,,PEK AUTOS 10,45.11Z,NAFRev2,N,3.954148,48.400571,0.95,housenumber,242 Rue des Grèves 10600 Savières,10368_0093_00242,G,242 RUE DES GREVES,
390105187,00020,39010518700020,O,2009-07-01,,,,2021-06-19T11:45:05,true,4,,200,,RTE,DE MAIZIERES,10600,SAVIERES,,,10368,,,,,,,,,,,,,,,,,,,2021-06-01,A,,,,,47.91B,NAFRev2,N,3.950472,48.408984,0.87,housenumber,200 Route de Maizières 10600 Savières,10368_0015_00200,G,200 ROUTE DE MAIZIERES,
390272326,00013,39027232600013,O,1993-01-31,NN,,,2020-04-04T03:35:53,true,4,,1520,,RTE,DE MAIZIERES,10600,SAVIERES,,,10368,,,,,,,,,,,,,,,,,,,2020-03-31,F,,,,,01.11Z,NAFRev2,N,3.943867,48.419748,0.87,housenumber,1520 Route de Maizières 10600 Savières,10368_0015_01520,G,1520 ROUTE DE MAIZIERES,
390770550,00031,39077055000031,O,1997-09-29,NN,,,,false,4,,34,,,VOIE ST GILLES,10600,SAVIERES,,,10368,,,,,,,,,,,,,,,,,,,2001-09-01,F,,,,,92.3H,NAF1993,N,3.942774,48.420021,0.84,housenumber,34 Voie Saint Gilles 10600 Savières,10368_0161_00034,G,34 VOIE SAINT GILLES,
390770550,00049,39077055000049,O,2001-09-01,NN,,,2008-01-04T23:44:22,true,4,,126,,RUE,ROYALE,10600,SAVIERES,,,10368,,,,,,,,,,,,,,,,,,,2008-01-01,A,,,,,93.29Z,NAFRev2,N,3.953731,48.404242,0.95,housenumber,126 Rue Royale 10600 Savières,10368_0145_00126,G,126 RUE ROYALE,
393088414,00015,39308841400015,O,1993-11-01,NN,,,,true,1,,9,,RTE,DE CHAUCHIGNY,10600,SAVIERES,,,10368,,,,,,,,,,,,,,,,,,,1998-05-05,F,,,,,55.3A,NAF1993,N,3.952119,48.407567,0.86,housenumber,9 Route de Chauchigny 10600 Savières,10368_0005_00009,G,9 ROUTE DE CHAUCHIGNY,
393297114,00018,39329711400018,O,1993-10-06,NN,,,2008-01-05T00:14:34,true,3,,,,,,10600,SAVIERES,,,10368,,,,,,,,,,,,,,,,,,,2008-01-01,A,,,,,94.99Z,NAFRev2,N,,,0,,,,,,
393648142,00015,39364814200015,O,1994-01-01,NN,,,,true,3,,,,,,10600,SAVIERES,,,10368,,,,,,,,,,,,,,,,,,,2003-12-31,F,,,,,70.2B,NAFRev1,N,,,0,,,,,,
393652268,00011,39365226800011,O,1994-01-01,NN,,,,true,3,,,,,,10600,SAVIERES,,,10368,,,,,,,,,,,,,,,,,,,2003-12-31,F,,,,,70.2B,NAFRev1,N,,,0,,,,,,
398681346,00027,39868134600027,O,2015-01-01,,,,2021-02-23T11:22:28,false,1,,988,,RTE,DE MAIZIERES,10600,SAVIERES,,,10368,,,,,,,,,,,,,,,,,,,2015-01-01,A,,,,,02.10Z,NAFRev2,N,3.945297,48.41504,0.87,housenumber,988 Route de Maizières 10600 Savières,10368_0015_00988,G,988 ROUTE DE MAIZIERES,
399753300,00017,39975330000017,O,1993-10-01,NN,,,,true,1,,,,,,10600,SAVIERES,,,10368,,,,,,,,,,,,,,,,,,,1998-04-01,F,,,,,01.1A,NAF1993,N,,,0,,,,,,
400013017,00027,40001301700027,O,1995-02-23,,,,2022-05-12T11:38:36,true,1,,614,,,VOIE DES VIGNES,10600,SAVIERES,,,10368,,,,,,,,,,,,,,,,,,,1995-02-23,A,,,,,68.20B,NAFRev2,N,3.946464,48.40268,0.95,housenumber,614 Voie des Vignes 10600 Savières,10368_0022_00614,G,614 VOIE DES VIGNES,
400035366,00022,40003536600022,O,2004-05-01,NN,,,2006-11-25T12:45:54,true,2,,508,,RUE,DESPINCEY,10600,SAVIERES,,,10368,,,,,,,,,,,,,,,,,,,2004-12-25,F,,,,,52.6E,NAFRev1,N,3.945582,48.418399,0.75,housenumber,508 Rue d’Epincey 10600 Savières,10368_0011_00508,G,508 RUE D EPINCEY,
400792032,00015,40079203200015,O,1959-01-01,NN,,,2019-12-17T03:47:55,true,4,,160,,,VOIE DES VIGNES,10600,SAVIERES,,,10368,,,,,,,,,,,,,,,,,,,2019-12-01,F,,,,,01.11Z,NAFRev2,N,3.950882,48.404721,0.95,housenumber,160 Voie des Vignes 10600 Savières,10368_0022_00160,G,160 VOIE DES VIGNES,
402302095,00011,40230209500011,O,1995-09-11,NN,,,2006-11-25T14:56:09,true,4,,464,,RUE,ROYALE,10600,SAVIERES,,,10368,,,,,,,,,,,,,,,,,,,2004-11-09,F,,,,,74.1J,NAFRev1,N,3.951048,48.406597,0.73,street,Rue Royale 10600 Savières,10368_0145,G,RUE ROYALE,
402359061,00015,40235906100015,O,,NN,,,,true,1,,687,,RTE,DE MAIZIERES,10600,SAVIERES,,,10368,,,,,,,,,,,,,,,,,,,1996-09-30,F,,,,,60.2L,NAF1993,N,3.946981,48.412602,0.87,housenumber,687 Route de Maizières 10600 Savières,10368_0015_00687,G,687 ROUTE DE MAIZIERES,
402686513,00019,40268651300019,O,1995-10-19,NN,,,2008-11-08T01:14:03,true,5,,464,,RUE,ROYALE,10600,SAVIERES,,,10368,,,,,,,,,,,,,,,,,,,2005-12-31,F,,,,,28.7Q,NAFRev1,N,3.951048,48.406597,0.73,street,Rue Royale 10600 Savières,10368_0145,G,RUE ROYALE,
403166580,00015,40316658000015,O,1995-10-01,NN,,,2008-01-04T20:17:45,true,3,MAIRIE,,,,,10600,SAVIERES,,,10368,,,,,,,,,,,,,,,,,,,2008-01-01,A,,,,,93.12Z,NAFRev2,N,,,0,,,,,,
403714413,00016,40371441300016,O,1996-01-01,NN,,,2008-01-04T20:27:45,true,3,,78,,RUE,DE CHAVANNES,10600,SAVIERES,,,10368,,,,,,,,,,,,,,,,,,,2008-01-01,A,,,,,68.20B,NAFRev2,N,3.956837,48.4044,0.95,housenumber,78 Rue de Chavannes 10600 Savières,10368_0006_00078,G,78 RUE DE CHAVANNES,
405051046,00028,40505104600028,O,1998-01-01,NN,,,2006-11-25T15:10:21,false,4,,190,,RUE,DE LA HALTE,10600,SAVIERES,,,10368,,,,,,,,,,,,,,,,,,,2004-02-18,F,,,,,74.2C,NAFRev1,O,3.950804,48.404766,0.9,housenumber,190 Ruelle de la Halte 10600 Savières,10368_0012_00190,G,190 RUELLE DE LA HALTE,
405051046,00036,40505104600036,O,2004-02-18,02,2020,4321AB,2022-08-29T09:25:10,true,3,,167,,RUE,DE LA POMPE,10600,SAVIERES,,,10368,,,,,,,,,,,,,,,,,,,2008-01-01,A,,,,,43.21A,NAFRev2,O,3.949632,48.411704,0.95,housenumber,167 Rue de la Pompe 10600 Savières,10368_0020_00167,G,167 RUE DE LA POMPE,
408096444,00018,40809644400018,O,1996-07-01,NN,,4391AZ,2017-05-05T05:43:46,true,6,,29,,,VOIE DE ST MESMIN,10600,SAVIERES,,,10368,,,,,,,,,,,,,,,,,,,2017-03-31,F,,,,,43.91A,NAFRev2,N,3.944388,48.417054,0.93,housenumber,29 Voie Communale de St Mesmin 10600 Savières,10368_0165_00029,G,29 VOIE COMMUNALE DE ST MESMIN,
408809127,00017,40880912700017,O,1980-12-31,NN,,,2008-04-29T05:51:39,true,4,,103,,,,10600,SAVIERES,,,10368,,,,,,,,,,,,,,,,,,,2008-04-03,A,,,,,02.20Z,NAFRev2,N,,,0,,,,,,
408809135,00010,40880913500010,O,1980-12-31,NN,,,,true,1,,133,,RUE,DE TROYES,10600,SAVIERES,,,10368,,,,,,,,,,,,,,,,,,,2000-03-31,F,,,,,01.1F,NAF1993,N,3.953006,48.406516,0.8,housenumber,133 Route de Troyes 10600 Savières,10368_0027_00133,G,133 ROUTE DE TROYES,
408809143,00014,40880914300014,O,1993-02-01,NN,,,2008-01-04T21:17:03,true,3,,395,,RTE,DE MAIZIERES,10600,SAVIERES,,,10368,,,,,,,,,,,,,,,,,,,2008-01-01,A,,,,,01.11Z,NAFRev2,N,3.948766,48.410309,0.87,housenumber,395 Route de Maizières 10600 Savières,10368_0015_00395,G,395 ROUTE DE MAIZIERES,
408821684,00011,40882168400011,O,1980-12-31,NN,,,2019-02-11T10:45:30,true,4,,,,,FERME DES BLIVES,10600,SAVIERES,,,10368,,,,,,,,,,,,,,,,,,,2018-12-31,F,,,,,01.11Z,NAFRev2,N,3.93307,48.42703,0.48,street,Che de Blives 10600 Savières,10368_ic5kf5,G,CHE DE BLIVES,
408966372,00018,40896637200018,O,1996-09-12,NN,,,2008-01-05T20:24:01,true,3,,,,,,10600,SAVIERES,,,10368,,,,,,,,,,,,,,,,,,,2008-01-01,A,,,,,68.20B,NAFRev2,N,,,0,,,,,,
410026132,00010,41002613200010,O,1977-12-25,01,2020,,2022-08-29T09:27:06,true,5,CHEZ M. JEAN-FRANCOIS PHILIPPAERTS,347,,RTE,DE TROYES,10600,SAVIERES,,,10368,,,,,,,,,,,,,,,,,,,2012-12-31,A,,,,,01.11Z,NAFRev2,O,3.95424,48.40473,0.85,housenumber,347 Route de Troyes 10600 Savières,10368_0027_00347,G,347 ROUTE DE TROYES,
410026140,00013,41002614000013,O,1991-05-01,NN,,,,true,1,,59,,,FERME DES MARRONNIERS,10600,SAVIERES,,,10368,,,,,,,,,,,,,,,,,,,1998-03-31,F,,,,,01.1F,NAF1993,N,3.957538,48.404777,0.89,housenumber,59 Rue de la Ferme des Marronniers 10600 Savières,10368_0061_00059,G,59 RUE LA FERM DES MARRONNIERS,
410026157,00017,41002615700017,O,1980-12-31,NN,,,2006-10-28T03:45:07,true,3,,,,,,10600,SAVIERES,,,10368,,,,,,,,,,,,,,,,,,,2006-10-01,F,,,,,01.1F,NAFRev1,N,,,0,,,,,,
412082406,00015,41208240600015,O,,,,,,true,1,,440,B,RUE,ROYALE,10600,SAVIERES,,,10368,,,,,,,,,,,,,,,,,,,1997-04-01,F,,,,,92.3B,NAF1993,N,3.951048,48.406597,0.63,street,Rue Royale 10600 Savières,10368_0145,G,RUE ROYALE,
414538272,00017,41453827200017,O,1997-10-01,NN,,,2006-11-25T15:47:18,false,4,MME CLAUDINE GRAUPNER,62,,RUE,ST GILLES,10600,SAVIERES,,,10368,,,,,,,,,,,,,,,,,,,2000-12-31,F,,,,,92.6C,NAF1993,O,3.94149,48.41965,0.57,street,Rue Saint Gilles 10600 Savières,10368_0023,G,RUE SAINT GILLES,
414538272,00025,41453827200025,O,2000-11-27,NN,,,2006-11-25T15:47:18,false,3,CHEZ MME JOELLE MILLIERE,,,PL,DE L'EGLISE,10600,SAVIERES,,BP 5,10368,,,,,,,,,,,,,,,,,,,2004-10-01,F,,,,,92.6C,NAFRev1,O,3.950387,48.407599,0.82,street,Place de l’Eglise 10600 Savières,10368_0008,G,PLACE DE L EGLISE,