siren,nic,siret,statutDiffusionEtablissement,dateCreationEtablissement,trancheEffectifsEtablissement,anneeEffectifsEtablissement,activitePrincipaleRegistreMetiersEtablissement,dateDernierTraitementEtablissement,etablissementSiege,nombrePeriodesEtablissement,complementAdresseEtablissement,numeroVoieEtablissement,indiceRepetitionEtablissement,typeVoieEtablissement,libelleVoieEtablissement,codePostalEtablissement,libelleCommuneEtablissement,libelleCommuneEtrangerEtablissement,distributionSpecialeEtablissement,codeCommuneEtablissement,codeCedexEtablissement,libelleCedexEtablissement,codePaysEtrangerEtablissement,libellePaysEtrangerEtablissement,complementAdresse2Etablissement,numeroVoie2Etablissement,indiceRepetition2Etablissement,typeVoie2Etablissement,libelleVoie2Etablissement,codePostal2Etablissement,libelleCommune2Etablissement,libelleCommuneEtranger2Etablissement,distributionSpeciale2Etablissement,codeCommune2Etablissement,codeCedex2Etablissement,libelleCedex2Etablissement,codePaysEtranger2Etablissement,libellePaysEtranger2Etablissement,dateDebut,etatAdministratifEtablissement,enseigne1Etablissement,enseigne2Etablissement,enseigne3Etablissement,denominationUsuelleEtablissement,activitePrincipaleEtablissement,nomenclatureActivitePrincipaleEtablissement,caractereEmployeurEtablissement,longitude,latitude,geo_score,geo_type,geo_adresse,geo_id,geo_ligne,geo_l4,geo_l5
211103593,00011,21110359300011,O,1983-03-01,03,2020,,2022-08-29T09:05:56,true,4,HOTEL DE VILLE,,,,,11410,SAINT-MICHEL-DE-LANES,,,11359,,,,,,,,,,,,,,,,,,,2008-01-01,A,MAIRIE,,,,84.11Z,NAFRev2,O,1.758776,43.324821,0.38,street,Le Village 11410 Saint-Michel-de-Lanès,11359_zg8cxg,D,LE VILLAGE,
211103593,00037,21110359300037,O,1997-01-01,NN,,,2019-11-14T14:00:18,false,3,MAIRIE,,,,,11410,SAINT-MICHEL-DE-LANES,,,11359,,,,,,,,,,,,,,,,,,,2008-01-01,A,SERVICE EAU ASSAINISSEMENT,,,,36.00Z,NAFRev2,N,1.756042,43.325109,0.91,street,Place de la Mairie 11410 Saint-Michel-de-Lanès,11359_0038,D,PLACE DE LA MAIRIE,
261101570,00016,26110157000016,O,1986-01-06,NN,,,2019-11-14T14:00:18,true,3,,,,,MAIRIE,11410,SAINT-MICHEL-DE-LANES,,,11359,,,,,,,,,,,,,,,,,,,2008-01-01,A,CCAS,,,,88.99B,NAFRev2,N,1.756042,43.325109,0.91,street,Place de la Mairie 11410 Saint-Michel-de-Lanès,11359_0038,G,PLACE DE LA MAIRIE,
301645644,00016,30164564400016,O,1900-01-01,,,,2019-11-14T14:00:18,true,3,,,,LD,PONTFOL,11410,SAINT-MICHEL-DE-LANES,,,11359,,,,,,,,,,,,,,,,,,,1994-12-25,F,,,,,01.4A,NAF1993,N,1.733708,43.313749,0.59,street,Pont Fol 11410 Saint-Michel-de-Lanès,11359_B050,G,PONT FOL,
301718755,00038,30171875500038,O,,,,,2019-11-14T14:00:18,true,1,,,,,DOMAINE DE RIVALS,11410,SAINT-MICHEL-DE-LANES,,,11359,,,,,,,,,,,,,,,,,,,1987-10-19,F,,,,,01.1F,NAF1993,N,1.755221,43.311112,0.34,street,Les Rivals 11410 Saint-Michel-de-Lanès,11359_szcq4t,G,LES RIVALS,
307591495,00030,30759149500030,O,1990-07-31,NN,,,2019-11-14T14:00:18,true,1,,,,LD,LE PECH,11410,SAINT-MICHEL-DE-LANES,,,11359,,,,,,,,,,,,,,,,,,,2000-03-31,F,,,,,60.2L,NAF1993,N,1.757711,43.334115,0.37,street,Le Plo 11410 Saint-Michel-de-Lanès,11359_09gwbh,G,LE PLO,
308182682,00044,30818268200044,O,1997-01-01,NN,,,2019-11-14T14:00:18,false,5,,1,,RUE,DES MENUISIERS,11410,SAINT-MICHEL-DE-LANES,,,11359,,,,,,,,,,,,,,,,,,,2010-01-15,F,,,,,80.10Z,NAFRev2,N,1.758479,43.324169,0.95,housenumber,1 Rue des Menuisiers 11410 Saint-Michel-de-Lanès,11359_0037_00001,G,1 RUE DES MENUISIERS,
308182682,00069,30818268200069,O,2022-01-04,,,,2022-06-07T08:05:50,true,1,CHENIL LA PLANETE,,,,PARCELLES 364 ET 365,11410,SAINT-MICHEL-DE-LANES,,,11359,,,,,,,,,,,,,,,,,,,2022-01-04,A,LES RIVES DE LA GANGUISE,,,,01.49Z,NAFRev2,N,,,0,,,,,,
312728421,00024,31272842100024,O,1987-01-01,NN,,,2021-02-23T10:39:50,true,5,,,,,LE PLO,11410,SAINT-MICHEL-DE-LANES,,,11359,,,,,,,,,,,,,,,,,,,2008-01-01,A,,,,,01.11Z,NAFRev2,N,1.757711,43.334115,0.94,street,Le Plo 11410 Saint-Michel-de-Lanès,11359_09gwbh,G,LE PLO,
318075637,00039,31807563700039,O,,NN,,,2019-11-14T14:00:18,true,1,,,,,,11410,SAINT-MICHEL-DE-LANES,,,11359,,,,,,,,,,,,,,,,,,,1994-07-31,F,,,,,55.3A,NAF1993,N,,,0,,,,,,
318709417,00014,31870941700014,O,,,,,2019-11-14T14:00:18,true,1,,,,,PAVILLON DIT DES REFUGIES,11410,SAINT-MICHEL-DE-LANES,,,11359,,,,,,,,,,,,,,,,,,,1984-12-25,F,,,,,81.21,NAP,N,,,0,,,,,,
321358962,00017,32135896200017,O,,,,,2019-11-14T14:00:18,true,1,,,,,PAVILLON DES REFUGIES,11410,SAINT-MICHEL-DE-LANES,,,11359,,,,,,,,,,,,,,,,,,,1984-12-25,F,,,,,67.04,NAP,N,,,0,,,,,,
322708884,00018,32270888400018,O,1981-10-01,NN,,,2019-11-14T14:00:18,false,4,,,,,,11410,SAINT-MICHEL-DE-LANES,,,11359,,,,,,,,,,,,,,,,,,,2003-09-01,F,,,,,85.1G,NAFRev1,N,,,0,,,,,,
325478741,00045,32547874100045,O,2015-09-01,,,,2019-11-14T14:00:18,true,2,,1,,IMP,DE LA TERRASSE,11410,SAINT-MICHEL-DE-LANES,,,11359,,,,,,,,,,,,,,,,,,,2016-03-01,F,,,,,90.03A,NAFRev2,N,1.759355,43.324373,0.85,housenumber,1 Impasse de la Terrasse 11410 Saint-Michel-de-Lanès,11359_0050_00001,G,1 IMPASSE DE LA TERRASSE,
325961878,00015,32596187800015,O,1982-11-05,NN,,,2019-11-14T14:00:18,true,3,,,,DOM,DE LA PUJOLLE,11410,SAINT-MICHEL-DE-LANES,,,11359,,,,,,,,,,,,,,,,,,,2008-01-01,A,,,,,01.61Z,NAFRev2,N,1.761064,43.311384,0.48,street,La Pujole 11410 Saint-Michel-de-Lanès,11359_0iz9js,G,LA PUJOLE,
325979813,00020,32597981300020,O,1900-01-01,NN,,,2019-11-14T14:00:18,false,3,,7,,RTE,DE GOURVIELLE,11410,SAINT-MICHEL-DE-LANES,,,11359,,,,,,,,,,,,,,,,,,,1991-12-31,F,,,,,86.07,NAP,N,1.761657,43.327608,0.76,housenumber,7 Route de Gourvieille 11410 Saint-Michel-de-Lanès,11359_0030_00007,G,7 ROUTE DE GOURVIEILLE,
325998581,00012,32599858100012,O,1900-01-01,NN,,,2019-11-14T14:00:18,false,3,,,,DOM,LE PLO,11410,SAINT-MICHEL-DE-LANES,,,11359,,,,,,,,,,,,,,,,,,,1992-12-31,F,,,,,01.4A,NAF1993,N,1.757711,43.334115,0.53,street,Le Plo 11410 Saint-Michel-de-Lanès,11359_09gwbh,G,LE PLO,
326628773,00011,32662877300011,O,1983-01-01,NN,,,2019-11-14T14:00:18,true,3,,,,,LA PUJOLLE,11410,SAINT-MICHEL-DE-LANES,,,11359,,,,,,,,,,,,,,,,,,,2008-01-01,A,,,,,01.61Z,NAFRev2,N,1.761064,43.311384,0.78,street,La Pujole 11410 Saint-Michel-de-Lanès,11359_0iz9js,G,LA PUJOLE,
326628781,00014,32662878100014,O,,NN,,,2019-11-14T14:00:18,true,1,,,,,LES METAILLERES,11410,SAINT-MICHEL-DE-LANES,,,11359,,,,,,,,,,,,,,,,,,,1996-01-31,F,,,,,01.1A,NAF1993,N,1.740325,43.31138,0.94,street,Les Metailleres 11410 Saint-Michel-de-Lanès,11359_esk2x0,G,LES METAILLERES,
328864624,00015,32886462400015,O,,NN,,,2019-11-14T14:00:18,true,1,,,,,,11410,SAINT-MICHEL-DE-LANES,,,11359,,,,,,,,,,,,,,,,,,,1987-04-30,F,,,,,67.04,NAP,N,,,0,,,,,,
334103389,00014,33410338900014,O,,NN,,,2019-11-14T14:00:18,true,1,,,,,,11410,SAINT-MICHEL-DE-LANES,,,11359,,,,,,,,,,,,,,,,,,,1989-05-23,F,,,,,67.01,NAP,N,,,0,,,,,,
338687833,00016,33868783300016,O,1986-09-01,NN,,,2019-11-14T14:00:18,true,3,,,,DOM,DU RIVALS,11410,SAINT-MICHEL-DE-LANES,,,11359,,,,,,,,,,,,,,,,,,,2006-06-01,F,,,,,74.1E,NAFRev1,N,1.755221,43.311112,0.39,street,Les Rivals 11410 Saint-Michel-de-Lanès,11359_szcq4t,G,LES RIVALS,
339094740,00018,33909474000018,O,1986-05-26,NN,,,2019-11-14T14:00:18,true,1,,,,DOM,DE RIVALS,11410,SAINT-MICHEL-DE-LANES,,,11359,,,,,,,,,,,,,,,,,,,2000-04-15,F,,,,,01.1A,NAF1993,N,1.755221,43.311112,0.39,street,Les Rivals 11410 Saint-Michel-de-Lanès,11359_szcq4t,G,LES RIVALS,
339158768,00012,33915876800012,O,1986-10-29,NN,,,2019-11-14T14:00:18,true,3,,,,,,11410,SAINT-MICHEL-DE-LANES,,,11359,,,,,,,,,,,,,,,,,,,2008-01-01,A,,,,,77.12Z,NAFRev2,N,,,0,,,,,,
339159139,00015,33915913900015,O,1986-10-29,NN,,,2019-11-14T14:00:18,true,3,,,,,,11410,SAINT-MICHEL-DE-LANES,,,11359,,,,,,,,,,,,,,,,,,,2008-01-01,A,,,,,77.12Z,NAFRev2,N,,,0,,,,,,
341298396,00019,34129839600019,O,2000-07-03,,,,2019-11-14T14:00:18,false,3,,,,,LA PUJOLLE,11410,SAINT-MICHEL-DE-LANES,,,11359,,,,,,,,,,,,,,,,,,,2000-12-25,F,,,,,52.4Z,NAF1993,N,1.761064,43.311384,0.78,street,La Pujole 11410 Saint-Michel-de-Lanès,11359_0iz9js,G,LA PUJOLE,
341298396,00027,34129839600027,O,1996-07-01,NN,,,2019-11-14T14:00:18,false,4,,,,,LA PUJOLE,11410,SAINT-MICHEL-DE-LANES,,,11359,,,,,,,,,,,,,,,,,,,2016-10-31,F,,,,,01.11Z,NAFRev2,N,1.761064,43.311384,0.94,street,La Pujole 11410 Saint-Michel-de-Lanès,11359_0iz9js,G,LA PUJOLE,
341298396,00035,34129839600035,O,1997-07-05,NN,,,2019-11-14T14:00:18,true,9,,,,,LA PUJOLE,11410,SAINT-MICHEL-DE-LANES,,,11359,,,,,,,,,,,,,,,,,,,2017-09-30,F,,,,,47.78C,NAFRev2,N,1.761064,43.311384,0.94,street,La Pujole 11410 Saint-Michel-de-Lanès,11359_0iz9js,G,LA PUJOLE,
341881605,00016,34188160500016,O,,NN,,,2019-11-14T14:00:18,true,1,,,,,,11410,SAINT-MICHEL-DE-LANES,,,11359,,,,,,,,,,,,,,,,,,,1989-12-31,F,,,,,67.01,NAP,N,,,0,,,,,,
347411464,00014,34741146400014,O,,NN,,,2019-11-14T14:00:18,true,1,,,,,,11410,SAINT-MICHEL-DE-LANES,,,11359,,,,,,,,,,,,,,,,,,,1990-06-30,F,,,,,55.71,NAP,N,,,0,,,,,,
347915332,00014,34791533200014,O,,NN,,,2019-11-14T14:00:18,true,1,,,,,,11410,SAINT-MICHEL-DE-LANES,,,11359,,,,,,,,,,,,,,,,,,,1989-08-01,F,,,,,86.10,NAP,N,,,0,,,,,,
350422085,00018,35042208500018,O,,,,,2019-11-14T14:00:18,true,1,,,,,,11410,SAINT-MICHEL-DE-LANES,,,11359,,,,,,,,,,,,,,,,,,,1997-05-15,F,,,,,85.1G,NAF1993,N,,,0,,,,,,
356000919,01450,35600091901450,O,1991-01-01,NN,,,2019-11-14T14:00:18,false,3,,,,,LE BOURG,11410,SAINT-MICHEL-DE-LANES,,,11359,,,,,,,,,,,,,,,,,,,2006-09-19,F,BUREAU DE POSTE,,,,64.1A,NAFRev1,O,,,0,,,,,,
378892277,00013,37889227700013,O,1990-06-01,NN,,,2019-11-14T14:00:18,true,3,,,,,NAURIOL,11410,SAINT-MICHEL-DE-LANES,,,11359,,,,,,,,,,,,,,,,,,,2008-01-01,A,,,,,68.20A,NAFRev2,N,1.750633,43.33533,0.92,street,Nauriol Bas 11410 Saint-Michel-de-Lanès,11359_B039,G,NAURIOL BAS,
382621068,00024,38262106800024,O,,NN,,,2019-11-14T14:00:18,true,1,,4,,RUE,DU CHATEAU,11410,SAINT-MICHEL-DE-LANES,,,11359,,,,,,,,,,,,,,,,,,,1996-12-31,F,,,,,74.8F,NAF1993,N,1.758595,43.325125,0.94,housenumber,4 Rue du Château 11410 Saint-Michel-de-Lanès,11359_0015_00004,G,4 RUE DU CHATEAU,
384952750,00014,38495275000014,O,1992-01-01,NN,,,2019-11-14T14:00:18,true,4,,,,,EN ROUX,11410,SAINT-MICHEL-DE-LANES,,,11359,,,,,,,,,,,,,,,,,,,2010-12-31,F,,,,,01.47Z,NAFRev2,N,1.754387,43.307219,0.94,street,En Roux 11410 Saint-Michel-de-Lanès,11359_B068,G,EN ROUX,
387538861,00023,38753886100023,O,2011-11-01,,,,2019-11-14T14:00:18,true,1,,,,,LABADE,11410,SAINT-MICHEL-DE-LANES,,,11359,,,,,,,,,,,,,,,,,,,2011-11-01,F,,,,S.C. DIFFUSION,73.12Z,NAFRev2,N,1.748771,43.323209,0.94,street,Labade 11410 Saint-Michel-de-Lanès,11359_c3jty7,G,LABADE,
390317550,00015,39031755000015,O,1993-01-01,NN,,,2019-11-14T14:00:18,true,3,,,,,MAIRIE,11410,SAINT-MICHEL-DE-LANES,,,11359,,,,,,,,,,,,,,,,,,,2008-01-01,A,,,,,94.99Z,NAFRev2,N,1.756042,43.325109,0.91,street,Place de la Mairie 11410 Saint-Michel-de-Lanès,11359_0038,G,PLACE DE LA MAIRIE,
393002209,00012,39300220900012,O,1974-10-18,NN,,,2019-11-14T14:00:18,true,3,,,,,,11410,SAINT-MICHEL-DE-LANES,,,11359,,,,,,,,,,,,,,,,,,,2005-12-25,F,,,,,01.1A,NAFRev1,N,,,0,,,,,,
393401344,00014,39340134400014,O,1994-01-01,NN,,,2019-11-14T14:00:18,true,5,,,,,PECANY,11410,SAINT-MICHEL-DE-LANES,,,11359,,,,,,,,,,,,,,,,,,,2015-09-01,A,,,,,01.11Z,NAFRev2,N,1.74689,43.336116,0.94,street,Pecany 11410 Saint-Michel-de-Lanès,11359_rv9x6j,G,PECANY,
394204713,00017,39420471300017,O,1994-03-03,NN,,,2019-11-14T14:00:18,true,6,,,,,LE PLO,11410,SAINT-MICHEL-DE-LANES,,,11359,,,,,,,,,,,,,,,,,,,2008-01-01,A,,,,,01.11Z,NAFRev2,N,1.757711,43.334115,0.94,street,Le Plo 11410 Saint-Michel-de-Lanès,11359_09gwbh,G,LE PLO,
398389593,00011,39838959300011,O,,NN,,,2019-11-14T14:00:18,true,1,,,,,,11410,SAINT-MICHEL-DE-LANES,,,11359,,,,,,,,,,,,,,,,,,,1996-09-30,F,,,,,55.4B,NAF1993,O,,,0,,,,,,
402702971,00019,40270297100019,O,1995-09-01,NN,,,2019-11-14T14:00:18,true,1,,,,,EMROUX,11410,SAINT-MICHEL-DE-LANES,,,11359,,,,,,,,,,,,,,,,,,,1998-03-31,F,,,,,51.1R,NAF1993,N,1.757058,43.307315,0.42,street,Enroux 11410 Saint-Michel-de-Lanès,11359_ft3q7z,G,ENROUX,
403692890,00011,40369289000011,O,1996-01-31,NN,,,2019-11-14T14:00:18,true,4,,,,,LES METAILLERES,11410,SAINT-MICHEL-DE-LANES,,,11359,,,,,,,,,,,,,,,,,,,2008-12-31,F,,,,,01.11Z,NAFRev2,N,1.740325,43.31138,0.94,street,Les Metailleres 11410 Saint-Michel-de-Lanès,11359_esk2x0,G,LES METAILLERES,
404502270,00030,40450227000030,O,2004-05-01,,,,2019-11-14T14:00:18,false,4,,,,,LE PECH CABUZAC,11410,SAINT-MICHEL-DE-LANES,,,11359,,,,,,,,,,,,,,,,,,,2012-01-01,F,,,,,81.30Z,NAFRev2,N,1.770975,43.333145,0.42,street,Cabuzac 11410 Saint-Michel-de-Lanès,11359_oamucc,G,CABUZAC,
405028655,00018,40502865500018,O,1981-01-01,NN,,,2019-11-14T14:00:18,true,1,,,,,LA CROIX,11410,SAINT-MICHEL-DE-LANES,,,11359,,,,,,,,,,,,,,,,,,,2000-09-30,F,,,,,01.3Z,NAF1993,N,1.733512,43.323309,0.94,street,La Croix 11410 Saint-Michel-de-Lanès,11359_r4vziv,G,LA CROIX,
405028663,00012,40502866300012,O,1972-01-01,NN,,,2019-11-14T14:00:18,true,4,,,,,EN ROUX,11410,SAINT-MICHEL-DE-LANES,,,11359,,,,,,,,,,,,,,,,,,,2008-01-01,A,,,,,01.11Z,NAFRev2,N,1.754387,43.307219,0.94,street,En Roux 11410 Saint-Michel-de-Lanès,11359_B068,G,EN ROUX,
405028671,00015,40502867100015,O,1972-01-01,NN,,,2019-11-14T14:00:18,true,4,,,,,LABADE,11410,SAINT-MICHEL-DE-LANES,,,11359,,,,,,,,,,,,,,,,,,,2008-01-01,A,,,,,01.11Z,NAFRev2,N,1.748771,43.323209,0.94,street,Labade 11410 Saint-Michel-de-Lanès,11359_c3jty7,G,LABADE,
405028689,00017,40502868900017,O,1974-01-01,NN,,,2019-11-14T14:00:18,true,3,,,,,,11410,SAINT-MICHEL-DE-LANES,,,11359,,,,,,,,,,,,,,,,,,,2005-03-01,F,,,,,01.3Z,NAFRev1,N,,,0,,,,,,
405028697,00010,40502869700010,O,1990-07-01,NN,,,2019-11-14T14:00:18,true,4,,,,,MENDAWS,11410,SAINT-MICHEL-DE-LANES,,,11359,,,,,,,,,,,,,,,,,,,2017-08-28,F,,,,,01.11Z,NAFRev2,N,,,0,,,,,,
408291581,00010,40829158100010,O,1987-01-31,NN,,,2019-11-14T14:00:18,true,1,,,,,LA PUJOLLE,11410,SAINT-MICHEL-DE-LANES,,,11359,,,,,,,,,,,,,,,,,,,2001-01-01,F,,,,,01.3Z,NAF1993,N,1.761064,43.311384,0.78,street,La Pujole 11410 Saint-Michel-de-Lanès,11359_0iz9js,G,LA PUJOLE,
408577732,00014,40857773200014,O,1992-11-01,NN,,,2019-11-14T14:00:18,true,4,,,,,,11410,SAINT-MICHEL-DE-LANES,,,11359,,,,,,,,,,,,,,,,,,,2008-12-22,F,,,,,01.11Z,NAFRev2,N,,,0,,,,,,
408643609,00022,40864360900022,O,1997-07-15,NN,,,2019-11-14T14:00:18,true,6,,1,,IMP,DE LA TERRASSE,11410,SAINT-MICHEL-DE-LANES,,,11359,,,,,,,,,,,,,,,,,,,2014-01-28,A,,,,,47.99B,NAFRev2,N,1.759355,43.324373,0.85,housenumber,1 Impasse de la Terrasse 11410 Saint-Michel-de-Lanès,11359_0050_00001,G,1 IMPASSE DE LA TERRASSE,
408764520,00016,40876452000016,O,1996-09-01,NN,,,2019-11-14T14:00:18,true,3,,1,,RUE,DES MARRONNIERS,11410,SAINT-MICHEL-DE-LANES,,,11359,,,,,,,,,,,,,,,,,,,2008-01-01,A,,,,,68.20B,NAFRev2,N,1.75567,43.325379,0.77,housenumber,1 Allee des Marronniers 11410 Saint-Michel-de-Lanès,11359_0036_00001,G,1 ALLEE DES MARRONNIERS,
408786440,00011,40878644000011,O,1996-09-02,01,2019,5610CQ,2021-10-27T08:32:29,true,4,,1,,RUE,DES MARRONNIERS,11410,SAINT-MICHEL-DE-LANES,,,11359,,,,,,,,,,,,,,,,,,,2015-12-31,A,,,,,56.30Z,NAFRev2,N,1.75567,43.325379,0.77,housenumber,1 Allee des Marronniers 11410 Saint-Michel-de-Lanès,11359_0036_00001,G,1 ALLEE DES MARRONNIERS,
409173168,00017,40917316800017,O,1996-10-01,NN,,1012ZZ,2019-11-14T14:00:18,true,6,,,,,LE PLO,11410,SAINT-MICHEL-DE-LANES,,,11359,,,,,,,,,,,,,,,,,,,2013-06-30,F,,,,,10.12Z,NAFRev2,N,1.757711,43.334115,0.94,street,Le Plo 11410 Saint-Michel-de-Lanès,11359_09gwbh,G,LE PLO,
411691694,00011,41169169400011,O,1997-04-11,,,,2019-11-14T14:00:18,true,1,,6,,RTE,DE TOULOUSE,11410,SAINT-MICHEL-DE-LANES,,,11359,,,,,,,,,,,,,,,,,,,2000-06-30,F,,,,,15.8A,NAF1993,N,1.756317,43.323026,0.85,housenumber,6 Route de Toulouse 11410 Saint-Michel-de-Lanès,11359_0048_00006,G,6 ROUTE DE TOULOUSE,
413182494,00026,41318249400026,O,2003-07-01,NN,,,2019-11-14T14:00:18,false,5,L'AIROULE HAUT,,,RTE,DE GOURVIEILLE,11410,SAINT-MICHEL-DE-LANES,,,11359,,,,,,,,,,,,,,,,,,,2008-01-01,F,,,,,43.91B,NAFRev2,N,1.760918,43.327342,0.85,street,Route de Gourvieille 11410 Saint-Michel-de-Lanès,11359_0030,G,ROUTE DE GOURVIEILLE,
413704032,00015,41370403200015,O,1997-09-08,NN,,,2019-11-14T14:00:18,true,1,,,,,,11410,SAINT-MICHEL-DE-LANES,,,11359,,,,,,,,,,,,,,,,,,,2002-08-31,F,,,,,72.2Z,NAF1993,N,,,0,,,,,,
419700919,00014,41970091900014,O,1998-04-09,NN,,,2019-11-14T14:00:18,true,3,,,,,LE BOUISSE,11410,SAINT-MICHEL-DE-LANES,,,11359,,,,,,,,,,,,,,,,,,,2008-01-01,A,,,,,01.11Z,NAFRev2,N,1.742232,43.331483,0.6,street,La Bouisse 11410 Saint-Michel-de-Lanès,11359_5wt0wp,G,LA BOUISSE,
420153504,00014,42015350400014,O,1998-08-16,NN,,,2019-11-14T14:00:18,true,3,,,,,LA BOUISSE,11410,SAINT-MICHEL-DE-LANES,,,11359,,,,,,,,,,,,,,,,,,,2008-01-01,A,,,,,68.20B,NAFRev2,N,1.742232,43.331483,0.94,street,La Bouisse 11410 Saint-Michel-de-Lanès,11359_5wt0wp,G,LA BOUISSE,
423512052,00030,42351205200030,O,2004-01-02,NN,,,2019-11-14T14:00:18,false,3,1ER ETAGE,6,,RUE,DE LA FONTAINE,11410,SAINT-MICHEL-DE-LANES,,,11359,,,,,,,,,,,,,,,,,,,2005-04-12,F,RENOV ELEC,,,,45.3A,NAFRev1,N,1.758981,43.323231,0.94,housenumber,6 Rue de la Fontaine 11410 Saint-Michel-de-Lanès,11359_0027_00006,G,6 RUE DE LA FONTAINE,
423512052,00048,42351205200048,O,2005-04-12,,,,2019-11-14T14:00:18,false,2,DOMAINE LA PLANETE,,,,PAR SALLES SUR LHERS,11410,SAINT-MICHEL-DE-LANES,,,11359,,,,,,,,,,,,,,,,,,,2007-10-25,F,,,,,45.3A,NAFRev1,N,,,0,,,,,,
423512052,00055,42351205200055,O,2008-10-20,NN,,,2019-11-14T14:00:18,false,3,,,,DOM,LA PLANETE,11410,SAINT-MICHEL-DE-LANES,,,11359,,,,,,,,,,,,,,,,,,,2018-05-01,F,,,,,80.10Z,NAFRev2,O,,,0,,,,,,
423512052,00071,42351205200071,O,2022-01-04,,,,2022-06-04T04:09:21,false,1,,,,,LA PLANETE PARCELLE 362,11410,SAINT-MICHEL-DE-LANES,,,11359,,,,,,,,,,,,,,,,,,,2022-01-04,A,LA PLANETE,,,,01.49Z,NAFRev2,N,,,0,,,,,,
423773530,00013,42377353000013,O,1999-02-05,NN,,,2019-11-14T14:00:18,true,3,,,,,DOMAINE DE RIVALS,11410,SAINT-MICHEL-DE-LANES,,,11359,,,,,,,,,,,,,,,,,,,2008-01-01,A,,,,,01.11Z,NAFRev2,N,1.755221,43.311112,0.34,street,Les Rivals 11410 Saint-Michel-de-Lanès,11359_szcq4t,G,LES RIVALS,
423902584,00022,42390258400022,O,2022-03-21,,,,2022-05-23T09:30:54,true,1,LA JONQUIERE,,,RTE,DE GOURVIEILLE,11410,SAINT-MICHEL-DE-LANES,,,11359,,,,,,,,,,,,,,,,,,,2022-03-21,A,,,,,68.20B,NAFRev2,N,1.760918,43.327342,0.85,street,Route de Gourvieille 11410 Saint-Michel-de-Lanès,11359_0030,G,ROUTE DE GOURVIEILLE,
424361244,00017,42436124400017,O,1999-09-15,NN,,,2019-11-14T14:00:18,true,1,,14,,RTE,DE BELFLOU,11410,SAINT-MICHEL-DE-LANES,,,11359,,,,,,,,,,,,,,,,,,,2002-07-25,F,,,,,70.2C,NAF1993,N,1.757998,43.323263,0.61,street,Route de Belflou 11410 Saint-Michel-de-Lanès,11359_0011,G,ROUTE DE BELFLOU,
427580519,00010,42758051900010,O,1968-01-01,NN,,,2019-11-14T14:00:18,true,4,,,,,LA BRIQUETERIE,11410,SAINT-MICHEL-DE-LANES,,,11359,,,,,,,,,,,,,,,,,,,2008-01-01,A,,,,,01.11Z,NAFRev2,N,1.760126,43.326336,0.35,street,La Bergerie 11410 Saint-Michel-de-Lanès,11359_hho1ci,G,LA BERGERIE,
427580527,00013,42758052700013,O,1981-01-01,NN,,,2019-11-14T14:00:18,true,4,,,,,LE MOULIN,11410,SAINT-MICHEL-DE-LANES,,,11359,,,,,,,,,,,,,,,,,,,2013-08-03,F,,,,,01.11Z,NAFRev2,N,1.735712,43.32859,0.36,street,Le Soula 11410 Saint-Michel-de-Lanès,11359_ecaz5b,G,LE SOULA,
428668743,00019,42866874300019,O,1999-12-12,NN,,,2019-11-14T14:00:18,true,5,SAINT SAUVEUR,,,RTE,DES ALIX,11410,SAINT-MICHEL-DE-LANES,,,11359,,,,,,,,,,,,,,,,,,,2011-05-20,F,,,,,62.01Z,NAFRev2,N,1.758675,43.324299,0.35,street,Rue des Lilas 11410 Saint-Michel-de-Lanès,11359_0035,G,RUE DES LILAS,
429429129,00019,42942912900019,O,1991-05-24,NN,,,2019-11-14T14:00:18,true,3,,,,,LE SALTRE,11410,SAINT-MICHEL-DE-LANES,,,11359,,,,,,,,,,,,,,,,,,,2008-01-01,A,,,,,01.11Z,NAFRev2,N,1.761783,43.335828,0.94,street,Le Saltre 11410 Saint-Michel-de-Lanès,11359_b8qbb9,G,LE SALTRE,
430299214,00022,43029921400022,O,2009-01-01,01,2020,,2022-08-29T09:09:02,true,1,,,,,LES METAILLERES,11410,SAINT-MICHEL-DE-LANES,,,11359,,,,,,,,,,,,,,,,,,,2009-01-01,A,,,,,01.11Z,NAFRev2,N,1.740325,43.31138,0.94,street,Les Metailleres 11410 Saint-Michel-de-Lanès,11359_esk2x0,G,LES METAILLERES,
430758805,00013,43075880500013,O,1998-11-01,NN,,,2019-11-14T14:00:18,true,3,,,,,PECANY,11410,SAINT-MICHEL-DE-LANES,,,11359,,,,,,,,,,,,,,,,,,,2004-12-31,F,,,,,70.2B,NAFRev1,N,1.74689,43.336116,0.94,street,Pecany 11410 Saint-Michel-de-Lanès,11359_rv9x6j,G,PECANY,
431911163,00019,43191116300019,O,1990-01-01,,,,2019-11-14T14:00:18,true,3,,3,,PL,DE L'EGLISE,11410,SAINT-MICHEL-DE-LANES,,,11359,,,,,,,,,,,,,,,,,,,2008-01-01,A,,,,,68.20B,NAFRev2,N,1.759534,43.324759,0.86,housenumber,3 Place de l’Eglise 11410 Saint-Michel-de-Lanès,11359_0023_00003,G,3 PLACE DE L EGLISE,
432091536,00016,43209153600016,O,2000-07-05,NN,,,2019-11-14T14:00:18,false,3,,7,,RUE,DE L'EGLISE,11410,SAINT-MICHEL-DE-LANES,,,11359,,,,,,,,,,,,,,,,,,,2006-01-01,F,,,,,45.2U,NAFRev1,N,1.758904,43.324972,0.94,housenumber,7 Rue de l’Eglise 11410 Saint-Michel-de-Lanès,11359_0025_00007,G,7 RUE DE L EGLISE,
432955748,00012,43295574800012,O,2000-10-01,NN,,,2019-11-14T14:00:18,true,4,,,,,LA CROIX,11410,SAINT-MICHEL-DE-LANES,,,11359,,,,,,,,,,,,,,,,,,,2018-04-01,F,,,,,01.11Z,NAFRev2,N,1.733512,43.323309,0.94,street,La Croix 11410 Saint-Michel-de-Lanès,11359_r4vziv,G,LA CROIX,
432965242,00022,43296524200022,O,2008-09-01,,,,2019-11-14T14:00:18,true,4,,,,,NAURIOL BAS,11410,SAINT-MICHEL-DE-LANES,,,11359,,,,,,,,,,,,,,,,,,,2014-12-01,F,,,,,81.21Z,NAFRev2,O,1.750633,43.33533,0.94,street,Nauriol Bas 11410 Saint-Michel-de-Lanès,11359_B039,G,NAURIOL BAS,
433622115,00023,43362211500023,O,2005-01-03,NN,,,2019-11-14T14:00:18,false,2,,5,,RUE,DES MENUISIERS,11410,SAINT-MICHEL-DE-LANES,,,11359,,,,,,,,,,,,,,,,,,,2006-06-01,F,,,,,52.5Z,NAFRev1,N,1.758419,43.324283,0.95,housenumber,5 Rue des Menuisiers 11410 Saint-Michel-de-Lanès,11359_0037_00005,G,5 RUE DES MENUISIERS,
434299772,00021,43429977200021,O,2022-03-21,,,,2022-04-14T17:46:51,true,1,LA JONQUIERE,,,RTE,DE GOURVIEILLE,11410,SAINT-MICHEL-DE-LANES,,,11359,,,,,,,,,,,,,,,,,,,2022-03-21,A,,,,,68.20B,NAFRev2,N,1.760918,43.327342,0.85,street,Route de Gourvieille 11410 Saint-Michel-de-Lanès,11359_0030,G,ROUTE DE GOURVIEILLE,
442356481,00022,44235648100022,O,2012-01-09,02,2020,4399CZ,2022-08-29T09:18:26,true,2,,3,,RUE,DU CHATEAU D'EAU,11410,SAINT-MICHEL-DE-LANES,,,11359,,,,,,,,,,,,,,,,,,,2012-03-19,A,,,,BATITOUT,43.99C,NAFRev2,O,1.759403,43.324206,0.94,housenumber,3 Rue du Château d’Eau 11410 Saint-Michel-de-Lanès,11359_0017_00003,G,3 RUE DU CHATEAU D EAU,
448614974,00021,44861497400021,O,2022-03-21,,,,2022-04-14T17:48:14,true,1,LA JONQUIERE,,,RTE,DE GOURVIEILLE,11410,SAINT-MICHEL-DE-LANES,,,11359,,,,,,,,,,,,,,,,,,,2022-03-21,A,,,,,68.20B,NAFRev2,N,1.760918,43.327342,0.85,street,Route de Gourvieille 11410 Saint-Michel-de-Lanès,11359_0030,G,ROUTE DE GOURVIEILLE,
449564681,00012,44956468100012,O,2003-07-01,NN,,,2019-11-14T14:00:18,true,3,,,,DOM,LABADE,11410,SAINT-MICHEL-DE-LANES,,,11359,,,,,,,,,,,,,,,,,,,2008-01-01,A,,,,,01.11Z,NAFRev2,N,1.748771,43.323209,0.53,street,Labade 11410 Saint-Michel-de-Lanès,11359_c3jty7,G,LABADE,
450487269,00026,45048726900026,O,2014-07-19,,,,2021-02-23T13:33:18,true,1,,11,,RUE,DE L'EGLISE,11410,SAINT-MICHEL-DE-LANES,,,11359,,,,,,,,,,,,,,,,,,,2014-07-19,A,,,,,68.20B,NAFRev2,N,1.759469,43.325049,0.94,housenumber,11 Rue de l’Eglise 11410 Saint-Michel-de-Lanès,11359_0025_00011,G,11 RUE DE L EGLISE,
453472052,00019,45347205200019,O,2004-05-04,NN,,,2019-11-14T14:00:18,false,6,,10,,RTE,DE GOURVIEILLE,11410,SAINT-MICHEL-DE-LANES,,,11359,,,,,,,,,,,,,,,,,,,2013-04-10,F,,,,,23.70Z,NAFRev2,O,1.760103,43.327245,0.86,housenumber,10 Route de Gourvieille 11410 Saint-Michel-de-Lanès,11359_0030_00010,G,10 ROUTE DE GOURVIEILLE,
454012469,00010,45401246900010,O,2004-07-01,02,2020,4312BA,2022-08-29T09:09:55,true,6,,6,,RTE,DE MARQUEIN,11410,SAINT-MICHEL-DE-LANES,,,11359,,,,,,,,,,,,,,,,,,,2018-06-04,A,,,,,43.12A,NAFRev2,O,1.75525,43.319714,0.84,housenumber,6 Route de Marquein 11410 Saint-Michel-de-Lanès,11359_shgkhy_00006,G,6 ROUTE DE MARQUEIN,