siren,nic,siret,statutDiffusionEtablissement,dateCreationEtablissement,trancheEffectifsEtablissement,anneeEffectifsEtablissement,activitePrincipaleRegistreMetiersEtablissement,dateDernierTraitementEtablissement,etablissementSiege,nombrePeriodesEtablissement,complementAdresseEtablissement,numeroVoieEtablissement,indiceRepetitionEtablissement,typeVoieEtablissement,libelleVoieEtablissement,codePostalEtablissement,libelleCommuneEtablissement,libelleCommuneEtrangerEtablissement,distributionSpecialeEtablissement,codeCommuneEtablissement,codeCedexEtablissement,libelleCedexEtablissement,codePaysEtrangerEtablissement,libellePaysEtrangerEtablissement,complementAdresse2Etablissement,numeroVoie2Etablissement,indiceRepetition2Etablissement,typeVoie2Etablissement,libelleVoie2Etablissement,codePostal2Etablissement,libelleCommune2Etablissement,libelleCommuneEtranger2Etablissement,distributionSpeciale2Etablissement,codeCommune2Etablissement,codeCedex2Etablissement,libelleCedex2Etablissement,codePaysEtranger2Etablissement,libellePaysEtranger2Etablissement,dateDebut,etatAdministratifEtablissement,enseigne1Etablissement,enseigne2Etablissement,enseigne3Etablissement,denominationUsuelleEtablissement,activitePrincipaleEtablissement,nomenclatureActivitePrincipaleEtablissement,caractereEmployeurEtablissement,longitude,latitude,geo_score,geo_type,geo_adresse,geo_id,geo_ligne,geo_l4,geo_l5
069200210,02293,06920021002293,O,2020-04-01,03,2020,,2022-08-29T09:03:05,false,1,ESPACE OCEANIS,,,,ZA DE KERFOLIC,22220,MINIHY-TREGUIER,,,22152,,,,,,,,,,,,,,,,,,,2020-04-01,A,TGS FRANCE,,,TGS FRANCE,69.20Z,NAFRev2,O,-3.24487,48.77859,0.52,street,Kerfolic 22220 Minihy-Tréguier,22152_meg3wm,G,KERFOLIC,
077270098,00054,07727009800054,O,2000-05-10,NN,,,2019-11-14T14:00:24,true,5,,,,,KERFOLIC,22220,MINIHY-TREGUIER,,,22152,,,,,,,,,,,,,,,,,,,2011-06-28,F,,,,,47.78C,NAFRev2,N,-3.24487,48.77859,0.94,street,Kerfolic 22220 Minihy-Tréguier,22152_meg3wm,G,KERFOLIC,
200014611,00012,20001461100012,O,2008-02-22,NN,,,2019-11-14T14:00:24,true,3,COMM COM DES TROIS RIVIERES,,,,ZONE DE CONVENANT VRAZ,22220,MINIHY-TREGUIER,,,22152,,,,,,,,,,,,,,,,,,,2014-12-31,F,,,,,84.12Z,NAFRev2,O,,,0,,,,,,
200035699,00012,20003569900012,O,2013-01-01,NN,,,2019-11-14T14:00:24,true,2,ZONE D ACTIVITE DE CONVENANT - VRAZ,,,,,22220,MINIHY-TREGUIER,,,22152,,,,,,,,,,,,,,,,,,,2017-01-01,F,,,,,84.11Z,NAFRev2,O,,,0,,,,,,
200035699,00046,20003569900046,O,2013-01-01,NN,,,2019-11-14T14:00:24,false,2,ZONE D ACTIVITE DE CONVENANT - VRAZ,,,,,22220,MINIHY-TREGUIER,,,22152,,,,,,,,,,,,,,,,,,,2017-01-01,F,ASSAINISSEMENT,,,,37.00Z,NAFRev2,N,,,0,,,,,,
200035699,00053,20003569900053,O,2013-01-01,NN,,,2019-11-14T14:00:24,false,2,ZONE D ACTIVITE DE CONVENANT - VRAZ,,,,,22220,MINIHY-TREGUIER,,,22152,,,,,,,,,,,,,,,,,,,2017-01-01,F,SPANC,,,,84.12Z,NAFRev2,O,,,0,,,,,,
200035699,00103,20003569900103,O,2013-01-01,,,,2019-11-14T14:00:24,false,2,ZA DE KERFOLIC,,,,,22220,MINIHY-TREGUIER,,,22152,,,,,,,,,,,,,,,,,,,2017-01-01,F,MAISON DE L'ENFANCE,,,,88.91A,NAFRev2,N,-3.24487,48.77859,0.52,street,Kerfolic 22220 Minihy-Tréguier,22152_meg3wm,D,KERFOLIC,
212201529,00014,21220152900014,O,1983-03-01,03,2020,,2022-08-29T09:06:19,true,3,,15,,RUE,DU BOURG,22220,MINIHY-TREGUIER,,,22152,,,,,,,,,,,,,,,,,,,2008-01-01,A,MAIRIE,,,,84.11Z,NAFRev2,O,-3.228269,48.774739,0.79,street,Rue du Bourg 22220 Minihy-Tréguier,22152_0010,G,RUE DU BOURG,
212201529,00030,21220152900030,O,2000-12-25,NN,,,2019-11-14T14:00:24,false,3,MAIRIE,15,,RUE,DU BOURG,22220,MINIHY-TREGUIER,,,22152,,,,,,,,,,,,,,,,,,,2008-01-01,F,LOTISSEMENT TOSSEN-RUGUEL,,,,42.99Z,NAFRev2,N,-3.228269,48.774739,0.79,street,Rue du Bourg 22220 Minihy-Tréguier,22152_0010,G,RUE DU BOURG,
212201529,00048,21220152900048,O,2002-01-01,NN,,,2019-11-14T14:00:24,false,4,MAIRIE,15,,RUE,DU BOURG,22220,MINIHY-TREGUIER,,,22152,,,,,,,,,,,,,,,,,,,2009-07-24,F,LOTISSEMENT KERMARTIN,,,,42.99Z,NAFRev2,N,-3.228269,48.774739,0.79,street,Rue du Bourg 22220 Minihy-Tréguier,22152_0010,G,RUE DU BOURG,
242200194,00015,24220019400015,O,,NN,,,2019-11-14T14:00:24,true,1,,,,,,22220,MINIHY-TREGUIER,,,22152,,,,,,,,,,,,,,,,,,,1996-01-01,F,,,,,75.1A,NAF1993,O,,,0,,,,,,
242200830,00014,24220083000014,O,1996-01-01,NN,,,2019-11-14T14:00:24,false,4,,,,,ZA DE KERFOLIC,22220,MINIHY-TREGUIER,,,22152,,,,,,,,,,,,,,,,,,,2008-01-01,F,,,,,84.11Z,NAFRev2,O,-3.24487,48.77859,0.52,street,Kerfolic 22220 Minihy-Tréguier,22152_meg3wm,G,KERFOLIC,
242200830,00022,24220083000022,O,2000-12-25,NN,,,2019-11-14T14:00:24,false,3,,,,,ZA DE KERFOLIC,22220,MINIHY-TREGUIER,,,22152,,,,,,,,,,,,,,,,,,,2009-07-24,F,LOTISSEMENTS COMMUNAUX,,,,42.99Z,NAFRev2,N,-3.24487,48.77859,0.52,street,Kerfolic 22220 Minihy-Tréguier,22152_meg3wm,G,KERFOLIC,
242200830,00030,24220083000030,O,2000-12-25,NN,,,2019-11-14T14:00:24,false,3,,,,,ZONE DE CONVENANT VRAZ,22220,MINIHY-TREGUIER,,,22152,,,,,,,,,,,,,,,,,,,2012-12-31,F,ZONE ARTISANALE,,,,42.99Z,NAFRev2,N,,,0,,,,,,
242200830,00048,24220083000048,O,2000-12-25,NN,,,2019-11-14T14:00:24,false,3,,,,,ZONE DE CONVENANT VRAZ,22220,MINIHY-TREGUIER,,,22152,,,,,,,,,,,,,,,,,,,2012-12-31,F,ATELIER RELAIS,,,,68.20B,NAFRev2,N,,,0,,,,,,
242200830,00055,24220083000055,O,2002-12-05,NN,,,2019-11-14T14:00:24,false,4,,,,,ZA DE KERFOLIC,22220,MINIHY-TREGUIER,,,22152,,,,,,,,,,,,,,,,,,,2009-07-24,F,LOTISSEMENT KROAS ARBRABAN,,,,42.99Z,NAFRev2,N,-3.24487,48.77859,0.52,street,Kerfolic 22220 Minihy-Tréguier,22152_meg3wm,G,KERFOLIC,
242200830,00063,24220083000063,O,2002-12-05,NN,,,2019-11-14T14:00:24,false,4,,,,,ZA DE KERFOLIC,22220,MINIHY-TREGUIER,,,22152,,,,,,,,,,,,,,,,,,,2009-07-24,F,LOTISSEMENT CONVENANT VRAS,,,,42.99Z,NAFRev2,N,-3.24487,48.77859,0.52,street,Kerfolic 22220 Minihy-Tréguier,22152_meg3wm,G,KERFOLIC,
242200830,00071,24220083000071,O,2003-12-25,NN,,,2019-11-14T14:00:24,false,2,,,,,ZA KERFOLIC,22220,MINIHY-TREGUIER,,,22152,,,,,,,,,,,,,,,,,,,2008-01-01,F,ZONE ARTISANALE KERFOLIC 4,,,,42.99Z,NAFRev2,N,-3.24487,48.77859,0.73,street,Kerfolic 22220 Minihy-Tréguier,22152_meg3wm,G,KERFOLIC,
242200830,00089,24220083000089,O,2004-12-25,NN,,,2019-11-14T14:00:24,false,4,,,,,ZONE DE CONVENANT VRAZ,22220,MINIHY-TREGUIER,,,22152,,,,,,,,,,,,,,,,,,,2012-12-31,F,LOTISSEMENT,,,,42.99Z,NAFRev2,N,,,0,,,,,,
242200830,00097,24220083000097,O,2006-01-01,NN,,,2019-11-14T14:00:24,false,4,,,,,ZONE DE CONVENANT VRAZ,22220,MINIHY-TREGUIER,,,22152,,,,,,,,,,,,,,,,,,,2012-12-31,F,SPANC,,,,84.12Z,NAFRev2,O,,,0,,,,,,
242200830,00113,24220083000113,O,2004-12-27,NN,,,2019-11-14T14:00:24,true,2,,,,,ZONE DE CONVENANT VRAZ,22220,MINIHY-TREGUIER,,,22152,,,,,,,,,,,,,,,,,,,2012-12-31,F,,,,,84.11Z,NAFRev2,O,,,0,,,,,,
242200830,00139,24220083000139,O,2012-02-01,NN,,,2019-11-14T14:00:24,false,2,,,,,ZA DE KERFOLIC,22220,MINIHY-TREGUIER,,,22152,,,,,,,,,,,,,,,,,,,2012-12-31,F,MAISON DE L'ENFANCE,,,,88.91A,NAFRev2,N,-3.24487,48.77859,0.52,street,Kerfolic 22220 Minihy-Tréguier,22152_meg3wm,G,KERFOLIC,
252200498,00035,25220049800035,O,2001-12-25,NN,,,2020-10-29T03:49:58,false,4,,,,,ZA DE KERFOLIC,22220,MINIHY-TREGUIER,,,22152,,,,,,,,,,,,,,,,,,,2020-10-01,F,BUREAUX ADMINISTRATIFS,,,,36.00Z,NAFRev2,O,-3.24487,48.77859,0.52,street,Kerfolic 22220 Minihy-Tréguier,22152_meg3wm,G,KERFOLIC,
252200563,00028,25220056300028,O,2012-07-02,03,2019,,2021-10-27T08:12:02,true,2,ZA DE CONVENANT VRAZ,,,,,22220,MINIHY-TREGUIER,,,22152,,,,,,,,,,,,,,,,,,,2020-01-01,F,BUREAUX,,,,43.12A,NAFRev2,O,,,0,,,,,,
252202221,00013,25220222100013,O,1983-08-10,NN,,,2019-11-14T14:00:24,true,1,,,,,,22220,MINIHY-TREGUIER,,,22152,,,,,,,,,,,,,,,,,,,1995-12-25,F,,,,,90.0B,NAF1993,N,,,0,,,,,,
252203120,00016,25220312000016,O,1992-04-24,NN,,,2020-08-25T10:20:17,false,5,MAIRIE,15,,RUE,DU BOURG,22220,MINIHY-TREGUIER,,,22152,,,,,,,,,,,,,,,,,,,2018-03-26,F,,,,,84.11Z,NAFRev2,O,-3.228269,48.774739,0.79,street,Rue du Bourg 22220 Minihy-Tréguier,22152_0010,G,RUE DU BOURG,
252203450,00017,25220345000017,O,1999-04-21,NN,,,2019-11-14T14:00:24,true,4,,,,,ZA DE KERFOLIC,22220,MINIHY-TREGUIER,,,22152,,,,,,,,,,,,,,,,,,,2014-01-01,F,,,,,38.11Z,NAFRev2,O,-3.24487,48.77859,0.52,street,Kerfolic 22220 Minihy-Tréguier,22152_meg3wm,G,KERFOLIC,
262200066,00088,26220006600088,O,2011-04-26,22,2020,,2022-08-29T09:10:21,false,1,,,,,ZA DE KERFOLIC,22220,MINIHY-TREGUIER,,,22152,,,,,,,,,,,,,,,,,,,2011-04-26,A,EHPAD,,,,87.10A,NAFRev2,N,-3.24487,48.77859,0.52,street,Kerfolic 22220 Minihy-Tréguier,22152_meg3wm,G,KERFOLIC,
262203896,00010,26220389600010,O,1984-08-06,NN,,,2019-11-14T14:00:24,true,4,MAITRE,15,,RUE,DU BOURG,22220,MINIHY-TREGUIER,,,22152,,,,,,,,,,,,,,,,,,,2018-01-25,F,CCAS,,,,88.99B,NAFRev2,N,-3.228269,48.774739,0.79,street,Rue du Bourg 22220 Minihy-Tréguier,22152_0010,G,RUE DU BOURG,
292202207,00018,29220220700018,O,1986-12-17,NN,,,2019-11-14T14:00:24,true,4,MAIRIE,15,,RUE,DU BOURG,22220,MINIHY-TREGUIER,,,22152,,,,,,,,,,,,,,,,,,,2012-05-02,F,,,,,42.99Z,NAFRev2,N,-3.228269,48.774739,0.79,street,Rue du Bourg 22220 Minihy-Tréguier,22152_0010,G,RUE DU BOURG,
300032653,00028,30003265300028,O,1900-01-01,NN,,,2019-11-14T14:00:24,false,5,,,,,ZONE ARTISANALE,22220,MINIHY-TREGUIER,,,22152,,,,,,,,,,,,,,,,,,,2009-11-16,F,,,,,43.22B,NAFRev2,O,2.7640352,42.6301915,0.9,poi.retail,Zone Artisanale (Zone commerciale) Thuir,https://osm.org/way/191039530,G,,
300032653,00036,30003265300036,O,2009-11-17,02,2020,4322BB,2022-08-29T09:10:59,true,2,,28,,,ZA DE KERFOLIC,22220,MINIHY-TREGUIER,,,22152,,,,,,,,,,,,,,,,,,,2012-11-02,A,,,,,43.22A,NAFRev2,O,-3.24487,48.77859,0.52,street,Kerfolic 22220 Minihy-Tréguier,22152_meg3wm,G,KERFOLIC,
300197860,00012,30019786000012,O,,NN,,,2019-11-14T14:00:24,true,1,,,,LD,LE GUINDY,22220,MINIHY-TREGUIER,,,22152,,,,,,,,,,,,,,,,,,,1993-12-11,F,,,,,45.3A,NAF1993,N,-3.257008,48.781482,0.95,street,Le Guindy 22220 Minihy-Tréguier,22152_8tbn2d,G,LE GUINDY,
300944733,00017,30094473300017,O,,,,,2019-11-14T14:00:24,true,1,,,,LD,LANGAZOU,22220,MINIHY-TREGUIER,,,22152,,,,,,,,,,,,,,,,,,,1984-12-25,F,,,,,67.05,NAP,N,-3.243049,48.769647,0.93,street,Lieu Dit Langazou 22220 Minihy-Tréguier,22152_kn0i9e,G,LIEU DIT LANGAZOU,
302356241,00059,30235624100059,O,1900-01-01,NN,,,2019-11-14T14:00:24,false,3,,,,,ZI KERVENEC,22220,MINIHY-TREGUIER,,,22152,,,,,,,,,,,,,,,,,,,1996-12-25,F,,,,,15.8B,NAF1993,N,,,0,,,,,,
305047185,00031,30504718500031,O,,NN,,,2019-11-14T14:00:24,true,1,,,,,SAINT RENAUD,22220,MINIHY-TREGUIER,,,22152,,,,,,,,,,,,,,,,,,,1989-02-25,F,,,,,62.44,NAP,N,-3.254242,48.759311,0.93,street,Lieu Dit Saint Renaud 22220 Minihy-Tréguier,22152_B776,G,LIEU DIT SAINT RENAUD,
307321919,00010,30732191900010,O,1976-01-01,NN,,,2019-11-14T14:00:24,true,7,,,,,ZONE ARTISANALE KERFOLIC,22220,MINIHY-TREGUIER,,BP 53,22152,,,,,,,,,,,,,,,,,,,2009-03-31,F,,,,,42.11Z,NAFRev2,O,,,0,,,,,,
307367888,00020,30736788800020,O,1994-12-31,NN,,,2019-11-14T14:00:24,true,3,,,,,ZONE KERFOLIC,22220,MINIHY-TREGUIER,,,22152,,,,,,,,,,,,,,,,,,,2008-01-01,A,,,,,68.20B,NAFRev2,N,-3.24487,48.77859,0.57,street,Kerfolic 22220 Minihy-Tréguier,22152_meg3wm,G,KERFOLIC,
310658992,00022,31065899200022,O,1994-08-22,NN,,,2019-11-14T14:00:24,false,3,,,,,ZA DE KERFOLIC,22220,MINIHY-TREGUIER,,,22152,,,,,,,,,,,,,,,,,,,1995-12-25,F,,,,,70.2C,NAF1993,N,-3.24487,48.77859,0.52,street,Kerfolic 22220 Minihy-Tréguier,22152_meg3wm,G,KERFOLIC,
310660535,00025,31066053500025,O,1900-01-01,NN,,,2019-12-03T11:19:35,true,4,BOURG,5,,RTE,DE TRAOU MARTIN,22220,MINIHY-TREGUIER,,,22152,,,,,,,,,,,,,,,,,,,2019-01-01,A,,,,,68.20A,NAFRev2,N,-3.230552,48.773391,0.86,housenumber,5 Route de Traou Martin 22220 Minihy-Tréguier,22152_0058_00005,G,5 ROUTE DE TRAOU MARTIN,
310660691,00026,31066069100026,O,2006-12-02,,,,2019-11-14T14:00:24,true,1,,,,,TRAOUS WAS,22220,MINIHY-TREGUIER,,,22152,,,,,,,,,,,,,,,,,,,2006-12-02,F,,,,,93.0N,NAFRev1,N,,,0,,,,,,
310693460,00035,31069346000035,O,1993-10-01,NN,,,2019-11-14T14:00:24,true,4,,11,,,KERNEVEZ,22220,MINIHY-TREGUIER,,,22152,,,,,,,,,,,,,,,,,,,2013-02-28,F,,,,,43.34Z,NAFRev2,N,-3.253671,48.760917,0.92,street,Lieu Dit Kernevez 22220 Minihy-Tréguier,22152_v6gmny,G,LIEU DIT KERNEVEZ,
310829536,00013,31082953600013,O,1977-01-01,NN,,,2019-11-14T14:00:24,true,3,,,,,LE PONT NEUF,22220,MINIHY-TREGUIER,,,22152,,,,,,,,,,,,,,,,,,,2008-01-01,A,,,,,56.30Z,NAFRev2,N,-3.281012,48.77341,0.76,street,Pont Neuf 22220 Minihy-Tréguier,22152_B731,G,PONT NEUF,
311042089,00053,31104208900053,O,1990-07-01,,,,2019-11-14T14:00:24,false,4,,,,,ZA DE KERFOLIC,22220,MINIHY-TREGUIER,,,22152,,,,,,,,,,,,,,,,,,,1993-12-25,F,,,,,51.3S,NAF1993,N,-3.24487,48.77859,0.52,street,Kerfolic 22220 Minihy-Tréguier,22152_meg3wm,G,KERFOLIC,
312387368,00011,31238736800011,O,1978-01-01,NN,,,2019-11-14T14:00:24,true,1,,,,,LANGAZOU,22220,MINIHY-TREGUIER,,,22152,,,,,,,,,,,,,,,,,,,2000-12-31,F,,,,,55.3A,NAF1993,N,-3.243049,48.769647,0.93,street,Lieu Dit Langazou 22220 Minihy-Tréguier,22152_kn0i9e,G,LIEU DIT LANGAZOU,
313932923,00292,31393292300292,O,2013-11-05,,,,2019-11-14T14:00:24,false,1,,,,,ZA DE KERFOLIC SUD,22220,MINIHY-TREGUIER,,,22152,,,,,,,,,,,,,,,,,,,2013-11-05,A,,,,,69.20Z,NAFRev2,N,-3.24487,48.77859,0.41,street,Kerfolic 22220 Minihy-Tréguier,22152_meg3wm,G,KERFOLIC,
314822800,00038,31482280000038,O,2001-11-05,NN,,,2019-11-14T14:00:24,false,4,,,,,ZA DE KERFOLIC,22220,MINIHY-TREGUIER,,,22152,,,,,,,,,,,,,,,,,,,2008-01-01,F,,,,,43.32A,NAFRev2,N,-3.24487,48.77859,0.52,street,Kerfolic 22220 Minihy-Tréguier,22152_meg3wm,G,KERFOLIC,
316228147,00013,31622814700013,O,1979-01-01,NN,,,2019-11-14T14:00:24,true,4,,,,,LE KASTELL,22220,MINIHY-TREGUIER,,,22152,,,,,,,,,,,,,,,,,,,2007-06-11,F,,,,,55.1A,NAFRev1,O,-3.252546,48.777381,0.53,street,Le Castel 22220 Minihy-Tréguier,22152_pyd5u5,G,LE CASTEL,
316333558,00021,31633355800021,O,1994-08-17,NN,,,2019-11-14T14:00:24,true,3,,10,,,STE CATHERINE,22220,MINIHY-TREGUIER,,,22152,,,,,,,,,,,,,,,,,,,2005-06-02,F,,,,,85.1G,NAFRev1,N,-3.22332,48.778821,0.78,housenumber,10 Lieu Dit Sainte Catherine 22220 Minihy-Tréguier,22152_b777_00010,G,10 LIEU DIT SAINTE CATHERINE,
318230026,00011,31823002600011,O,1980-01-01,NN,,,2019-11-14T14:00:24,true,4,,,,LD,LE GUINDY,22220,MINIHY-TREGUIER,,,22152,,,,,,,,,,,,,,,,,,,2004-09-30,F,,,,,45.3C,NAFRev1,N,-3.257008,48.781482,0.95,street,Le Guindy 22220 Minihy-Tréguier,22152_8tbn2d,G,LE GUINDY,
319093845,00042,31909384500042,O,2011-08-31,,,,2021-02-23T10:43:30,true,1,,1,,,PONT LOSQUET,22220,MINIHY-TREGUIER,,,22152,,,,,,,,,,,,,,,,,,,2011-08-31,A,,,,,55.20Z,NAFRev2,N,-3.293008,48.760538,0.95,housenumber,1 Pont Losquet 22220 Minihy-Tréguier,22152_b730_00001,G,1 PONT LOSQUET,
319538534,00029,31953853400029,O,2007-07-23,11,2020,4520AB,2022-08-29T09:16:23,true,2,,,,,ZA DE KERFOLIC,22220,MINIHY-TREGUIER,,,22152,,,,,,,,,,,,,,,,,,,2008-01-01,A,,,,,45.20A,NAFRev2,O,-3.24487,48.77859,0.52,street,Kerfolic 22220 Minihy-Tréguier,22152_meg3wm,G,KERFOLIC,
319647772,00023,31964777200023,O,2022-01-31,,,,2022-03-05T12:54:47,true,1,ZA DE CONVENANT VRAZ,8,,RUE,GUSTAVE EIFFEL,22220,MINIHY-TREGUIER,,,22152,,,,,,,,,,,,,,,,,,,2022-01-31,A,,,,,01.47Z,NAFRev2,N,-3.249634,48.76506,0.95,housenumber,8 Rue Gustave Eiffel 22220 Minihy-Tréguier,22152_0028_00008,G,8 RUE GUSTAVE EIFFEL,
321074189,00010,32107418900010,O,,NN,,,2019-11-14T14:00:24,true,1,,,,,PONT LOSQUET,22220,MINIHY-TREGUIER,,,22152,,,,,,,,,,,,,,,,,,,1988-11-13,F,,,,,67.07,NAP,N,-3.292906,48.760832,0.95,street,Pont Losquet 22220 Minihy-Tréguier,22152_B730,G,PONT LOSQUET,
322126301,00033,32212630100033,O,1995-03-16,NN,,,2019-11-14T14:00:24,true,4,,,,,KERFOLIC,22220,MINIHY-TREGUIER,,,22152,,,,,,,,,,,,,,,,,,,2019-07-05,F,,,,,75.00Z,NAFRev2,N,-3.24487,48.77859,0.94,street,Kerfolic 22220 Minihy-Tréguier,22152_meg3wm,G,KERFOLIC,
322254251,00018,32225425100018,O,,NN,,,2019-11-14T14:00:24,true,1,,,,LD,MERDY BIAN,22220,MINIHY-TREGUIER,,,22152,,,,,,,,,,,,,,,,,,,1992-02-29,F,,,,,20.5A,NAF1993,N,-3.264861,48.779284,0.77,locality,Merdy Bihan 22220 Minihy-Tréguier,22152_B422,G,MERDY BIHAN,
322780966,00014,32278096600014,O,,,,,2019-11-14T14:00:24,true,1,,,,LD,BOUDILLEAU,22220,MINIHY-TREGUIER,,,22152,,,,,,,,,,,,,,,,,,,1984-12-25,F,,,,,67.01,NAP,N,-3.26009,48.756513,0.92,street,Lieu Dit Boudilleau 22220 Minihy-Tréguier,22152_uvevzo,G,LIEU DIT BOUDILLEAU,
323130187,00020,32313018700020,O,,NN,,,2019-11-14T14:00:24,true,1,,,,,BOURG,22220,MINIHY-TREGUIER,,,22152,,,,,,,,,,,,,,,,,,,,F,,,,,47.04,NAP,N,-3.228891,48.775342,0.92,street,Le Bourg 22220 Minihy-Tréguier,22152_r1gi3l,G,LE BOURG,
323178129,00025,32317812900025,O,1984-05-19,NN,,,2019-11-14T14:00:24,false,4,,,,LD,LA CORDERIE,22220,MINIHY-TREGUIER,,,22152,,,,,,,,,,,,,,,,,,,2006-11-06,F,PRESSING CORDONN ST MARC,,,,93.0B,NAFRev1,O,-3.24294,48.779351,0.95,street,La Corderie 22220 Minihy-Tréguier,22152_z8sip5,G,LA CORDERIE,
324582121,00012,32458212100012,O,,NN,,,2019-11-14T14:00:24,true,1,,,,RTE,DE LA ROCHE DERRIEN,22220,MINIHY-TREGUIER,,,22152,,,,,,,,,,,,,,,,,,,1987-06-18,F,,,,,79.06,NAP,N,-3.229578,48.777058,0.31,street,Rue de la Croix de Mission 22220 Minihy-Tréguier,22152_0021,G,RUE DE LA CROIX DE MISSION,
324793033,00014,32479303300014,O,1982-07-01,NN,,,2019-11-14T14:00:24,true,4,,,,,ZA DE KERFOLIC,22220,MINIHY-TREGUIER,,,22152,,,,,,,,,,,,,,,,,,,2003-06-30,F,,,,,70.2C,NAFRev1,N,-3.24487,48.77859,0.52,street,Kerfolic 22220 Minihy-Tréguier,22152_meg3wm,G,KERFOLIC,
324832583,00011,32483258300011,O,1982-06-02,NN,,,2019-11-14T14:00:24,false,3,,,,CHE,DE LA CORDERIE,22220,MINIHY-TREGUIER,,,22152,,,,,,,,,,,,,,,,,,,1992-06-26,F,,,,,70.2C,NAF1993,N,-3.24294,48.779351,0.57,street,La Corderie 22220 Minihy-Tréguier,22152_z8sip5,G,LA CORDERIE,
325893006,00016,32589300600016,O,1982-11-22,NN,,,2019-11-14T14:00:24,true,6,,,,,ZA KERFOLIC,22220,MINIHY-TREGUIER,,,22152,,,,,,,,,,,,,,,,,,,2013-09-02,F,,,,,43.99C,NAFRev2,N,-3.24487,48.77859,0.73,street,Kerfolic 22220 Minihy-Tréguier,22152_meg3wm,G,KERFOLIC,
326581659,00025,32658165900025,O,,NN,,,2019-11-14T14:00:24,true,1,,,,LD,CONVENANT LA MER,22220,MINIHY-TREGUIER,,,22152,,,,,,,,,,,,,,,,,,,,F,,,,,38.50,NAP,N,-3.238418,48.767349,0.94,street,Convenant la Mer 22220 Minihy-Tréguier,22152_k2xtzo,G,CONVENANT LA MER,
326581667,00028,32658166700028,O,2007-02-01,,,,2019-11-14T14:00:24,false,3,ESPACE OCEANIS,,,,ZA DE KERFOLIC,22220,MINIHY-TREGUIER,,,22152,,,,,,,,,,,,,,,,,,,2009-01-01,F,,,,,85.59B,NAFRev2,N,-3.24487,48.77859,0.52,street,Kerfolic 22220 Minihy-Tréguier,22152_meg3wm,G,KERFOLIC,
327753422,00010,32775342200010,O,1983-06-01,NN,,,2019-11-14T14:00:24,false,5,,,,CHE,DE LA CORDERIE,22220,MINIHY-TREGUIER,,,22152,,,,,,,,,,,,,,,,,,,2008-08-11,F,,,,,47.11D,NAFRev2,O,-3.24294,48.779351,0.57,street,La Corderie 22220 Minihy-Tréguier,22152_z8sip5,G,LA CORDERIE,
327753422,00028,32775342200028,O,2008-08-11,21,2020,,2022-08-29T09:19:59,true,1,,,,LD,ZONE ARTISANALE DE KERFOLIC,22220,MINIHY-TREGUIER,,,22152,,,,,,,,,,,,,,,,,,,2008-08-11,A,INTERMARCHE,,,,47.11D,NAFRev2,O,-2.6907056,47.5855468,0.78,poi.industrial,Zone Artisanale de Kerfontaine (Zone industrielle) Le Hézo,https://osm.org/way/295076004,G,,
328173034,00013,32817303400013,O,,,,,2019-11-14T14:00:24,true,1,,,,,KERMOAL,22220,MINIHY-TREGUIER,,,22152,,,,,,,,,,,,,,,,,,,1984-12-25,F,,,,,01.80,NAP,N,-3.273819,48.754933,0.94,street,Kermoal 22220 Minihy-Tréguier,22152_um8z6s,G,KERMOAL,
328541032,00038,32854103200038,O,2004-02-20,NN,,,2019-11-14T14:00:24,true,3,,,,LD,CONVENANT VRAS,22220,MINIHY-TREGUIER,,,22152,,,,,,,,,,,,,,,,,,,2007-06-02,F,,,,,52.4Z,NAFRev1,N,-3.23983,48.771559,0.49,street,Convenant Floch 22220 Minihy-Tréguier,22152_B112,G,CONVENANT FLOCH,
328562459,00011,32856245900011,O,,NN,,,2019-11-14T14:00:24,true,1,,,,,LE RHU,22220,MINIHY-TREGUIER,,,22152,,,,,,,,,,,,,,,,,,,1988-06-11,F,,,,,41.07,NAP,N,-3.273279,48.759867,0.49,street,Le Ru 22220 Minihy-Tréguier,22152_9a4qbt,G,LE RU,
328975420,00022,32897542000022,O,2006-08-30,,,,2019-11-14T14:00:24,false,2,,,,,ZA DE KERFOLIC,22220,MINIHY-TREGUIER,,,22152,,,,,,,,,,,,,,,,,,,2008-01-01,A,,,,,86.90A,NAFRev2,N,-3.24487,48.77859,0.52,street,Kerfolic 22220 Minihy-Tréguier,22152_meg3wm,G,KERFOLIC,
329094551,00010,32909455100010,O,1984-02-01,00,2020,,2022-08-29T09:20:43,true,5,,,,,LE QUILLIO,22220,MINIHY-TREGUIER,,,22152,,,,,,,,,,,,,,,,,,,2021-11-30,F,,,,,01.41Z,NAFRev2,O,-3.28095,48.766665,0.94,street,Le Quillio 22220 Minihy-Tréguier,22152_glc3mt,G,LE QUILLIO,
329338883,00526,32933888300526,O,2009-03-31,NN,,,2019-11-14T14:00:24,false,5,,,,,ZONE ARTISANALE DE KERFOLIC,22220,MINIHY-TREGUIER,,,22152,,,,,,,,,,,,,,,,,,,2015-01-01,F,CENTRE COLAS TREGUIER,,,,42.11Z,NAFRev2,N,-2.6907056,47.5855468,0.78,poi.industrial,Zone Artisanale de Kerfontaine (Zone industrielle) Le Hézo,https://osm.org/way/295076004,G,,
329352264,00033,32935226400033,O,2017-02-22,,,,2019-11-14T14:00:24,true,2,,1,,IMP,CONVENANT LA MER,22220,MINIHY-TREGUIER,,,22152,,,,,,,,,,,,,,,,,,,2018-12-31,F,,,,,86.90D,NAFRev2,N,-3.238696,48.767011,0.77,street,Impasse de Convenant la Mer 22220 Minihy-Tréguier,22152_0018,G,IMPASSE DE CONVENANT LA MER,
329520332,00126,32952033200126,O,2012-12-14,NN,,,2019-11-14T14:00:24,false,3,,,,,LA CORDERIE,22220,MINIHY-TREGUIER,,,22152,,,,,,,,,,,,,,,,,,,2014-03-31,F,BREIZH DEBARRAS:BREIZH RECYCLAGE,,,,47.79Z,NAFRev2,O,-3.24294,48.779351,0.95,street,La Corderie 22220 Minihy-Tréguier,22152_z8sip5,G,LA CORDERIE,
329701221,00023,32970122100023,O,2000-05-01,NN,,,2019-11-14T14:00:24,false,4,,,,,ZA DE KERFOLIC,22220,MINIHY-TREGUIER,,,22152,,,,,,,,,,,,,,,,,,,2011-06-30,F,,,,,68.20B,NAFRev2,N,-3.24487,48.77859,0.52,street,Kerfolic 22220 Minihy-Tréguier,22152_meg3wm,G,KERFOLIC,
330874843,00015,33087484300015,O,,NN,,,2019-11-14T14:00:24,true,1,,,,,CHATEAU DU BILO,22220,MINIHY-TREGUIER,,,22152,,,,,,,,,,,,,,,,,,,1988-07-22,F,,,,,67.08,NAP,N,-3.246296,48.785241,0.94,street,Château du Bilo 22220 Minihy-Tréguier,22152_u5xm9g,G,CHATEAU DU BILO,
330886615,00047,33088661500047,O,2011-08-17,NN,,,2019-11-14T14:00:24,true,3,,,,,Z.A. DE KERFOLIC,22220,MINIHY-TREGUIER,,,22152,,,,,,,,,,,,,,,,,,,2015-03-28,F,,,,,56.10A,NAFRev2,O,-3.24487,48.77859,0.49,street,Kerfolic 22220 Minihy-Tréguier,22152_meg3wm,G,KERFOLIC,
331792408,00030,33179240800030,O,1989-12-21,NN,,,2019-11-14T14:00:24,true,4,,,,,ZA CONVENANT BRAS,22220,MINIHY-TREGUIER,,,22152,,,,,,,,,,,,,,,,,,,2009-11-14,F,,,,,68.20B,NAFRev2,N,,,0,,,,,,
332123116,00029,33212311600029,O,2002-11-15,NN,,,2019-11-14T14:00:24,true,5,,,,,CONVENANT QUELLEC,22220,MINIHY-TREGUIER,,,22152,,,,,,,,,,,,,,,,,,,2009-11-02,F,,,,,25.62B,NAFRev2,N,-3.242987,48.765383,0.94,street,Convenant Quellec 22220 Minihy-Tréguier,22152_B118,G,CONVENANT QUELLEC,
333052587,00016,33305258700016,O,1985-07-02,NN,,,2019-11-14T14:00:24,true,1,,,,,KERELLO,22220,MINIHY-TREGUIER,,,22152,,,,,,,,,,,,,,,,,,,1999-12-20,F,,,,,45.4C,NAF1993,O,-3.253112,48.779648,0.94,street,Kerello 22220 Minihy-Tréguier,22152_ufwson,G,KERELLO,
333309474,00018,33330947400018,O,1985-08-01,NN,,,2019-11-14T14:00:24,true,1,,,,LD,ST RENAUD,22220,MINIHY-TREGUIER,,,22152,,,,,,,,,,,,,,,,,,,2000-03-01,F,,,,,70.2C,NAF1993,N,-3.254242,48.759311,0.75,street,Lieu Dit Saint Renaud 22220 Minihy-Tréguier,22152_B776,G,LIEU DIT SAINT RENAUD,
333367662,00017,33336766200017,O,,,,,2019-11-14T14:00:24,true,1,,,,LD,LA CROIX DE MISSION,22220,MINIHY-TREGUIER,,,22152,,,,,,,,,,,,,,,,,,,1997-03-31,F,,,,,60.2E,NAF1993,N,-3.229578,48.777058,0.94,street,Rue de la Croix de Mission 22220 Minihy-Tréguier,22152_0021,G,RUE DE LA CROIX DE MISSION,
333554418,00082,33355441800082,O,1997-10-01,NN,,,2019-11-14T14:00:24,true,4,,,,,ZI DE CONVENANT VRAS,22220,MINIHY-TREGUIER,,,22152,,,,,,,,,,,,,,,,,,,2007-06-12,F,,,,,63.1E,NAFRev1,N,,,0,,,,,,
333633642,00025,33363364200025,O,1998-09-30,NN,,,2019-11-14T14:00:24,true,3,ZA DE KERFOLLIC,,,,LA CORDERIE,22220,MINIHY-TREGUIER,,,22152,,,,,,,,,,,,,,,,,,,2004-04-28,F,,,,,20.5A,NAFRev1,O,-3.24294,48.779351,0.95,street,La Corderie 22220 Minihy-Tréguier,22152_z8sip5,G,LA CORDERIE,
333958148,00012,33395814800012,O,1985-10-16,NN,,4520AB,2020-01-07T19:34:00,true,6,,,,,LA CORDERIE,22220,MINIHY-TREGUIER,,,22152,,,,,,,,,,,,,,,,,,,2019-12-31,F,,,,,45.11Z,NAFRev2,N,-3.24294,48.779351,0.95,street,La Corderie 22220 Minihy-Tréguier,22152_z8sip5,G,LA CORDERIE,