siren,nic,siret,statutDiffusionEtablissement,dateCreationEtablissement,trancheEffectifsEtablissement,anneeEffectifsEtablissement,activitePrincipaleRegistreMetiersEtablissement,dateDernierTraitementEtablissement,etablissementSiege,nombrePeriodesEtablissement,complementAdresseEtablissement,numeroVoieEtablissement,indiceRepetitionEtablissement,typeVoieEtablissement,libelleVoieEtablissement,codePostalEtablissement,libelleCommuneEtablissement,libelleCommuneEtrangerEtablissement,distributionSpecialeEtablissement,codeCommuneEtablissement,codeCedexEtablissement,libelleCedexEtablissement,codePaysEtrangerEtablissement,libellePaysEtrangerEtablissement,complementAdresse2Etablissement,numeroVoie2Etablissement,indiceRepetition2Etablissement,typeVoie2Etablissement,libelleVoie2Etablissement,codePostal2Etablissement,libelleCommune2Etablissement,libelleCommuneEtranger2Etablissement,distributionSpeciale2Etablissement,codeCommune2Etablissement,codeCedex2Etablissement,libelleCedex2Etablissement,codePaysEtranger2Etablissement,libellePaysEtranger2Etablissement,dateDebut,etatAdministratifEtablissement,enseigne1Etablissement,enseigne2Etablissement,enseigne3Etablissement,denominationUsuelleEtablissement,activitePrincipaleEtablissement,nomenclatureActivitePrincipaleEtablissement,caractereEmployeurEtablissement,longitude,latitude,geo_score,geo_type,geo_adresse,geo_id,geo_ligne,geo_l4,geo_l5
311037675,00015,31103767500015,O,,NN,,,,true,1,,,,,,24510,SAINT LAURENT DES BATONS,,,24435,,,,,,,,,,,,,,,,,,,1994-08-05,F,,,,,45.2V,NAF1993,N,,,0,,,,,,
329429567,00012,32942956700012,O,,NN,,,,true,1,,,,,AU BOURG,24510,SAINT LAURENT DES BATONS,,,24435,,,,,,,,,,,,,,,,,,,1990-12-31,F,,,,,67.01,NAP,N,0.769822,44.96929,0.72,street,Route de la Diligence (Saint-Laurent-des-Bâtons) 24510 Val de Louyre et Caudeau,24362_5bxjtt,G,ROUTE DE LA DILIGENCE,SAINT LAURENT DES BATONS
340802081,00018,34080208100018,O,,NN,,,,true,1,,,,,COURTEILLE,24510,SAINT LAURENT DES BATONS,,,24435,,,,,,,,,,,,,,,,,,,1991-06-01,F,,,,,77.03,NAP,N,0.716156,44.954418,0.35,street,Chemin des Courteilles 24510 Val de Louyre et Caudeau,24362_klwnvl,G,CHEMIN DES COURTEILLES,
347931826,00015,34793182600015,O,,,,,,true,1,,,,,PESQUEILLE,24510,SAINT LAURENT DES BATONS,,,24435,,,,,,,,,,,,,,,,,,,1991-10-15,F,,,,,01.00,NAP,N,0.732274,44.954087,0.33,street,Chemin de Pesqueille 24510 Val de Louyre et Caudeau,24362_n3bmir,G,CHEMIN DE PESQUEILLE,
399017342,00011,39901734200011,O,,NN,,,,true,1,,,,,,24510,SAINT LAURENT DES BATONS,,,24435,,,,,,,,,,,,,,,,,,,1995-06-30,F,,,,,85.1G,NAF1993,N,,,0,,,,,,
404605396,00013,40460539600013,O,1982-01-01,NN,,,,true,1,,,,,LES ROUCHELOUX,24510,SAINT LAURENT DES BATONS,,,24435,,,,,,,,,,,,,,,,,,,2002-11-10,F,,,,,01.3Z,NAF1993,N,0.736619,44.96248,0.36,street,Chemin des Roucheloux 24510 Val de Louyre et Caudeau,24362_4pvyer,G,CHEMIN DES ROUCHELOUX,
408358216,00013,40835821600013,O,1982-01-01,NN,,,,true,1,,,,,CANTELAUBE,24510,SAINT LAURENT DES BATONS,,,24435,,,,,,,,,,,,,,,,,,,2002-03-31,F,,,,,01.3Z,NAF1993,N,0.769822,44.96929,0.72,street,Route de la Diligence (Saint-Laurent-des-Bâtons) 24510 Val de Louyre et Caudeau,24362_5bxjtt,G,ROUTE DE LA DILIGENCE,SAINT LAURENT DES BATONS
411574494,00018,41157449400018,O,,,,,,true,1,,,,,,24510,SAINT LAURENT DES BATONS,,,24435,,,,,,,,,,,,,,,,,,,1996-12-31,F,,,,,01.1G,NAF1993,N,,,0,,,,,,
556710804,00015,55671080400015,O,,,,,,true,1,,,,,BOURG,24510,SAINT LAURENT DES BATONS,,,24435,,,,,,,,,,,,,,,,,,,1984-12-25,F,,,,,67.05,NAP,N,0.769822,44.96929,0.76,street,Route de la Diligence (Saint-Laurent-des-Bâtons) 24510 Val de Louyre et Caudeau,24362_5bxjtt,G,ROUTE DE LA DILIGENCE,SAINT LAURENT DES BATONS
557020179,00015,55702017900015,O,,,,,,true,1,,,,,,24510,SAINT LAURENT DES BATONS,,,24435,,,,,,,,,,,,,,,,,,,1993-12-31,F,,,,,01.1A,NAF1993,N,,,0,,,,,,
602039091,00023,60203909100023,O,,,,,,true,1,,,,,COURTEILLES,24510,SAINT LAURENT DES BATONS,,,24435,,,,,,,,,,,,,,,,,,,1986-10-20,F,,,,,80.04,NAP,N,0.716156,44.954418,0.37,street,Chemin des Courteilles 24510 Val de Louyre et Caudeau,24362_klwnvl,G,CHEMIN DES COURTEILLES,
781720438,00014,78172043800014,O,,,,,,true,1,,,,,,24510,SAINT LAURENT DES BATONS,,,24435,,,,,,,,,,,,,,,,,,,1993-12-31,F,,,,,01.2C,NAF1993,N,,,0,,,,,,
781720461,00016,78172046100016,O,,NN,,,,true,1,,,,,,24510,SAINT LAURENT DES BATONS,,,24435,,,,,,,,,,,,,,,,,,,1989-02-28,F,,,,,69.22,NAP,N,,,0,,,,,,
781720495,00014,78172049500014,O,,NN,,,,true,1,,,,,,24510,SAINT LAURENT DES BATONS,,,24435,,,,,,,,,,,,,,,,,,,,F,,,,,97.22,NAP,N,,,0,,,,,,
781724042,00028,78172404200028,O,,NN,,,,true,1,,,,,TABLE DU ROI,24510,SAINT LAURENT DES BATONS,,,24435,,,,,,,,,,,,,,,,,,,1996-12-31,F,,,,,45.4D,NAF1993,O,0.718628,44.966019,0.35,street,Route de la Table du Roi 24510 Val de Louyre et Caudeau,24362_zgdhsg,G,ROUTE DE LA TABLE DU ROI,
