siren,nic,siret,statutDiffusionEtablissement,dateCreationEtablissement,trancheEffectifsEtablissement,anneeEffectifsEtablissement,activitePrincipaleRegistreMetiersEtablissement,dateDernierTraitementEtablissement,etablissementSiege,nombrePeriodesEtablissement,complementAdresseEtablissement,numeroVoieEtablissement,indiceRepetitionEtablissement,typeVoieEtablissement,libelleVoieEtablissement,codePostalEtablissement,libelleCommuneEtablissement,libelleCommuneEtrangerEtablissement,distributionSpecialeEtablissement,codeCommuneEtablissement,codeCedexEtablissement,libelleCedexEtablissement,codePaysEtrangerEtablissement,libellePaysEtrangerEtablissement,complementAdresse2Etablissement,numeroVoie2Etablissement,indiceRepetition2Etablissement,typeVoie2Etablissement,libelleVoie2Etablissement,codePostal2Etablissement,libelleCommune2Etablissement,libelleCommuneEtranger2Etablissement,distributionSpeciale2Etablissement,codeCommune2Etablissement,codeCedex2Etablissement,libelleCedex2Etablissement,codePaysEtranger2Etablissement,libellePaysEtranger2Etablissement,dateDebut,etatAdministratifEtablissement,enseigne1Etablissement,enseigne2Etablissement,enseigne3Etablissement,denominationUsuelleEtablissement,activitePrincipaleEtablissement,nomenclatureActivitePrincipaleEtablissement,caractereEmployeurEtablissement,longitude,latitude,geo_score,geo_type,geo_adresse,geo_id,geo_ligne,geo_l4,geo_l5
212706824,00019,21270682400019,O,1983-03-01,03,2020,,2022-08-29T09:06:36,true,4,,1,,PL,CARROUGE,27870,VESLY,,,27682,,,,,,,,,,,,,,,,,,,2008-01-01,A,MAIRIE,,,,84.11Z,NAFRev2,O,1.652162,49.240128,0.81,housenumber,1 Place du Carrouge 27870 Vesly,27682_0011_00001,G,1 PLACE DU CARROUGE,
212706824,00027,21270682400027,O,1983-12-21,03,2020,,2022-08-29T09:06:36,false,3,,1,,PL,DU CARROUGE,27870,VESLY,,,27682,,,,,,,,,,,,,,,,,,,2008-01-01,A,ECOLE PRIMAIRE PUBLIQUE,,,,85.20Z,NAFRev2,N,1.652162,49.240128,0.84,housenumber,1 Place du Carrouge 27870 Vesly,27682_0011_00001,G,1 PLACE DU CARROUGE,
212706824,00035,21270682400035,O,2002-01-17,NN,,,2009-01-30T10:35:22,false,4,MAIRIE,1,,PL,CARROUGE,27870,VESLY,,,27682,,,,,,,,,,,,,,,,,,,2008-11-06,F,SERVICE D'ASSAINISSEMENT,,,,37.00Z,NAFRev2,N,1.652162,49.240128,0.81,housenumber,1 Place du Carrouge 27870 Vesly,27682_0011_00001,G,1 PLACE DU CARROUGE,
212706824,00043,21270682400043,O,2003-12-11,NN,,,2009-01-30T10:36:52,false,4,MAIRIE,1,,PL,CARROUGE,27870,VESLY,,,27682,,,,,,,,,,,,,,,,,,,2008-11-06,F,LOTISSEMENT LA MOLIERE,,,,42.99Z,NAFRev2,N,1.652162,49.240128,0.81,housenumber,1 Place du Carrouge 27870 Vesly,27682_0011_00001,G,1 PLACE DU CARROUGE,
252702881,00027,25270288100027,O,1985-01-19,11,2020,,2022-08-29T09:09:57,true,5,MAIRIE,1,,PL,DU CARROUGE,27870,VESLY,,,27682,,,,,,,,,,,,,,,,,,,2018-10-22,A,,,,,84.11Z,NAFRev2,O,1.652162,49.240128,0.84,housenumber,1 Place du Carrouge 27870 Vesly,27682_0011_00001,G,1 PLACE DU CARROUGE,
262707300,00014,26270730000014,O,1995-12-25,,,,2022-08-22T08:35:51,true,3,MAIRIE,1,,PL,CARROUGE,27870,VESLY,,,27682,,,,,,,,,,,,,,,,,,,2020-12-01,F,CCAS,,,,88.99B,NAFRev2,N,1.652162,49.240128,0.81,housenumber,1 Place du Carrouge 27870 Vesly,27682_0011_00001,G,1 PLACE DU CARROUGE,
292700119,00012,29270011900012,O,1983-12-19,NN,,,2008-01-04T19:06:17,true,3,MAIRIE,1,,PL,CARROUGE,27870,VESLY,,,27682,,,,,,,,,,,,,,,,,,,2008-01-01,A,,,,,42.99Z,NAFRev2,N,1.652162,49.240128,0.81,housenumber,1 Place du Carrouge 27870 Vesly,27682_0011_00001,G,1 PLACE DU CARROUGE,
301327920,00031,30132792000031,O,,NN,,,,true,1,,22,,RUE,DE L EGLISE,27870,VESLY,,,27682,,,,,,,,,,,,,,,,,,,1996-12-26,F,,,,,52.4J,NAF1993,O,1.656702,49.239422,0.95,housenumber,22 Rue de l’Eglise 27870 Vesly,27682_0020_00022,G,22 RUE DE L EGLISE,
301819769,00011,30181976900011,O,,NN,,,,true,1,,,,RUE,DE L'ORMETEL,27870,VESLY,,,27682,,,,,,,,,,,,,,,,,,,1990-01-01,F,,,,,60.07,NAP,N,1.653059,49.241792,0.95,street,Rue de l’Ormetel 27870 Vesly,27682_0069,G,RUE DE L ORMETEL,
304578214,00047,30457821400047,O,2004-09-30,NN,,2562BZ,2016-04-26T01:46:27,true,4,,14,,,GRANDE RUE,27870,VESLY,,,27682,,,,,,,,,,,,,,,,,,,2014-03-06,F,,,,,25.62B,NAFRev2,O,1.653133,49.243591,0.95,housenumber,14 Grande Rue 27870 Vesly,27682_0030_00014,G,14 GRANDE RUE,
306399130,00013,30639913000013,O,1976-01-01,NN,,,2011-09-15T08:46:09,false,4,,,,RUE,DU MONTPINCON,27870,VESLY,,,27682,,,,,,,,,,,,,,,,,,,2003-03-31,F,,,,,45.2V,NAFRev1,O,1.659309,49.244114,0.85,street,Rue du Mont Pincon 27870 Vesly,27682_0062,G,RUE DU MONT PINCON,
307635300,00014,30763530000014,O,,,,,,true,1,,,,,,27870,VESLY,,,27682,,,,,,,,,,,,,,,,,,,1984-12-25,F,,,,,55.60,NAP,N,,,0,,,,,,
311351126,00025,31135112600025,O,,,,,,true,1,,,,RTE,DE SAINT CLAIR SUR EPTE,27870,VESLY,,,27682,,,,,,,,,,,,,,,,,,,1984-12-25,F,,,,,50.04,NAP,N,1.6808324,49.2099341,0.83,poi.place_of_worship,Ermitage de Saint-Clair (Lieu de culte) Saint-Clair-sur-Epte,https://osm.org/way/422701797,G,,
313674269,00011,31367426900011,O,1964-01-01,NN,,,2015-05-14T04:44:17,true,4,,3,,RUE,DE L EGLISE,27870,VESLY,,,27682,,,,,,,,,,,,,,,,,,,2013-03-31,F,,,,,10.71C,NAFRev2,O,1.654484,49.240924,0.95,housenumber,3 Rue de l’Eglise 27870 Vesly,27682_0020_00003,G,3 RUE DE L EGLISE,
319187746,00023,31918774600023,O,,NN,,,,true,1,,,,RTE,DE ST CLAIR SUR EPTE,27870,VESLY,,,27682,,,,,,,,,,,,,,,,,,,,F,,,,,55.70,NAP,N,1.6808324,49.2099341,0.75,poi.place_of_worship,Ermitage de Saint-Clair (Lieu de culte) Saint-Clair-sur-Epte,https://osm.org/way/422701797,G,,
320302920,00022,32030292000022,O,,NN,,,,true,1,,,,RUE,DU MONT PINCON,27870,VESLY,,,27682,,,,,,,,,,,,,,,,,,,1990-12-31,F,,,,,86.08,NAP,N,1.659309,49.244114,0.95,street,Rue du Mont Pincon 27870 Vesly,27682_0062,G,RUE DU MONT PINCON,
320366974,00022,32036697400022,O,,,,,,true,1,,,,RUE,DE L'EGLISE,27870,VESLY,,,27682,,,,,,,,,,,,,,,,,,,1992-10-31,F,,,,,33.1B,NAF1993,N,1.655918,49.239859,0.95,street,Rue de l’Eglise 27870 Vesly,27682_0020,G,RUE DE L EGLISE,
321506362,00011,32150636200011,O,1981-01-02,NN,,,,true,1,,,,RUE,DE L EGLISE,27870,VESLY,,,27682,,,,,,,,,,,,,,,,,,,1998-07-31,F,,,,,85.1C,NAF1993,N,1.655918,49.239859,0.95,street,Rue de l’Eglise 27870 Vesly,27682_0020,G,RUE DE L EGLISE,
321910366,00012,32191036600012,O,,NN,,,,true,1,,,,,GRANDE RUE,27870,VESLY,,,27682,,,,,,,,,,,,,,,,,,,1991-06-30,F,,,,,67.01,NAP,N,1.653637,49.243898,0.95,street,Grande Rue 27870 Vesly,27682_0030,G,GRANDE RUE,
322154881,00013,32215488100013,O,,,,,,true,1,,,,RTE,DE ST CLAIR SUR EPTE,27870,VESLY,,,27682,,,,,,,,,,,,,,,,,,,1984-12-25,F,,,,,55.70,NAP,N,1.6808324,49.2099341,0.75,poi.place_of_worship,Ermitage de Saint-Clair (Lieu de culte) Saint-Clair-sur-Epte,https://osm.org/way/422701797,G,,
322931338,00014,32293133800014,O,1981-10-12,NN,,,,true,3,,5,,RUE,DE L EGLISE,27870,VESLY,,,27682,,,,,,,,,,,,,,,,,,,1992-12-25,F,,,,,60.2L,NAF1993,N,1.654762,49.240791,0.95,housenumber,5 Rue de l’Eglise 27870 Vesly,27682_0020_00005,G,5 RUE DE L EGLISE,
325309458,00017,32530945800017,O,,NN,,,,true,1,,,,RUE,PRINCIPALE,27870,VESLY,,,27682,,,,,,,,,,,,,,,,,,,,F,,,,,67.05,NAP,N,1.651546,49.24038,0.31,street,Rue du Prieuré 27870 Vesly,27682_0075,G,RUE DU PRIEURE,
328516885,00014,32851688500014,O,,NN,,,,true,1,,,,RUE,DU MONT PINSON,27870,VESLY,,,27682,,,,,,,,,,,,,,,,,,,1989-03-01,F,,,,,57.11,NAP,N,1.659309,49.244114,0.81,street,Rue du Mont Pincon 27870 Vesly,27682_0062,G,RUE DU MONT PINCON,
329356950,00025,32935695000025,O,,NN,,,,true,1,,10,,RUE,DU TAILLIS,27870,VESLY,,,27682,,,,,,,,,,,,,,,,,,,1993-10-31,F,,,,,45.4J,NAF1993,N,1.65441,49.242151,0.95,housenumber,10 Rue du Taillis 27870 Vesly,27682_0100_00010,G,10 RUE DU TAILLIS,
329640932,00029,32964093200029,O,1989-09-01,NN,,,2020-08-25T10:33:56,true,5,,10,,RTE,DE GISORS,27870,VESLY,,,27682,,,,,,,,,,,,,,,,,,,2018-01-02,A,,,,,77.39Z,NAFRev2,O,1.655379,49.240285,0.34,housenumber,10 Rue de l’Eglise 27870 Vesly,27682_0020_00010,G,10 RUE DE L EGLISE,
333616704,00016,33361670400016,O,1985-08-01,NN,,,2017-05-04T04:45:55,true,5,,,,,GRANDE RUE,27870,VESLY,,,27682,,,,,,,,,,,,,,,,,,,2015-07-01,F,,,,,56.30Z,NAFRev2,O,1.653637,49.243898,0.95,street,Grande Rue 27870 Vesly,27682_0030,G,GRANDE RUE,
338373384,00019,33837338400019,O,1900-01-01,NN,,,2011-04-28T00:30:50,false,4,,,,RUE,DU CLOS DU DECRET,27870,VESLY,,,27682,,,,,,,,,,,,,,,,,,,1987-12-25,F,,,,,62.41,NAP,N,1.649439,49.241879,0.95,street,Rue du Clos du Décret 27870 Vesly,27682_0012,G,RUE DU CLOS DU DECRET,
338373384,00027,33837338400027,O,2009-06-15,,,,2016-01-12T00:12:22,true,1,,,,,41 GRANDE RUE,27870,VESLY,,,27682,,,,,,,,,,,,,,,,,,,2009-06-15,A,,,,,81.30Z,NAFRev2,N,1.651628,49.242157,0.95,housenumber,41 Grande Rue 27870 Vesly,27682_0030_00041,G,41 GRANDE RUE,
339217929,00019,33921792900019,O,1986-06-07,NN,,,2018-09-29T12:31:42,true,5,,,,,LE MANOIR,27870,VESLY,,,27682,,,,,,,,,,,,,,,,,,,2015-12-31,A,,,,,68.20A,NAFRev2,N,,,0,,,,,,
339289167,00027,33928916700027,O,1987-09-01,NN,,,2014-06-14T03:15:14,false,5,,,,PL,DU CARROUGE,27870,VESLY,,,27682,,,,,,,,,,,,,,,,,,,2012-05-31,F,,,,,82.92Z,NAFRev2,O,1.653051,49.240608,0.82,street,Place du Carrouge 27870 Vesly,27682_0011,G,PLACE DU CARROUGE,
339559767,00019,33955976700019,O,,NN,,,,true,1,,,,,LA CHARTREUSE,27870,VESLY,,,27682,,,,,,,,,,,,,,,,,,,1991-12-02,F,,,,,57.01,NAP,N,2.0352409,44.3445992,0.9,poi.school,École La Chartreuse Villefranche-de-Rouergue,https://osm.org/node/3258326228,G,,
339836306,00011,33983630600011,O,,NN,,,,true,1,,23,,RUE,DU TAILLIS,27870,VESLY,,,27682,,,,,,,,,,,,,,,,,,,1988-02-08,F,,,,,62.41,NAP,N,1.653864,49.242559,0.81,street,Rue du Taillis 27870 Vesly,27682_0100,G,RUE DU TAILLIS,
341057412,00015,34105741200015,O,1987-01-20,NN,,,2011-06-27T12:16:03,true,4,LA CHARTREUSE,8,,GR,LA CHARTREUSE,27870,VESLY,,,27682,,,,,,,,,,,,,,,,,,,2011-01-01,A,,,,,68.20B,NAFRev2,N,5.7931115,45.3630888,0.74,poi.monastery,Monastère de la Grande Chartreuse Saint-Pierre-de-Chartreuse,https://osm.org/relation/1534046,G,,
342849809,00021,34284980900021,O,1900-01-01,NN,,,2011-04-28T00:35:42,false,3,,,,RUE,DU MONT PINSON,27870,VESLY,,,27682,,,,,,,,,,,,,,,,,,,1989-12-31,F,,,,,77.12,NAP,N,1.659309,49.244114,0.81,street,Rue du Mont Pincon 27870 Vesly,27682_0062,G,RUE DU MONT PINCON,
350104139,00018,35010413900018,O,1989-04-01,NN,,,2006-12-15T00:36:02,false,3,,,,RUE,MONT PINCON,27870,VESLY,,,27682,,,,,,,,,,,,,,,,,,,1992-06-30,F,,,,,70.3A,NAF1993,N,1.659309,49.244114,0.89,street,Rue du Mont Pincon 27870 Vesly,27682_0062,G,RUE DU MONT PINCON,
350171369,00035,35017136900035,O,1998-04-01,NN,,,2018-08-08T03:41:23,true,4,,3,,RUE,DE LA BOISSIERE,27870,VESLY,,,27682,,,,,,,,,,,,,,,,,,,2018-06-30,F,,,,,90.03B,NAFRev2,N,1.656251,49.244515,0.95,housenumber,3 Rue de la Boissière 27870 Vesly,27682_0005_00003,G,3 RUE DE LA BOISSIERE,
350357018,00018,35035701800018,O,1989-03-28,,,,,true,1,,,,RUE,DE LA BOISSIERE,27870,VESLY,,,27682,,,,,,,,,,,,,,,,,,,1992-03-30,F,,,,,52.5Z,NAF1993,N,1.656134,49.244053,0.95,street,Rue de la Boissière 27870 Vesly,27682_0005,G,RUE DE LA BOISSIERE,
351195482,00010,35119548200010,O,,NN,,,2006-11-25T11:08:11,true,1,,,,RUE,DE LA BOISSIERE,27870,VESLY,,,27682,,,,,,,,,,,,,,,,,,,1992-11-23,F,,,,,52.4J,NAF1993,N,1.656134,49.244053,0.95,street,Rue de la Boissière 27870 Vesly,27682_0005,G,RUE DE LA BOISSIERE,
356000232,00450,35600023200450,O,1991-01-01,NN,,,2006-10-28T00:10:03,false,3,,6,,RUE,DE L'EGLISE,27870,VESLY,,,27682,,,,,,,,,,,,,,,,,,,2005-11-01,F,BUREAU DE POSTE,,,,64.1A,NAFRev1,O,1.654838,49.240612,0.95,housenumber,6 Rue de l’Eglise 27870 Vesly,27682_0020_00006,G,6 RUE DE L EGLISE,
379503386,00011,37950338600011,O,1990-10-02,NN,,,2008-01-04T21:29:57,true,5,,1,,RUE,ST THOMAS,27870,VESLY,,,27682,,,,,,,,,,,,,,,,,,,2007-10-15,F,,,,,80.4D,NAFRev1,N,1.647344,49.241799,0.83,housenumber,1 Rue Saint-Thomas 27870 Vesly,27682_0090_00001,G,1 RUE SAINT THOMAS,
379671068,00011,37967106800011,O,,,,,,true,1,,4,,RUE,DE L ORMETEL,27870,VESLY,,,27682,,,,,,,,,,,,,,,,,,,1997-06-30,F,,,,,51.1T,NAF1993,N,1.652706,49.241937,0.95,housenumber,4 Rue de l’Ormetel 27870 Vesly,27682_0069_00004,G,4 RUE DE L ORMETEL,
380167254,00024,38016725400024,O,1989-12-31,02,2020,,2022-08-29T09:07:14,true,4,CLOS DU MONT VINE,1,,RUE,SAINT THOMAS,27870,VESLY,,,27682,,,,,,,,,,,,,,,,,,,2021-03-31,F,,,,,01.11Z,NAFRev2,N,1.647344,49.241799,0.94,housenumber,1 Rue Saint-Thomas 27870 Vesly,27682_0090_00001,G,1 RUE SAINT THOMAS,
381420462,00016,38142046200016,O,1991-04-01,NN,,,2012-05-05T03:56:55,true,5,,10,,RTE,DE GISORS,27870,VESLY,,,27682,,,,,,,,,,,,,,,,,,,2010-12-31,A,,,,,64.92Z,NAFRev2,N,1.655379,49.240285,0.34,housenumber,10 Rue de l’Eglise 27870 Vesly,27682_0020_00010,G,10 RUE DE L EGLISE,
381950625,00016,38195062500016,O,1991-06-01,,,,2008-01-04T22:02:45,true,4,,10,,RTE,DE GISORS,27870,VESLY,,,27682,,,,,,,,,,,,,,,,,,,2008-01-01,A,,,,,96.01A,NAFRev2,N,1.655379,49.240285,0.34,housenumber,10 Rue de l’Eglise 27870 Vesly,27682_0020_00010,G,10 RUE DE L EGLISE,
382829737,00016,38282973700016,O,1991-07-05,NN,,,2008-01-04T22:15:29,true,3,A VERNON,44,,,GRANDE ROUTE DE GISORS,27870,VESLY,,,27682,,,,,,,,,,,,,,,,,,,2008-01-01,A,,,,,68.20A,NAFRev2,N,1.651006,49.24183,0.39,housenumber,44 Grande Rue 27870 Vesly,27682_0030_00044,G,44 GRANDE RUE,
382858900,00014,38285890000014,O,1991-08-30,NN,,,,true,1,,35,,,GRANDE RUE,27870,VESLY,,,27682,,,,,,,,,,,,,,,,,,,1998-10-31,F,,,,,55.3A,NAF1993,N,1.652133,49.242609,0.95,housenumber,35 Grande Rue 27870 Vesly,27682_0030_00035,G,35 GRANDE RUE,
383252681,00010,38325268100010,O,1991-10-07,NN,,,,true,1,,2,,RUE,DU PRIEURE,27870,VESLY,,,27682,,,,,,,,,,,,,,,,,,,1999-05-12,F,,,,,60.2L,NAF1993,O,1.65093,49.240744,0.94,housenumber,2 Rue du Prieuré 27870 Vesly,27682_0075_00002,G,2 RUE DU PRIEURE,
384949277,00014,38494927700014,O,1992-04-14,NN,,,,true,4,,31,,,GRANDE RUE,27870,VESLY,,,27682,,,,,,,,,,,,,,,,,,,2003-12-20,F,,,,,52.4Z,NAFRev1,N,1.653032,49.243398,0.95,housenumber,31 Grande Rue 27870 Vesly,27682_0030_00031,G,31 GRANDE RUE,
387759467,00013,38775946700013,O,1976-01-01,NN,,,2008-01-04T22:58:53,true,3,,,,RUE,DU PRIEURE,27870,VESLY,,,27682,,,,,,,,,,,,,,,,,,,2008-01-01,A,,,,,01.11Z,NAFRev2,N,1.651546,49.24038,0.94,street,Rue du Prieuré 27870 Vesly,27682_0075,G,RUE DU PRIEURE,
387825409,00023,38782540900023,O,2008-02-01,,,,2009-10-20T14:36:17,true,2,,,,RUE,DE LA MARETTE,27870,VESLY,,,27682,,,,,,,,,,,,,,,,,,,2009-06-30,F,,,,,70.22Z,NAFRev2,N,1.651968,49.243639,0.94,street,Rue de la Marette 27870 Vesly,27682_0060,G,RUE DE LA MARETTE,
387875297,00013,38787529700013,O,1992-05-01,NN,,,2022-03-30T20:25:53,true,9,,10,,RTE,DE GISORS,27870,VESLY,,,27682,,,,,,,,,,,,,,,,,,,2021-12-31,A,,,,,20.13B,NAFRev2,N,1.655379,49.240285,0.34,housenumber,10 Rue de l’Eglise 27870 Vesly,27682_0020_00010,G,10 RUE DE L EGLISE,
389446931,00013,38944693100013,O,1992-10-19,NN,,,,false,3,,23,,RUE,DE L ORMETEL,27870,VESLY,,,27682,,,,,,,,,,,,,,,,,,,1994-06-16,F,,,,,70.2A,NAF1993,N,1.654091,49.241139,0.95,housenumber,23 Rue de l’Ormetel 27870 Vesly,27682_0069_00023,G,23 RUE DE L ORMETEL,
392477691,00035,39247769100035,O,2012-12-20,,,,2021-02-23T11:18:16,true,1,,10,,RUE,DE LA MESSE,27870,VESLY,,,27682,,,,,,,,,,,,,,,,,,,2012-12-20,A,,,,,82.99Z,NAFRev2,N,1.655808,49.241372,0.94,housenumber,10 Rue de la Messe 27870 Vesly,27682_0061_00010,G,10 RUE DE LA MESSE,
394773535,00015,39477353500015,O,1994-04-01,NN,,,,true,4,,47,,RUE,DE L EGLISE,27870,VESLY,,,27682,,,,,,,,,,,,,,,,,,,1996-12-30,F,,,,,74.8K,NAF1993,N,1.658239,49.235392,0.95,housenumber,47 Rue de l’Eglise 27870 Vesly,27682_0020_00047,G,47 RUE DE L EGLISE,
395404536,00025,39540453600025,O,1997-07-01,,,,,false,3,,1,,RUE,DU CLOS DE DECRET,27870,VESLY,,,27682,,,,,,,,,,,,,,,,,,,2000-01-01,F,,,,,60.2L,NAF1993,N,1.649987,49.241406,0.9,housenumber,1 Rue du Clos du Décret 27870 Vesly,27682_0012_00001,G,1 RUE DU CLOS DU DECRET,
397940511,00017,39794051100017,O,1900-01-01,NN,,,2013-02-27T09:29:59,false,3,,11,,,GRANDE RUE,27870,VESLY,,,27682,,,,,,,,,,,,,,,,,,,1994-12-25,F,,,,,52.6D,NAF1993,N,1.656213,49.245538,0.95,housenumber,11 Grande Rue 27870 Vesly,27682_0030_00011,G,11 GRANDE RUE,
399131424,00018,39913142400018,O,,NN,,,,true,1,,20,,RUE,DU MONT PINCON,27870,VESLY,,,27682,,,,,,,,,,,,,,,,,,,1997-10-31,F,,,,,70.3A,NAF1993,O,1.660163,49.243681,0.95,housenumber,20 Rue du Mont Pincon 27870 Vesly,27682_0062_00020,G,20 RUE DU MONT PINCON,
400960340,00018,40096034000018,O,1995-04-26,NN,,,,false,3,,23,,,GRANDE RUE,27870,VESLY,,,27682,,,,,,,,,,,,,,,,,,,1996-01-17,F,,,,,01.1A,NAF1993,N,1.654015,49.244152,0.95,housenumber,23 Grande Rue 27870 Vesly,27682_0030_00023,G,23 GRANDE RUE,
400960340,00026,40096034000026,O,1996-01-17,NN,,,2007-03-30T09:41:41,false,3,,5,,,T TAILLIS,27870,VESLY,,,27682,,,,,,,,,,,,,,,,,,,2006-12-21,F,,,,,01.1A,NAFRev1,N,1.653864,49.242559,0.74,street,Rue du Taillis 27870 Vesly,27682_0100,G,RUE DU TAILLIS,
401771688,00017,40177168800017,O,1995-06-23,NN,,,2018-10-20T04:30:36,true,4,,35,,RUE,DE L EGLISE,27870,VESLY,,,27682,,,,,,,,,,,,,,,,,,,2018-10-19,F,,,,,68.20A,NAFRev2,N,1.65825,49.238652,0.95,housenumber,35 Rue de l’Eglise 27870 Vesly,27682_0020_00035,G,35 RUE DE L EGLISE,
402241285,00020,40224128500020,O,2015-02-15,,,4932ZA,2021-11-05T08:42:12,true,2,,32,,,GRANDE RUE,27870,VESLY,,,27682,,,,,,,,,,,,,,,,,,,2021-09-30,F,,,,,49.32Z,NAFRev2,N,1.651701,49.242423,0.95,housenumber,32 Grande Rue 27870 Vesly,27682_0030_00032,G,32 GRANDE RUE,
404669335,00014,40466933500014,O,1979-12-31,NN,,,2008-01-04T20:43:57,true,3,,,,,,27870,VESLY,,,27682,,,,,,,,,,,,,,,,,,,2008-01-01,A,,,,,01.11Z,NAFRev2,N,,,0,,,,,,
404669343,00018,40466934300018,O,1979-12-31,NN,,,2014-06-14T03:48:06,true,4,,,,,,27870,VESLY,,,27682,,,,,,,,,,,,,,,,,,,2012-09-30,F,,,,,01.11Z,NAFRev2,N,,,0,,,,,,
404669350,00013,40466935000013,O,1980-01-01,NN,,,2020-02-08T03:48:51,true,4,,15,,RUE,DE L EGLISE,27870,VESLY,,,27682,,,,,,,,,,,,,,,,,,,2019-11-18,F,,,,,01.42Z,NAFRev2,N,1.655987,49.239991,0.95,housenumber,15 Rue de l’Eglise 27870 Vesly,27682_0020_00015,G,15 RUE DE L EGLISE,
404669368,00015,40466936800015,O,1984-12-31,NN,,,2008-01-04T20:43:57,true,3,,2,,PL,DU CARROUGE,27870,VESLY,,,27682,,,,,,,,,,,,,,,,,,,2008-01-01,A,,,,,01.13Z,NAFRev2,N,1.652874,49.240127,0.84,housenumber,2 Place du Carrouge 27870 Vesly,27682_0011_00002,G,2 PLACE DU CARROUGE,
404872772,00029,40487277200029,O,2000-07-15,NN,,,2006-11-25T15:09:40,false,4,,,,,,27870,VESLY,,BP 7,27682,,,,,,,,,,,,,,,,,,,2003-12-25,F,,,,,92.3A,NAFRev1,N,,,0,,,,,,
404974982,00013,40497498200013,O,1996-04-01,NN,,,2017-01-04T03:58:02,true,3,,2,,RUE,DU PRIEURE,27870,VESLY,,,27682,,,,,,,,,,,,,,,,,,,2008-01-01,A,,,,,01.50Z,NAFRev2,N,1.65093,49.240744,0.94,housenumber,2 Rue du Prieuré 27870 Vesly,27682_0075_00002,G,2 RUE DU PRIEURE,
407554369,00014,40755436900014,O,1996-04-10,NN,,,2008-01-04T20:56:32,true,3,,4,,RUE,DE L'ORIENTAL,27870,VESLY,,,27682,,,,,,,,,,,,,,,,,,,2008-01-01,A,,,,,93.29Z,NAFRev2,N,1.652706,49.241937,0.51,housenumber,4 Rue de l’Ormetel 27870 Vesly,27682_0069_00004,G,4 RUE DE L ORMETEL,
408332500,00011,40833250000011,O,1996-03-01,NN,,,2008-01-04T21:08:40,true,3,,,,,,27870,VESLY,,,27682,,,,,,,,,,,,,,,,,,,2008-01-01,A,,,,,68.20B,NAFRev2,N,,,0,,,,,,
408333201,00015,40833320100015,O,1996-03-01,NN,,,2008-01-04T21:08:40,true,3,,,,,,27870,VESLY,,,27682,,,,,,,,,,,,,,,,,,,2008-01-01,A,,,,,68.20B,NAFRev2,N,,,0,,,,,,
408334647,00018,40833464700018,O,1996-04-22,NN,,,2008-01-04T21:08:43,true,3,,2,,RUE,DU PRIEURE,27870,VESLY,,,27682,,,,,,,,,,,,,,,,,,,2008-01-01,A,,,,,68.20B,NAFRev2,N,1.65093,49.240744,0.94,housenumber,2 Rue du Prieuré 27870 Vesly,27682_0075_00002,G,2 RUE DU PRIEURE,
408966836,00012,40896683600012,O,1981-01-01,NN,,,2007-01-18T09:38:38,false,4,,,,,,27870,VESLY,,,27682,,,,,,,,,,,,,,,,,,,2001-02-26,F,,,,,01.3Z,NAF1993,N,,,0,,,,,,
409468808,00012,40946880800012,O,1900-01-01,NN,,,2011-05-03T00:27:53,false,3,,,,,MAIRIE,27870,VESLY,,,27682,,,,,,,,,,,,,,,,,,,1996-12-25,F,,,,,52.6E,NAF1993,N,3.0709671,50.6304695,0.92,poi.townhall,Hôtel de Ville Lille,https://osm.org/way/40917078,G,,
413950718,00028,41395071800028,O,1999-01-01,NN,,,2006-05-16T14:15:26,true,3,,14,,RUE,DU MONT PINCON,27870,VESLY,,,27682,,,,,,,,,,,,,,,,,,,2003-12-31,F,,,,,51.1T,NAFRev1,N,1.65914,49.243643,0.95,housenumber,14 Rue du Mont Pincon 27870 Vesly,27682_0062_00014,G,14 RUE DU MONT PINCON,
414805028,00019,41480502800019,O,1997-10-01,NN,,,2008-01-04T22:54:16,true,3,,3,,PL,DE CARROUGE,27870,VESLY,,,27682,,,,,,,,,,,,,,,,,,,2008-01-01,A,,,,,01.11Z,NAFRev2,N,1.653468,49.240926,0.63,housenumber,3 Place du Carrouge 27870 Vesly,27682_0011_00003,G,3 PLACE DU CARROUGE,
418755088,00014,41875508800014,O,1998-05-07,NN,,2313ZB,2015-11-04T04:20:32,true,4,,8,,RUE,CLOS DU DECRET,27870,VESLY,,,27682,,,,,,,,,,,,,,,,,,,2009-05-15,A,,,,,90.03A,NAFRev2,N,1.64922,49.242089,0.9,housenumber,8 Rue du Clos du Décret 27870 Vesly,27682_0012_00008,G,8 RUE DU CLOS DU DECRET,
420073538,00019,42007353800019,O,1998-07-31,NN,,,2008-01-04T23:46:31,true,3,,2,,RUE,DU PRIEURE,27870,VESLY,,,27682,,,,,,,,,,,,,,,,,,,2008-01-01,A,,,,,68.20A,NAFRev2,N,1.65093,49.240744,0.94,housenumber,2 Rue du Prieuré 27870 Vesly,27682_0075_00002,G,2 RUE DU PRIEURE,
420695249,00011,42069524900011,O,1998-11-01,,,,,true,1,,35,,,GRANDE RUE,27870,VESLY,,,27682,,,,,,,,,,,,,,,,,,,2000-02-18,F,,,,,55.3A,NAF1993,N,1.652133,49.242609,0.95,housenumber,35 Grande Rue 27870 Vesly,27682_0030_00035,G,35 GRANDE RUE,
420917999,00021,42091799900021,O,1999-01-01,,,,,true,1,,23,,RUE,L ORMETEL,27870,VESLY,,,27682,,,,,,,,,,,,,,,,,,,2000-06-30,F,,,,,74.8D,NAF1993,N,1.654091,49.241139,0.94,housenumber,23 Rue de l’Ormetel 27870 Vesly,27682_0069_00023,G,23 RUE DE L ORMETEL,
423140771,00019,42314077100019,O,1998-09-15,NN,,,2013-05-17T19:44:48,true,3,,,,RUE,ST THOMAS,27870,VESLY,,,27682,,,,,,,,,,,,,,,,,,,2008-01-01,A,,,,,93.29Z,NAFRev2,N,1.64702,49.241736,0.81,street,Rue Saint-Thomas 27870 Vesly,27682_0090,G,RUE SAINT THOMAS,
423630011,00025,42363001100025,O,1999-06-21,NN,,,2006-10-31T00:10:54,false,3,,12,,PL,DU CARREFOUR,27870,VESLY,,,27682,,,,,,,,,,,,,,,,,,,2004-12-31,F,PACARY BERNARD,,,,29.4B,NAFRev1,O,1.6537,49.240863,0.49,housenumber,12 Place du Carrouge 27870 Vesly,27682_0011_00012,G,12 PLACE DU CARROUGE,
424228518,00025,42422851800025,O,1999-08-18,NN,,,,false,4,,23,,RUE,DE L ORMETEL,27870,VESLY,,,27682,,,,,,,,,,,,,,,,,,,2003-08-21,F,,,,,51.1R,NAFRev1,N,1.654091,49.241139,0.95,housenumber,23 Rue de l’Ormetel 27870 Vesly,27682_0069_00023,G,23 RUE DE L ORMETEL,
429982325,00012,42998232500012,O,1994-05-16,NN,,,2008-01-05T01:46:36,true,3,CHEZ M. DEVAUX GERARD,13,,,GRANDE RUE,27870,VESLY,,,27682,,,,,,,,,,,,,,,,,,,2008-01-01,A,,,,,91.04Z,NAFRev2,N,1.656088,49.245463,0.95,housenumber,13 Grande Rue 27870 Vesly,27682_0030_00013,G,13 GRANDE RUE,
430945402,00013,43094540200013,O,1990-01-01,NN,,,,true,1,,14,,RUE,DU MONT PINSON,27870,VESLY,,,27682,,,,,,,,,,,,,,,,,,,2002-02-05,F,,,,,51.1T,NAF1993,N,1.65914,49.243643,0.83,housenumber,14 Rue du Mont Pincon 27870 Vesly,27682_0062_00014,G,14 RUE DU MONT PINCON,
432401024,00034,43240102400034,O,2008-04-01,NN,,4932ZA,2018-11-20T15:07:13,true,3,,2,,RUE,DE LA MESSE,27870,VESLY,,,27682,,,,,,,,,,,,,,,,,,,2018-08-23,F,,,,,49.32Z,NAFRev2,N,1.655151,49.24088,0.94,housenumber,2 Rue de la Messe 27870 Vesly,27682_0061_00002,G,2 RUE DE LA MESSE,
434329132,00022,43432913200022,O,2015-09-23,,,,2016-08-26T10:04:17,true,2,,,,CHE,DE LA MOLIERE,27870,VESLY,,,27682,,,,,,,,,,,,,,,,,,,2016-06-30,F,TCX,,,TRANSPORTS CHAPELLE XAVIER,49.41A,NAFRev2,N,1.660492,49.242398,0.84,street,Chemin de la Moliere 27870 Vesly,27682_0008,G,CHEMIN DE LA MOLIERE,
440947406,00128,44094740600128,O,2007-05-20,,,,2014-01-02T19:28:11,false,3,,,,,LIEUDIT LE CHAMPS AU DIABLE,27870,VESLY,,,27682,,,,,,,,,,,,,,,,,,,2013-12-26,F,,,,,35.11Z,NAFRev2,N,,,0,,,,,,
441411618,00016,44141161800016,O,2002-02-28,NN,,,2008-11-08T02:13:09,false,3,,26,,RUE,DE L EGLISE,27870,VESLY,,,27682,,,,,,,,,,,,,,,,,,,2005-01-01,F,,,,,51.8M,NAFRev1,N,1.656933,49.239233,0.95,housenumber,26 Rue de l’Eglise 27870 Vesly,27682_0020_00026,G,26 RUE DE L EGLISE,