siren,nic,siret,statutDiffusionEtablissement,dateCreationEtablissement,trancheEffectifsEtablissement,anneeEffectifsEtablissement,activitePrincipaleRegistreMetiersEtablissement,dateDernierTraitementEtablissement,etablissementSiege,nombrePeriodesEtablissement,complementAdresseEtablissement,numeroVoieEtablissement,indiceRepetitionEtablissement,typeVoieEtablissement,libelleVoieEtablissement,codePostalEtablissement,libelleCommuneEtablissement,libelleCommuneEtrangerEtablissement,distributionSpecialeEtablissement,codeCommuneEtablissement,codeCedexEtablissement,libelleCedexEtablissement,codePaysEtrangerEtablissement,libellePaysEtrangerEtablissement,complementAdresse2Etablissement,numeroVoie2Etablissement,indiceRepetition2Etablissement,typeVoie2Etablissement,libelleVoie2Etablissement,codePostal2Etablissement,libelleCommune2Etablissement,libelleCommuneEtranger2Etablissement,distributionSpeciale2Etablissement,codeCommune2Etablissement,codeCedex2Etablissement,libelleCedex2Etablissement,codePaysEtranger2Etablissement,libellePaysEtranger2Etablissement,dateDebut,etatAdministratifEtablissement,enseigne1Etablissement,enseigne2Etablissement,enseigne3Etablissement,denominationUsuelleEtablissement,activitePrincipaleEtablissement,nomenclatureActivitePrincipaleEtablissement,caractereEmployeurEtablissement,longitude,latitude,geo_score,geo_type,geo_adresse,geo_id,geo_ligne,geo_l4,geo_l5
026050070,00049,02605007000049,O,1900-01-01,NN,,,2008-01-04T17:55:41,false,3,QUAI GAMBETTA,83,,,LA HOULE,35260,CANCALE,,,35049,,,,,,,,,,,,,,,,,,,2008-01-01,A,COMPTOIR COOP,,,,68.20B,NAFRev2,N,-1.854828,48.671032,0.5,street,Quai Gambetta 35260 Cancale,35049_0430,D,QUAI GAMBETTA,
130014939,00453,13001493900453,O,2011-07-13,NN,,,2019-06-24T13:07:15,false,2,,11,,RES,DE BEL EVENT,35260,CANCALE,,BP   52,35049,,,,,,,,,,,,,,,,,,,2017-02-02,F,TRESORERIE DE CANCALE,,,,84.11Z,NAFRev2,N,-1.853336,48.674682,0.48,housenumber,11 Impasse Bel Event 35260 Cancale,35049_awipt6_00011,G,11 IMPASSE BEL EVENT,
173502113,00082,17350211300082,O,1983-04-08,NN,,,2013-05-18T02:08:04,false,5,,11,,RES,DE BEL EVENT,35260,CANCALE,,,35049,,,,,,,,,,,,,,,,,,,2011-07-13,F,TRESORERIE CANCALE,,,,84.11Z,NAFRev2,N,-1.853336,48.674682,0.48,housenumber,11 Impasse Bel Event 35260 Cancale,35049_awipt6_00011,G,11 IMPASSE BEL EVENT,
180090060,02308,18009006002308,O,2002-07-01,,,,2010-04-30T15:02:18,false,4,LYCEE TECHNIQUE,76,,RUE,DES RIMAINS,35260,CANCALE,,,35049,,,,,,,,,,,,,,,,,,,2010-07-01,F,IGESA CANCALE LES RIMAINS,,,,55.20Z,NAFRev2,N,-1.840435,48.680149,0.96,housenumber,76 Rue des Rimains 35260 Cancale,35049_0955_00076,G,76 RUE DES RIMAINS,
193500030,00013,19350003000013,O,1983-03-01,12,2020,,2022-08-29T09:04:25,true,5,,1,,RUE,PIERRE DE COUBERTIN,35260,CANCALE,,,35049,,,,,,,,,,,,,,,,,,,2016-01-17,A,,,,,85.31Z,NAFRev2,O,-1.85669,48.679724,0.88,street,Rue Pierre de Coubertin 35260 Cancale,35049_0824,G,RUE PIERRE DE COUBERTIN,
197832132,00025,19783213200025,O,1999-12-25,,,,2008-01-04T18:21:19,false,2,POR-MER,,,,BARBE BRULEE,35260,CANCALE,,,35049,,,,,,,,,,,,,,,,,,,2008-01-01,A,ANNEXE,,,,85.20Z,NAFRev2,N,-1.846619,48.703604,0.92,locality,Le Jamier de Barbe Brulee 35260 Cancale,35049_B614,G,LE JAMIER DE BARBE BRULEE,
213500499,00016,21350049900016,O,1983-03-01,22,2020,,2022-08-29T09:06:56,true,4,,48,,RUE,DU PORT,35260,CANCALE,,,35049,,,,,,,,,,,,,,,,,,,2008-01-01,A,MAIRIE,,,,84.11Z,NAFRev2,O,-1.852413,48.674617,0.97,housenumber,48 Rue du Port 35260 Cancale,35049_0860_00048,G,48 RUE DU PORT,
213500499,00024,21350049900024,O,1983-12-21,03,2020,,2022-08-29T09:06:56,false,3,,49,,RUE,DU PORT,35260,CANCALE,,,35049,,,,,,,,,,,,,,,,,,,2008-01-01,A,ECOLE PRIMAIRE PUBLIQUE,,,,85.20Z,NAFRev2,N,-1.852675,48.674359,0.97,housenumber,49 Rue du Port 35260 Cancale,35049_0860_00049,G,49 RUE DU PORT,
213500499,00032,21350049900032,O,1983-12-21,02,2020,,2022-08-29T09:06:56,false,3,,1,,RES,DE BEL EVENT,35260,CANCALE,,,35049,,,,,,,,,,,,,,,,,,,2008-01-01,A,ECOLE MATERNELLE PUBLIQUE BEL EVENT,,,,85.10Z,NAFRev2,N,-1.852891,48.674662,0.46,housenumber,1 Impasse Bel Event 35260 Cancale,35049_awipt6_00001,G,1 IMPASSE BEL EVENT,
213500499,00040,21350049900040,O,1996-12-25,NN,,,2013-03-30T12:04:32,false,3,,48,,RUE,DU PORT,35260,CANCALE,,,35049,,,,,,,,,,,,,,,,,,,2011-12-25,F,LOTISSEMENTS ARTISANAUX VOCATION MARITIM,,,,42.99Z,NAFRev2,N,-1.852413,48.674617,0.97,housenumber,48 Rue du Port 35260 Cancale,35049_0860_00048,G,48 RUE DU PORT,
213500499,00057,21350049900057,O,1996-12-25,NN,,,2008-01-04T18:31:52,false,2,MAIRIE,46,,RUE,DU PORT,35260,CANCALE,,,35049,,,,,,,,,,,,,,,,,,,2008-01-01,A,SERVICE D EAU,,,,36.00Z,NAFRev2,N,-1.852548,48.674608,0.97,housenumber,46 Rue du Port 35260 Cancale,35049_0860_00046,G,46 RUE DU PORT,
213500499,00065,21350049900065,O,1996-12-25,01,2019,,2021-10-27T08:08:01,false,2,MAIRIE,48,,RUE,DU PORT,35260,CANCALE,,,35049,,,,,,,,,,,,,,,,,,,2008-01-01,A,CAMPING MUNICIPAL,,,,55.30Z,NAFRev2,N,-1.852413,48.674617,0.97,housenumber,48 Rue du Port 35260 Cancale,35049_0860_00048,G,48 RUE DU PORT,
213500499,00073,21350049900073,O,1996-12-25,01,2019,,2021-10-27T08:08:01,false,2,MAIRIE,48,,RUE,DU PORT,35260,CANCALE,,,35049,,,,,,,,,,,,,,,,,,,2008-01-01,A,PORT DE PLAISANCE,,,,93.29Z,NAFRev2,N,-1.852413,48.674617,0.97,housenumber,48 Rue du Port 35260 Cancale,35049_0860_00048,G,48 RUE DU PORT,
213500499,00081,21350049900081,O,1996-12-25,NN,,,2008-10-07T14:28:15,false,3,MAIRIE,48,,RUE,DU PORT,35260,CANCALE,,,35049,,,,,,,,,,,,,,,,,,,2008-01-01,F,LOTISSEMENT COMMUNAL,,,,42.99Z,NAFRev2,N,-1.852413,48.674617,0.97,housenumber,48 Rue du Port 35260 Cancale,35049_0860_00048,G,48 RUE DU PORT,
213500499,00099,21350049900099,O,1996-12-25,NN,,,2013-09-12T16:00:23,false,3,MAIRIE,48,,RUE,DU PORT,35260,CANCALE,,,35049,,,,,,,,,,,,,,,,,,,2012-11-30,F,ATELIER RELAIS,,,,68.20B,NAFRev2,N,-1.852413,48.674617,0.97,housenumber,48 Rue du Port 35260 Cancale,35049_0860_00048,G,48 RUE DU PORT,
213500499,00107,21350049900107,O,1996-12-25,NN,,,2013-03-30T12:04:33,false,3,MAIRIE,48,,RUE,DU PORT,35260,CANCALE,,,35049,,,,,,,,,,,,,,,,,,,2011-12-25,F,ZAC,,,,42.99Z,NAFRev2,N,-1.852413,48.674617,0.97,housenumber,48 Rue du Port 35260 Cancale,35049_0860_00048,G,48 RUE DU PORT,
213500499,00115,21350049900115,O,2000-12-25,NN,,,2018-12-04T16:39:34,false,3,,48,,RUE,DU PORT,35260,CANCALE,,,35049,,,,,,,,,,,,,,,,,,,2018-01-01,F,ASSAINISSEMENT,,,,37.00Z,NAFRev2,N,-1.852413,48.674617,0.97,housenumber,48 Rue du Port 35260 Cancale,35049_0860_00048,G,48 RUE DU PORT,
213500499,00123,21350049900123,O,2001-12-25,NN,,,2014-06-27T16:11:38,false,3,MAIRIE,48,,RUE,DU PORT,35260,CANCALE,,,35049,,,,,,,,,,,,,,,,,,,2013-12-25,F,LOT ART A VOCATION MARITIME VAUHARIOT II,,,,42.99Z,NAFRev2,N,-1.852413,48.674617,0.97,housenumber,48 Rue du Port 35260 Cancale,35049_0860_00048,G,48 RUE DU PORT,
213500499,00131,21350049900131,O,2001-12-25,NN,,,2021-07-07T11:24:36,false,3,MAIRIE,48,,RUE,DU PORT,35260,CANCALE,,,35049,,,,,,,,,,,,,,,,,,,2020-12-31,F,ZAC DES RIMAINS,,,,42.99Z,NAFRev2,N,-1.852413,48.674617,0.97,housenumber,48 Rue du Port 35260 Cancale,35049_0860_00048,G,48 RUE DU PORT,
213500499,00149,21350049900149,O,2001-12-25,NN,,,2008-01-04T18:31:52,false,2,MAIRIE,48,,RUE,DU PORT,35260,CANCALE,,,35049,,,,,,,,,,,,,,,,,,,2008-01-01,A,LOTISSEMENT LA BRETONNIERE,,,,42.99Z,NAFRev2,N,-1.852413,48.674617,0.97,housenumber,48 Rue du Port 35260 Cancale,35049_0860_00048,G,48 RUE DU PORT,
213500499,00156,21350049900156,O,2001-12-25,NN,,,2013-10-05T12:39:29,false,3,MAIRIE,48,,RUE,DU PORT,35260,CANCALE,,,35049,,,,,,,,,,,,,,,,,,,2012-12-25,F,LOTISSEMENT VILLE GARNIER,,,,42.99Z,NAFRev2,N,-1.852413,48.674617,0.97,housenumber,48 Rue du Port 35260 Cancale,35049_0860_00048,G,48 RUE DU PORT,
213500499,00164,21350049900164,O,2001-12-25,NN,,,2013-10-05T12:39:29,false,3,MAIRIE,48,,RUE,DU PORT,35260,CANCALE,,,35049,,,,,,,,,,,,,,,,,,,2012-12-25,F,LOTISSEMENT BEL AIR,,,,42.99Z,NAFRev2,N,-1.852413,48.674617,0.97,housenumber,48 Rue du Port 35260 Cancale,35049_0860_00048,G,48 RUE DU PORT,
213500499,00172,21350049900172,O,2001-12-25,NN,,,2014-06-27T16:06:04,false,3,MAIRIE,48,,RUE,DU PORT,35260,CANCALE,,,35049,,,,,,,,,,,,,,,,,,,2013-12-25,F,ZAC QUATREVAS,,,,68.20B,NAFRev2,N,-1.852413,48.674617,0.97,housenumber,48 Rue du Port 35260 Cancale,35049_0860_00048,G,48 RUE DU PORT,
213500499,00180,21350049900180,O,2002-01-01,NN,,,2014-06-27T16:08:43,false,4,MAIRIE,48,,RUE,DU PORT,35260,CANCALE,,,35049,,,,,,,,,,,,,,,,,,,2013-12-25,F,LOTISSEMENT LA VILLE ES GRIS,,,,42.99Z,NAFRev2,N,-1.852413,48.674617,0.97,housenumber,48 Rue du Port 35260 Cancale,35049_0860_00048,G,48 RUE DU PORT,
213500499,00198,21350049900198,O,1998-12-11,03,2019,,2021-10-27T08:08:01,false,1,,5,,RUE,ERNEST HERCLAT,35260,CANCALE,,,35049,,,,,,,,,,,,,,,,,,,1998-12-11,A,MULTI ACCUEIL LES CREVETTES,,,,88.91A,NAFRev2,N,-1.850427,48.674605,0.96,housenumber,5 Rue Ernest Herclat 35260 Cancale,35049_0380_00005,G,5 RUE ERNEST HERCLAT,
243500121,00013,24350012100013,O,1983-03-01,NN,,,2019-06-24T13:13:10,true,4,MAIRIE,48,,RUE,DU PORT,35260,CANCALE,,,35049,,,,,,,,,,,,,,,,,,,2008-01-01,A,ST COULOMB,,,,84.11Z,NAFRev2,O,-1.852413,48.674617,0.97,housenumber,48 Rue du Port 35260 Cancale,35049_0860_00048,G,48 RUE DU PORT,
243500782,00012,24350078200012,O,2001-01-01,,,,,false,3,,,,AV,GAL DE GAULLE,35260,CANCALE,,,35049,,,,,,,,,,,,,,,,,,,2002-12-25,F,,,,,75.1A,NAF1993,O,-1.858509,48.677801,0.78,street,Avenue du Général de Gaulle 35260 Cancale,35049_0450,G,AVENUE DU GENERAL DE GAULLE,
243500782,00020,24350078200020,O,2002-02-01,NN,,,2008-01-04T18:48:21,false,3,CAP MALO,6,,,LA VILLE JEGU,35260,CANCALE,,,35049,,,,,,,,,,,,,,,,,,,2008-01-01,A,ZONE D'ACTIVITES STRUCTURANTE,,,,42.99Z,NAFRev2,N,-1.867128,48.67433,0.95,housenumber,6 La Ville Jegu 35260 Cancale,35049_c055_00006,G,6 LA VILLE JEGU,
243500782,00038,24350078200038,O,2001-12-25,NN,,,2007-05-19T08:22:14,false,2,,,,RUE,DES NOES,35260,CANCALE,,BP 11,35049,,,,,,,,,,,,,,,,,,,2005-04-27,F,,,,,75.1A,NAFRev1,O,-1.863392,48.678603,0.95,street,Rue des Noes 35260 Cancale,35049_0791,G,RUE DES NOES,
243500782,00053,24350078200053,O,2003-03-01,NN,,,2008-10-08T09:38:48,false,4,,6,,,LA VILLE JEGU,35260,CANCALE,,BP 11,35049,,,,,,,,,,,,,,,,,,,2008-01-01,F,AUTORITE ORGANISATRICE DES TRANSPORTS,,,,49.31Z,NAFRev2,N,-1.867128,48.67433,0.95,housenumber,6 La Ville Jegu 35260 Cancale,35049_c055_00006,G,6 LA VILLE JEGU,
243500782,00061,24350078200061,O,2004-01-01,,,,2008-01-04T18:48:21,false,3,,6,,,LA VILLE JEGU,35260,CANCALE,,,35049,,,,,,,,,,,,,,,,,,,2008-01-01,A,BATIMENTS INDUSTRIELS,,,,42.99Z,NAFRev2,N,-1.867128,48.67433,0.95,housenumber,6 La Ville Jegu 35260 Cancale,35049_c055_00006,G,6 LA VILLE JEGU,
243500782,00079,24350078200079,O,2005-04-27,22,2020,,2022-08-29T09:09:44,true,2,,6,,,LA VILLE JEGU,35260,CANCALE,,,35049,,,,,,,,,,,,,,,,,,,2008-01-01,A,,,,,84.11Z,NAFRev2,O,-1.867128,48.67433,0.95,housenumber,6 La Ville Jegu 35260 Cancale,35049_c055_00006,G,6 LA VILLE JEGU,
243500782,00087,24350078200087,O,2005-01-01,,,,2008-01-04T18:48:21,false,2,,6,,,LA VILLE JEGU,35260,CANCALE,,,35049,,,,,,,,,,,,,,,,,,,2008-01-01,A,ZONES D ACTIVITES COMPLEMENTAIRES,,,,42.99Z,NAFRev2,N,-1.867128,48.67433,0.95,housenumber,6 La Ville Jegu 35260 Cancale,35049_c055_00006,G,6 LA VILLE JEGU,
243500782,00095,24350078200095,O,2007-02-08,02,2020,,2022-08-29T09:09:44,false,4,,6,,,LA VILLE JEGU,35260,CANCALE,,BP 11,35049,,,,,,,,,,,,,,,,,,,2020-01-01,A,TRANSPORT ET MOBILITE,,,,84.13Z,NAFRev2,O,-1.867128,48.67433,0.95,housenumber,6 La Ville Jegu 35260 Cancale,35049_c055_00006,G,6 LA VILLE JEGU,
253514723,00019,25351472300019,O,2003-07-01,,,,2006-10-26T23:43:44,true,3,COMMUNAUTE D'AGGLO,,,RUE,DES NOES,35260,CANCALE,,BP 11,35049,,,,,,,,,,,,,,,,,,,2005-01-01,F,,,,,75.1E,NAFRev1,N,-1.863392,48.678603,0.95,street,Rue des Noes 35260 Cancale,35049_0791,G,RUE DES NOES,
253514723,00027,25351472300027,O,2004-01-01,,,,2006-11-25T09:09:07,false,3,,2,,RUE,DES NOES,35260,CANCALE,,BP 11,35049,,,,,,,,,,,,,,,,,,,2005-01-01,F,ZAC N 1,,,,70.1C,NAFRev1,N,-1.863432,48.678729,0.95,housenumber,2 Rue des Noes 35260 Cancale,35049_0791_00002,G,2 RUE DES NOES,
253514905,00012,25351490500012,O,2005-06-10,,,,2011-10-28T10:29:00,true,3,ST MALO AGGLOMERATION,6,,,LA VILLE JEGU,35260,CANCALE,,BP 11,35049,,,,,,,,,,,,,,,,,,,2009-12-31,F,,,,,84.13Z,NAFRev2,N,-1.867128,48.67433,0.95,housenumber,6 La Ville Jegu 35260 Cancale,35049_c055_00006,G,6 LA VILLE JEGU,
253514905,00020,25351490500020,O,2005-07-13,,,,2011-10-28T10:29:00,false,3,,6,,,LA VILLE JEGU,35260,CANCALE,,BP 11,35049,,,,,,,,,,,,,,,,,,,2009-12-31,F,ZAC TECHNOPOLITAINE,,,,42.99Z,NAFRev2,N,-1.867128,48.67433,0.95,housenumber,6 La Ville Jegu 35260 Cancale,35049_c055_00006,G,6 LA VILLE JEGU,
263500134,00014,26350013400014,O,,NN,,,,true,1,,1,,RUE,DOC ET MME COCAR,35260,CANCALE,,,35049,,,,,,,,,,,,,,,,,,,1997-03-03,F,,,,,85.1A,NAF1993,O,,,0,,,,,,
263500472,00018,26350047200018,O,1983-03-01,11,2019,,2021-10-27T08:12:50,true,5,MAIRIE,48,,RUE,DU PORT,35260,CANCALE,,,35049,,,,,,,,,,,,,,,,,,,2008-01-01,A,,,,,88.99B,NAFRev2,O,-1.852413,48.674617,0.97,housenumber,48 Rue du Port 35260 Cancale,35049_0860_00048,G,48 RUE DU PORT,
263500472,00026,26350047200026,O,1983-03-16,NN,,,,false,4,,1,,RUE,DOC ET MME COCAR,35260,CANCALE,,,35049,,,,,,,,,,,,,,,,,,,2003-01-01,F,FOYER LOGEMENT,,,,85.3D,NAF1993,N,,,0,,,,,,
263500472,00034,26350047200034,O,1994-12-05,NN,,,2018-03-08T14:04:45,false,4,,5,,RUE,NOEL ROYER,35260,CANCALE,,,35049,,,,,,,,,,,,,,,,,,,2017-12-25,A,CENTRE D'ACCUEIL D'URGENCE,,,,87.90B,NAFRev2,N,-1.849351,48.678276,0.96,housenumber,5 Rue Noel Royer 35260 Cancale,35049_0780_00005,G,5 RUE NOEL ROYER,
263500472,00059,26350047200059,O,1904-04-04,11,2020,,2022-08-29T09:10:27,false,5,MAIRIE,48,,RUE,DU PORT,35260,CANCALE,,,35049,,,,,,,,,,,,,,,,,,,2021-01-01,A,SAAD,,,,88.10A,NAFRev2,O,-1.852413,48.674617,0.97,housenumber,48 Rue du Port 35260 Cancale,35049_0860_00048,G,48 RUE DU PORT,
263500472,00067,26350047200067,O,2000-01-03,NN,,,,false,4,,,,RUE,DOC ET MME COCAR,35260,CANCALE,,,35049,,,,,,,,,,,,,,,,,,,2003-01-01,F,CUISINE CENTRALE,,,,55.5A,NAF1993,N,,,0,,,,,,
263500472,00075,26350047200075,O,1998-12-11,,,,2009-09-24T16:34:39,false,2,,5,,RUE,ERNEST HERCLAT,35260,CANCALE,,,35049,,,,,,,,,,,,,,,,,,,2008-01-01,F,MULTI ACCUEIL LES CREVETTES,,,,88.91A,NAFRev2,N,-1.850427,48.674605,0.96,housenumber,5 Rue Ernest Herclat 35260 Cancale,35049_0380_00005,G,5 RUE ERNEST HERCLAT,
263500811,00017,26350081100017,O,1983-03-01,NN,,,2020-08-25T14:56:06,true,4,MAIRIE,48,,RUE,DU PORT,35260,CANCALE,,,35049,,,,,,,,,,,,,,,,,,,2019-12-31,F,CDE,,,,88.99B,NAFRev2,N,-1.852413,48.674617,0.97,housenumber,48 Rue du Port 35260 Cancale,35049_0860_00048,G,48 RUE DU PORT,
263505851,00018,26350585100018,O,1979-02-14,NN,,,2015-05-14T03:49:45,false,5,,1,,RUE,DOC ET MME COCAR,35260,CANCALE,,BP 51,35049,,,,,,,,,,,,,,,,,,,2013-01-27,F,,,,,86.10Z,NAFRev2,O,,,0,,,,,,
263505851,00026,26350585100026,O,2003-01-01,NN,,,2011-07-04T14:13:28,false,4,,1,,RUE,DOC ET MME COCAR,35260,CANCALE,,,35049,,,,,,,,,,,,,,,,,,,2010-01-01,F,LONG SEJOUR,,,,86.10Z,NAFRev2,N,,,0,,,,,,
263505851,00034,26350585100034,O,2003-01-01,NN,,,2015-01-07T16:57:03,false,4,,1,,RUE,DOC ET MME COCAR,35260,CANCALE,,BP 51,35049,,,,,,,,,,,,,,,,,,,2008-01-01,F,EHPAD HOPITAL -CANCALE,,,,87.10A,NAFRev2,N,,,0,,,,,,
263505851,00042,26350585100042,O,2003-01-01,NN,,,2015-01-07T17:17:55,false,3,,1,,RUE,DOC ET MME COCAR,35260,CANCALE,,,35049,,,,,,,,,,,,,,,,,,,2008-01-01,F,CUISINE CENTRALE,,,,56.29B,NAFRev2,N,,,0,,,,,,
263505851,00059,26350585100059,O,2003-01-01,22,2020,,2022-08-29T09:10:28,true,1,,,,,LES PRES BOSGER,35260,CANCALE,,BP 51,35049,,,,,,,,,,,,,,,,,,,2003-01-01,A,,,,,86.10Z,NAFRev2,O,-1.866415,48.682708,0.76,street,Rue des Prés Bosgers 35260 Cancale,35049_0909,G,RUE DES PRES BOSGERS,
263505851,00067,26350585100067,O,2003-01-01,,,,2015-01-07T16:57:03,false,1,,,,,LES PRES BOSGER,35260,CANCALE,,,35049,,,,,,,,,,,,,,,,,,,2003-01-01,A,EHPAD DE L'HOPITAL,,,,87.10A,NAFRev2,O,-1.866415,48.682708,0.76,street,Rue des Prés Bosgers 35260 Cancale,35049_0909,G,RUE DES PRES BOSGERS,
263505851,00075,26350585100075,O,2003-01-01,,,,2015-01-07T17:17:55,false,1,,,,,LES PRES BOSGER,35260,CANCALE,,,35049,,,,,,,,,,,,,,,,,,,2003-01-01,A,CUISINE CENTRALE,,,,56.29B,NAFRev2,N,-1.866415,48.682708,0.76,street,Rue des Prés Bosgers 35260 Cancale,35049_0909,G,RUE DES PRES BOSGERS,
273503599,00014,27350359900014,O,,,,,,true,1,,46,,RUE,DU PORT,35260,CANCALE,,,35049,,,,,,,,,,,,,,,,,,,1995-12-25,F,,,,,70.1C,NAF1993,N,-1.852548,48.674608,0.97,housenumber,46 Rue du Port 35260 Cancale,35049_0860_00046,G,46 RUE DU PORT,
273503607,00015,27350360700015,O,,,,,,true,1,,46,,RUE,DU PORT,35260,CANCALE,,,35049,,,,,,,,,,,,,,,,,,,1995-12-25,F,,,,,70.1C,NAF1993,N,-1.852548,48.674608,0.97,housenumber,46 Rue du Port 35260 Cancale,35049_0860_00046,G,46 RUE DU PORT,
273503631,00015,27350363100015,O,,,,,,true,1,,46,,RUE,DU PORT,35260,CANCALE,,,35049,,,,,,,,,,,,,,,,,,,1995-12-25,F,,,,,75.1A,NAF1993,N,-1.852548,48.674608,0.97,housenumber,46 Rue du Port 35260 Cancale,35049_0860_00046,G,46 RUE DU PORT,
300033966,00015,30003396600015,O,,,,,,true,1,,,,QUAI,DUGUAY TROUIN,35260,CANCALE,,,35049,,,,,,,,,,,,,,,,,,,1985-12-25,F,,,,,67.04,NAP,N,-1.857155,48.669717,0.96,street,Quai Duguay-Trouin 35260 Cancale,35049_0330,G,QUAI DUGUAY TROUIN,
300338712,00031,30033871200031,O,1991-04-01,NN,,,2008-10-03T07:49:43,false,4,,3,,PL,BRICOURT,35260,CANCALE,,,35049,,,,,,,,,,,,,,,,,,,2008-01-31,F,,,,,47.59B,NAFRev2,N,-1.851202,48.677441,0.82,housenumber,3 Place Bricourt 35260 Cancale,35049_0160_00003,G,3 PLACE BRICOURT,
300473337,00107,30047333700107,O,2012-07-20,,,,2017-06-20T04:47:03,false,2,RESIDENCE HAMON VAUJOYEUX,13,,RUE,NOEL ROYER,35260,CANCALE,,,35049,,,,,,,,,,,,,,,,,,,2017-06-19,F,CAMPO DEBARRAS,,,,47.89Z,NAFRev2,N,-1.849143,48.678266,0.96,housenumber,13 Rue Noel Royer 35260 Cancale,35049_0780_00013,G,13 RUE NOEL ROYER,
300766938,00017,30076693800017,O,,,,,,true,1,,,,RUE,DU PORT,35260,CANCALE,,,35049,,,,,,,,,,,,,,,,,,,1985-12-25,F,,,,,57.07,NAP,N,-1.852675,48.674359,0.97,street,Rue du Port 35260 Cancale,35049_0860,G,RUE DU PORT,
300805017,00013,30080501700013,O,,,,,,true,1,,,,,LA VILLE BALLET,35260,CANCALE,,,35049,,,,,,,,,,,,,,,,,,,1984-12-25,F,,,,,55.73,NAP,N,-1.867774,48.671086,0.95,street,La Ville Ballet 35260 Cancale,35049_C046,G,LA VILLE BALLET,
301137006,00021,30113700600021,O,1995-10-01,NN,,,2008-11-07T00:17:13,true,3,,22,,RUE,DU PORT,35260,CANCALE,,,35049,,,,,,,,,,,,,,,,,,,2005-04-21,F,,,,,93.0D,NAFRev1,N,-1.851473,48.676525,0.97,housenumber,22 Rue du Port 35260 Cancale,35049_0860_00022,G,22 RUE DU PORT,
301137014,00017,30113701400017,O,,,,,,true,1,,,,RUE,DU PORT,35260,CANCALE,,,35049,,,,,,,,,,,,,,,,,,,1984-12-25,F,,,,,67.05,NAP,N,-1.852675,48.674359,0.97,street,Rue du Port 35260 Cancale,35049_0860,G,RUE DU PORT,
301229134,00012,30122913400012,O,,NN,,,,true,1,,2,,QUAI,GAMBETTA,35260,CANCALE,,,35049,,,,,,,,,,,,,,,,,,,1999-03-04,F,,,,,70.2C,NAF1993,N,-1.853557,48.671213,0.96,housenumber,2 Quai Gambetta 35260 Cancale,35049_0430_00002,G,2 QUAI GAMBETTA,
301381042,00011,30138104200011,O,,,,,,true,1,,,,,PORT MER,35260,CANCALE,,,35049,,,,,,,,,,,,,,,,,,,1985-12-25,F,,,,,62.46,NAP,N,-1.851441,48.702809,0.95,street,Port Mer 35260 Cancale,35049_B871,G,PORT MER,
301766135,00018,30176613500018,O,,NN,,,,true,1,,8,,AV,GAL DE GAULLE,35260,CANCALE,,,35049,,,,,,,,,,,,,,,,,,,1996-09-30,F,,,,,74.8K,NAF1993,O,-1.854503,48.676536,0.8,housenumber,8 Avenue du Général de Gaulle 35260 Cancale,35049_0450_00008,G,8 AVENUE DU GENERAL DE GAULLE,
301926689,00029,30192668900029,O,,NN,,,,true,1,,16,,RUE,DU PORT,35260,CANCALE,,,35049,,,,,,,,,,,,,,,,,,,1989-12-31,F,,,,,67.01,NAP,N,-1.85142,48.676741,0.97,housenumber,16 Rue du Port 35260 Cancale,35049_0860_00016,G,16 RUE DU PORT,
302143375,00012,30214337500012,O,,,,,,true,1,,,,,PORT MER,35260,CANCALE,,,35049,,,,,,,,,,,,,,,,,,,1984-12-25,F,,,,,67.13,NAP,N,-1.851441,48.702809,0.95,street,Port Mer 35260 Cancale,35049_B871,G,PORT MER,
302546429,00051,30254642900051,O,2013-05-17,,,,2017-08-25T03:44:09,true,2,,59,,RUE,DU PORT,35260,CANCALE,,,35049,,,,,,,,,,,,,,,,,,,2017-08-31,F,,,,,47.89Z,NAFRev2,N,-1.85305,48.673241,0.97,housenumber,59 Rue du Port 35260 Cancale,35049_0860_00059,G,59 RUE DU PORT,
303531123,00014,30353112300014,O,1975-01-01,NN,,,,true,1,,13,,PL,DU CALVAIRE,35260,CANCALE,,,35049,,,,,,,,,,,,,,,,,,,1992-11-17,F,,,,,70.2C,NAF1993,N,-1.856447,48.670325,0.85,housenumber,13 Place du Calvaire 35260 Cancale,35049_0170_00013,G,13 PLACE DU CALVAIRE,
303634729,00030,30363472900030,O,1989-10-28,NN,,,,false,4,LA CORNICHE,,,RUE,ERNEST LAMORT,35260,CANCALE,,,35049,,,,,,,,,,,,,,,,,,,1994-03-15,F,GERANT SARL LA VOILERIE,,,,55.1D,NAF1993,N,-1.86288,48.668249,0.96,street,Rue Ernest Lamort 35260 Cancale,35049_0385,G,RUE ERNEST LAMORT,
303634729,00048,30363472900048,O,1994-03-15,NN,,,2006-12-15T00:15:27,false,4,,4,,,QU JACQUES CARTIER,35260,CANCALE,,,35049,,,,,,,,,,,,,,,,,,,1995-12-25,F,,,,,55.3A,NAF1993,O,-1.86145,48.668566,0.87,housenumber,4 Quai Jacques Cartier 35260 Cancale,35049_0570_00004,G,4 QUAI JACQUES CARTIER,
303634729,00055,30363472900055,O,1994-06-03,NN,,,,false,4,,28,,QUAI,GAMBETTA,35260,CANCALE,,,35049,,,,,,,,,,,,,,,,,,,1996-12-25,F,LA CRIEE,,,,55.3A,NAF1993,O,-1.855582,48.670796,0.96,housenumber,28 Quai Gambetta 35260 Cancale,35049_0430_00028,G,28 QUAI GAMBETTA,
303982219,00014,30398221900014,O,1964-01-01,NN,,,,true,1,,2,,RUE,SAINT MALO,35260,CANCALE,,,35049,,,,,,,,,,,,,,,,,,,2001-09-29,F,,,,,60.2E,NAF1993,N,-1.851484,48.677452,0.96,housenumber,2 Rue de Saint-Malo 35260 Cancale,35049_1020_00002,G,2 RUE DE SAINT MALO,
304206410,00025,30420641000025,O,,NN,,,,true,1,,,,,QUATREVAIS,35260,CANCALE,,,35049,,,,,,,,,,,,,,,,,,,1987-08-12,F,,,,,45.1A,NAF1993,N,-1.8708463,48.6797583,0.88,poi.bus_stop,Quatrevais (Arrêt de bus) Cancale,https://osm.org/node/1621674673,G,,
304467665,00028,30446766500028,O,1984-01-01,NN,,,,false,4,,8,,AV,GAL DE GAULLE,35260,CANCALE,,,35049,,,,,,,,,,,,,,,,,,,2001-04-01,F,,,,,85.1C,NAF1993,N,-1.854503,48.676536,0.8,housenumber,8 Avenue du Général de Gaulle 35260 Cancale,35049_0450_00008,G,8 AVENUE DU GENERAL DE GAULLE,
304467665,00036,30446766500036,O,2001-04-01,NN,,,2012-05-11T09:39:11,false,4,,5,,AV,GAL DE GAULLE,35260,CANCALE,,,35049,,,,,,,,,,,,,,,,,,,2012-04-30,F,,,,,86.21Z,NAFRev2,N,-1.854145,48.67631,0.8,housenumber,5 Avenue du Général de Gaulle 35260 Cancale,35049_0450_00005,G,5 AVENUE DU GENERAL DE GAULLE,
304467665,00093,30446766500093,O,2021-01-01,,,,2022-05-07T12:05:08,true,1,,11,,RUE,DE L HIRONDELLE,35260,CANCALE,,,35049,,,,,,,,,,,,,,,,,,,2021-01-01,A,,,,,86.21Z,NAFRev2,N,-1.859798,48.681937,0.96,housenumber,11 Rue de l’Hirondelle 35260 Cancale,35049_0548_00011,G,11 RUE DE L HIRONDELLE,
304525645,00012,30452564500012,O,1900-01-01,NN,,,,false,4,,5,,QUAI,GAMBETTA,35260,CANCALE,,,35049,,,,,,,,,,,,,,,,,,,1992-10-31,F,DEGUSTATION LE PROGRES,,,,55.3A,NAF1993,N,-1.853709,48.671209,0.96,housenumber,5 Quai Gambetta 35260 Cancale,35049_0430_00005,G,5 QUAI GAMBETTA,
304525645,00020,30452564500020,O,1989-05-19,NN,,,2013-05-18T02:30:22,true,7,,9,,PL,DU CALVAIRE,35260,CANCALE,,,35049,,,,,,,,,,,,,,,,,,,2012-05-16,F,,,,,56.10A,NAFRev2,O,-1.856372,48.670466,0.85,housenumber,9 Place du Calvaire 35260 Cancale,35049_0170_00009,G,9 PLACE DU CALVAIRE,
304549256,00036,30454925600036,O,,NN,,,,true,1,,79,,RUE,DU PORT,35260,CANCALE,,,35049,,,,,,,,,,,,,,,,,,,,F,,,,,55.72,NAP,N,-1.852928,48.672365,0.97,housenumber,79 Rue du Port 35260 Cancale,35049_0860_00079,G,79 RUE DU PORT,
304624414,00013,30462441400013,O,,NN,,,,true,1,,52,,RUE,SAINT MALO,35260,CANCALE,,,35049,,,,,,,,,,,,,,,,,,,1988-12-28,F,,,,,65.06,NAP,N,-1.855479,48.678436,0.96,housenumber,52 Rue de Saint-Malo 35260 Cancale,35049_1020_00052,G,52 RUE DE SAINT MALO,
304739626,00014,30473962600014,O,1977-01-01,NN,,,,true,4,,2,,RUE,DU STADE,35260,CANCALE,,,35049,,,,,,,,,,,,,,,,,,,2002-03-05,F,,,,,51.3J,NAF1993,O,-1.853066,48.679214,0.96,housenumber,2 Rue du Stade 35260 Cancale,35049_1064_00002,G,2 RUE DU STADE,