siren,nic,siret,statutDiffusionEtablissement,dateCreationEtablissement,trancheEffectifsEtablissement,anneeEffectifsEtablissement,activitePrincipaleRegistreMetiersEtablissement,dateDernierTraitementEtablissement,etablissementSiege,nombrePeriodesEtablissement,complementAdresseEtablissement,numeroVoieEtablissement,indiceRepetitionEtablissement,typeVoieEtablissement,libelleVoieEtablissement,codePostalEtablissement,libelleCommuneEtablissement,libelleCommuneEtrangerEtablissement,distributionSpecialeEtablissement,codeCommuneEtablissement,codeCedexEtablissement,libelleCedexEtablissement,codePaysEtrangerEtablissement,libellePaysEtrangerEtablissement,complementAdresse2Etablissement,numeroVoie2Etablissement,indiceRepetition2Etablissement,typeVoie2Etablissement,libelleVoie2Etablissement,codePostal2Etablissement,libelleCommune2Etablissement,libelleCommuneEtranger2Etablissement,distributionSpeciale2Etablissement,codeCommune2Etablissement,codeCedex2Etablissement,libelleCedex2Etablissement,codePaysEtranger2Etablissement,libellePaysEtranger2Etablissement,dateDebut,etatAdministratifEtablissement,enseigne1Etablissement,enseigne2Etablissement,enseigne3Etablissement,denominationUsuelleEtablissement,activitePrincipaleEtablissement,nomenclatureActivitePrincipaleEtablissement,caractereEmployeurEtablissement,longitude,latitude,geo_score,geo_type,geo_adresse,geo_id,geo_ligne,geo_l4,geo_l5
130005291,00013,13000529100013,O,2007-08-10,NN,,,2018-01-22T14:43:15,true,3,LYCEE DU BOIS,,,RUE,DE STRASBOURG,39330,MOUCHARD,,,39370,,,,,,,,,,,,,,,,,,,2016-03-01,F,,,,,84.13Z,NAFRev2,O,5.797512,46.974599,0.96,street,Rue de Strasbourg 39330 Mouchard,39370_0280,G,RUE DE STRASBOURG,
193900297,00014,19390029700014,O,1983-03-01,21,2020,,2022-08-29T09:04:27,true,4,,,,RUE,DE STRASBOURG,39330,MOUCHARD,,,39370,,,,,,,,,,,,,,,,,,,2016-01-31,A,,,,,85.31Z,NAFRev2,O,5.797512,46.974599,0.96,street,Rue de Strasbourg 39330 Mouchard,39370_0280,G,RUE DE STRASBOURG,
213900871,00012,21390087100012,O,1983-03-01,NN,,,2008-09-08T09:14:50,true,4,MAIRIE,27,,RUE,DE STRASBOURG,39330,MOUCHARD,,,39370,,,,,,,,,,,,,,,,,,,2008-01-01,F,,,,,84.11Z,NAFRev2,N,5.797484,46.975049,0.96,housenumber,27 Rue de Strasbourg 39330 Mouchard,39370_0280_00027,G,27 RUE DE STRASBOURG,
213903701,00018,21390370100018,O,1983-03-01,01,2020,,2022-08-29T09:07:08,true,4,,27,,RUE,DE STRASBOURG,39330,MOUCHARD,,,39370,,,,,,,,,,,,,,,,,,,2008-01-01,A,MAIRIE,,,,84.11Z,NAFRev2,O,5.797484,46.975049,0.96,housenumber,27 Rue de Strasbourg 39330 Mouchard,39370_0280_00027,G,27 RUE DE STRASBOURG,
213903701,00026,21390370100026,O,1983-12-21,NN,,,,false,4,,,,RUE,DE CERTEMERY,39330,MOUCHARD,,,39370,,,,,,,,,,,,,,,,,,,1996-12-25,F,ECOLE MATERNELLE PUBLIQUE,,,,80.1Z,NAF1993,N,5.795455,46.976893,0.95,street,Rue de Certemery 39330 Mouchard,39370_0060,G,RUE DE CERTEMERY,
213903701,00034,21390370100034,O,1983-12-21,02,2020,,2022-08-29T09:07:08,false,4,,1,,RUE,ALIXANT,39330,MOUCHARD,,,39370,,,,,,,,,,,,,,,,,,,2008-01-01,A,ECOLE PRIMAIRE PUBLIQUE,,,,85.20Z,NAFRev2,N,5.797511,46.97639,0.87,housenumber,1 Rue Léopold Alixant 39330 Mouchard,39370_b061_00001,G,1 RUE LEOPOLD ALIXANT,
213903701,00042,21390370100042,O,1996-12-25,NN,,,,false,4,MAIRIE,,,,,39330,MOUCHARD,,,39370,,,,,,,,,,,,,,,,,,,2003-12-25,F,SERVICE ORDURES MENAGERES,,,,90.0B,NAFRev1,N,,,0,,,,,,
213903701,00059,21390370100059,O,1996-12-25,NN,,,2018-09-07T11:16:40,false,3,MAIRIE,27,,RUE,DE STRASBOURG,39330,MOUCHARD,,,39370,,,,,,,,,,,,,,,,,,,2017-01-01,F,SERVICE ASSAINISSEMENT,,,,37.00Z,NAFRev2,N,5.797484,46.975049,0.96,housenumber,27 Rue de Strasbourg 39330 Mouchard,39370_0280_00027,G,27 RUE DE STRASBOURG,
253900443,00016,25390044300016,O,1983-03-01,NN,,,2019-06-24T13:13:32,true,4,MAIRIE,27,,RUE,DE STRASBOURG,39330,MOUCHARD,,,39370,,,,,,,,,,,,,,,,,,,2017-01-01,F,,,,,84.12Z,NAFRev2,N,5.797484,46.975049,0.96,housenumber,27 Rue de Strasbourg 39330 Mouchard,39370_0280_00027,G,27 RUE DE STRASBOURG,
263903700,00015,26390370000015,O,1983-03-01,NN,,,2010-06-26T03:09:21,true,3,MAIRIE,27,,RUE,DE STRASBOURG,39330,MOUCHARD,,,39370,,,,,,,,,,,,,,,,,,,2008-01-01,A,CCAS,,,,88.99B,NAFRev2,N,5.797484,46.975049,0.96,housenumber,27 Rue de Strasbourg 39330 Mouchard,39370_0280_00027,G,27 RUE DE STRASBOURG,
263906646,00017,26390664600017,O,1956-01-01,,,,,true,1,,,,,MAIRIE,39330,MOUCHARD,,,39370,,,,,,,,,,,,,,,,,,,2001-10-10,F,,,,,85.3K,NAF1993,N,3.0709671,50.6304695,0.92,poi.townhall,Hôtel de Ville Lille,https://osm.org/way/40917078,G,,
273900266,00019,27390026600019,O,,,,,,true,1,,,,,MAIRIE,39330,MOUCHARD,,,39370,,,,,,,,,,,,,,,,,,,1995-12-25,F,,,,,75.1A,NAF1993,N,3.0709671,50.6304695,0.92,poi.townhall,Hôtel de Ville Lille,https://osm.org/way/40917078,G,,
273900274,00013,27390027400013,O,,,,,,true,1,,,,,MAIRIE,39330,MOUCHARD,,,39370,,,,,,,,,,,,,,,,,,,1995-12-25,F,,,,,75.1A,NAF1993,N,3.0709671,50.6304695,0.92,poi.townhall,Hôtel de Ville Lille,https://osm.org/way/40917078,G,,
301358099,00010,30135809900010,O,,,,,,true,1,,30,,RUE,DE STRASBOURG,39330,MOUCHARD,,,39370,,,,,,,,,,,,,,,,,,,1985-12-25,F,,,,,67.04,NAP,N,5.797393,46.975131,0.96,housenumber,30 Rue de Strasbourg 39330 Mouchard,39370_0280_00030,G,30 RUE DE STRASBOURG,
302034863,00068,30203486300068,O,1994-11-01,NN,,,2012-08-16T05:27:04,true,4,,26,,RUE,DE STRASBOURG,39330,MOUCHARD,,,39370,,,,,,,,,,,,,,,,,,,2012-03-02,F,,,,,69.10Z,NAFRev2,N,5.797491,46.97533,0.96,housenumber,26 Rue de Strasbourg 39330 Mouchard,39370_0280_00026,G,26 RUE DE STRASBOURG,
302271143,00018,30227114300018,O,1975-01-01,NN,,,,true,4,,2,,RUE,DE LA REPUBLIQUE,39330,MOUCHARD,,,39370,,,,,,,,,,,,,,,,,,,2003-12-15,F,,,,,55.1A,NAFRev1,O,5.799011,46.976491,0.95,housenumber,2 Rue de la République 39330 Mouchard,39370_0220_00002,G,2 RUE DE LA REPUBLIQUE,
303452064,00015,30345206400015,O,1975-01-01,NN,,,2007-07-13T19:04:48,true,3,,8,,RUE,ALIXANT,39330,MOUCHARD,,,39370,,,,,,,,,,,,,,,,,,,2007-06-30,F,,,,,52.4N,NAFRev1,N,5.797499,46.975494,0.87,housenumber,8 Rue Léopold Alixant 39330 Mouchard,39370_b061_00008,G,8 RUE LEOPOLD ALIXANT,
304526411,00018,30452641100018,O,1900-01-01,NN,,,2010-09-03T15:37:35,true,4,,14,,RUE,DE STRASBOURG,39330,MOUCHARD,,,39370,,,,,,,,,,,,,,,,,,,2009-12-25,F,,,,,68.20B,NAFRev2,N,5.798293,46.976065,0.96,housenumber,14 Rue de Strasbourg 39330 Mouchard,39370_0280_00014,G,14 RUE DE STRASBOURG,
305902389,00017,30590238900017,O,1976-01-01,NN,,,2008-01-04T19:38:55,true,3,PORT LESNEY,,,QUAI,BEL AIR,39330,MOUCHARD,,,39370,,,,,,,,,,,,,,,,,,,2008-01-01,A,,,,,68.20B,NAFRev2,N,5.804644,46.978207,0.41,street,Rue du Bel Air 39330 Mouchard,39370_0026,G,RUE DU BEL AIR,
305966756,00010,30596675600010,O,1976-01-01,NN,,,2010-09-03T15:40:17,true,4,PORT LESNEY,,,QUAI,BEL AIR,39330,MOUCHARD,,,39370,,,,,,,,,,,,,,,,,,,2009-12-25,F,,,,,68.20B,NAFRev2,N,5.804644,46.978207,0.41,street,Rue du Bel Air 39330 Mouchard,39370_0026,G,RUE DU BEL AIR,
305966871,00017,30596687100017,O,1976-01-01,NN,,,,true,1,,,,QUAI,BEL AIR,39330,MOUCHARD,,,39370,,,,,,,,,,,,,,,,,,,2000-03-18,F,,,,,70.2C,NAF1993,N,5.804644,46.978207,0.41,street,Rue du Bel Air 39330 Mouchard,39370_0026,G,RUE DU BEL AIR,
306676602,00031,30667660200031,O,1900-01-01,NN,,,2011-04-28T00:12:14,false,3,,70,,RUE,DE STRASBOURG,39330,MOUCHARD,,,39370,,,,,,,,,,,,,,,,,,,1992-07-01,F,,,,,85.1G,NAF1993,N,5.796516,46.97318,0.96,housenumber,70 Rue de Strasbourg 39330 Mouchard,39370_0280_00070,G,70 RUE DE STRASBOURG,
306845603,00019,30684560300019,O,,,,,,true,1,,13,,RUE,DE STRASBOURG,39330,MOUCHARD,,,39370,,,,,,,,,,,,,,,,,,,1985-12-25,F,,,,,64.41,NAP,N,5.79815,46.975842,0.96,housenumber,13 Rue de Strasbourg 39330 Mouchard,39370_0280_00013,G,13 RUE DE STRASBOURG,
310332440,00034,31033244000034,O,1986-11-02,NN,,,,true,1,,68,,RUE,DE STRASBOURG,39330,MOUCHARD,,,39370,,,,,,,,,,,,,,,,,,,1999-06-30,F,,,,,45.3F,NAF1993,O,5.796656,46.973573,0.96,housenumber,68 Rue de Strasbourg 39330 Mouchard,39370_0280_00068,G,68 RUE DE STRASBOURG,
310413182,00018,31041318200018,O,1900-01-01,NN,,,2011-01-25T06:01:43,true,4,,13,,RUE,DE LA TUILERIE,39330,MOUCHARD,,,39370,,,,,,,,,,,,,,,,,,,2008-08-31,F,,,,,68.20A,NAFRev2,N,5.792728,46.978593,0.95,housenumber,13 Rue de la Tuilerie 39330 Mouchard,39370_0300_00013,G,13 RUE DE LA TUILERIE,
311174452,00020,31117445200020,O,1984-11-27,NN,,,2010-04-18T03:36:15,false,5,,8,,RUE,STRASBOURG,39330,MOUCHARD,,,39370,,,,,,,,,,,,,,,,,,,2008-06-30,F,,,,,49.32Z,NAFRev2,O,5.798569,46.976268,0.95,housenumber,8 Rue de Strasbourg 39330 Mouchard,39370_0280_00008,G,8 RUE DE STRASBOURG,
311174452,00038,31117445200038,O,2008-06-30,NN,,,2014-06-14T00:25:17,true,2,,3,,RUE,DE LA COMBE BOUTON,39330,MOUCHARD,,,39370,,,,,,,,,,,,,,,,,,,2012-03-12,F,,,,,49.32Z,NAFRev2,O,5.791305,46.978218,0.95,housenumber,3 Rue de la Combe Bouton 39330 Mouchard,39370_0090_00003,G,3 RUE DE LA COMBE BOUTON,
311418958,00030,31141895800030,O,1983-07-01,NN,,,,false,3,,70,,RUE,DE STRASBOURG,39330,MOUCHARD,,,39370,,,,,,,,,,,,,,,,,,,1993-12-31,F,,,,,85.1G,NAF1993,N,5.796516,46.97318,0.96,housenumber,70 Rue de Strasbourg 39330 Mouchard,39370_0280_00070,G,70 RUE DE STRASBOURG,
311778468,00034,31177846800034,O,1996-06-11,NN,,,2010-09-01T13:38:01,false,4,,35,,RUE,DE STRASBOURG,39330,MOUCHARD,,,39370,,,,,,,,,,,,,,,,,,,2010-03-31,F,,,,,85.53Z,NAFRev2,N,5.797298,46.974587,0.96,housenumber,35 Rue de Strasbourg 39330 Mouchard,39370_0280_00035,G,35 RUE DE STRASBOURG,
312126659,00027,31212665900027,O,1986-07-01,NN,,,2006-11-25T09:29:52,false,4,,20,,RUE,DE LA RAIPROZ,39330,MOUCHARD,,,39370,,,,,,,,,,,,,,,,,,,1997-03-26,F,,,,,85.1G,NAF1993,O,5.795687,46.970617,0.95,housenumber,20 Rue de la Raiproz 39330 Mouchard,39370_0214_00020,G,20 RUE DE LA RAIPROZ,
312126659,00035,31212665900035,O,1997-03-26,NN,,,2016-09-15T14:25:01,false,4,,1,,RUE,DE STRASBOURG,39330,MOUCHARD,,,39370,,,,,,,,,,,,,,,,,,,2014-04-11,F,,,,,86.90D,NAFRev2,O,5.798777,46.976311,0.96,housenumber,1 Rue de Strasbourg 39330 Mouchard,39370_0280_00001,G,1 RUE DE STRASBOURG,
312126659,00043,31212665900043,O,2014-04-11,11,2020,,2022-08-29T09:13:53,true,1,,11,,RUE,DE STRASBOURG,39330,MOUCHARD,,,39370,,,,,,,,,,,,,,,,,,,2014-04-11,A,,,,,86.90D,NAFRev2,O,5.798178,46.975862,0.96,housenumber,11 Rue de Strasbourg 39330 Mouchard,39370_0280_00011,G,11 RUE DE STRASBOURG,
313042632,00031,31304263200031,O,1985-01-01,NN,,,2008-11-07T00:28:17,false,4,,12,,RUE,DES ROSIERS,39330,MOUCHARD,,,39370,,,,,,,,,,,,,,,,,,,2001-12-31,F,,,,,51.5F,NAF1993,O,5.798347,46.972168,0.95,housenumber,12 Rue des Rosiers 39330 Mouchard,39370_0240_00012,G,12 RUE DES ROSIERS,
313042632,00049,31304263200049,O,2003-02-13,02,2020,0812ZZ,2022-08-29T09:14:11,true,4,,,,RTE,DE CRAMANS,39330,MOUCHARD,,,39370,,,,,,,,,,,,,,,,,,,2008-01-01,A,,,,,46.73A,NAFRev2,O,5.794767,46.981736,0.83,street,Route de Cramans 39330 Mouchard,39370_0247,G,ROUTE DE CRAMANS,
313563496,00030,31356349600030,O,,NN,,,,true,1,,74,,RUE,DE STRASBOURG,39330,MOUCHARD,,,39370,,,,,,,,,,,,,,,,,,,1997-12-31,F,,,,,52.6D,NAF1993,O,5.796243,46.972274,0.96,housenumber,74 Rue de Strasbourg 39330 Mouchard,39370_0280_00074,G,74 RUE DE STRASBOURG,
313998072,00026,31399807200026,O,,NN,,,,true,1,,37,,RUE,DE STRASBOURG,39330,MOUCHARD,,,39370,,,,,,,,,,,,,,,,,,,,F,,,,,82.06,NAP,N,5.797264,46.974487,0.96,housenumber,37 Rue de Strasbourg 39330 Mouchard,39370_0280_00037,G,37 RUE DE STRASBOURG,
314336025,00031,31433602500031,O,1984-06-19,NN,,,2010-11-16T00:11:08,false,3,,25,,RUE,DE LA REPUBLIQUE,39330,MOUCHARD,,,39370,,,,,,,,,,,,,,,,,,,1994-12-25,F,,,,,85.1C,NAF1993,N,5.798495,46.976517,0.95,housenumber,25 Rue de la République 39330 Mouchard,39370_0220_00025,G,25 RUE DE LA REPUBLIQUE,
315730358,00019,31573035800019,O,,,,,2006-10-08T04:15:26,true,1,,7,,RUE,RAIPROZ,39330,MOUCHARD,,,39370,,,,,,,,,,,,,,,,,,,1997-01-01,F,,,,,74.1G,NAF1993,N,5.795635,46.971975,0.87,housenumber,7 Rue de la Raiproz 39330 Mouchard,39370_0214_00007,G,7 RUE DE LA RAIPROZ,
317195188,00030,31719518800030,O,1979-08-01,,,,,true,4,,70,,RUE,DE STRASBOURG,39330,MOUCHARD,,,39370,,,,,,,,,,,,,,,,,,,1995-12-25,F,,,,,74.8K,NAF1993,N,5.796516,46.97318,0.96,housenumber,70 Rue de Strasbourg 39330 Mouchard,39370_0280_00070,G,70 RUE DE STRASBOURG,
318695301,00040,31869530100040,O,,NN,,,,true,1,,1,,RUE,DE LA REPUBLIQUE,39330,MOUCHARD,,,39370,,,,,,,,,,,,,,,,,,,1996-08-30,F,,,,,50.1Z,NAF1993,O,5.803381,46.975893,0.95,housenumber,1 Rue de la République 39330 Mouchard,39370_0220_00001,G,1 RUE DE LA REPUBLIQUE,
319869749,00055,31986974900055,O,1988-09-15,NN,,,2009-09-04T10:51:56,false,4,,23,,RUE,DE LA REPUBLIQUE,39330,MOUCHARD,,,39370,,,,,,,,,,,,,,,,,,,1993-02-12,F,,,,,52.4Z,NAF1993,N,5.798956,46.9764,0.95,housenumber,23 Rue de la République 39330 Mouchard,39370_0220_00023,G,23 RUE DE LA REPUBLIQUE,
319869749,00063,31986974900063,O,2009-09-01,,,,2021-02-23T10:44:03,true,1,,5,,RUE,A BRIAND,39330,MOUCHARD,,,39370,,,,,,,,,,,,,,,,,,,2009-09-01,A,,,,,70.22Z,NAFRev2,N,5.79774,46.973055,0.82,housenumber,5 Rue Aristide Briand 39330 Mouchard,39370_0020_00005,G,5 RUE ARISTIDE BRIAND,
319869871,00016,31986987100016,O,,,,,,true,1,,21,,RUE,DE LA REPUBLIQUE,39330,MOUCHARD,,,39370,,,,,,,,,,,,,,,,,,,,F,,,,,67.08,NAP,N,5.799127,46.976396,0.95,housenumber,21 Rue de la République 39330 Mouchard,39370_0220_00021,G,21 RUE DE LA REPUBLIQUE,
320139835,00039,32013983500039,O,,,,,,true,1,,35,,RUE,DE STRASBOURG,39330,MOUCHARD,,,39370,,,,,,,,,,,,,,,,,,,1985-12-25,F,,,,,82.06,NAP,N,5.797298,46.974587,0.96,housenumber,35 Rue de Strasbourg 39330 Mouchard,39370_0280_00035,G,35 RUE DE STRASBOURG,
320232937,00013,32023293700013,O,1980-09-24,NN,,,2008-11-07T00:36:14,false,4,,18,,RUE,DE STRASBOURG,39330,MOUCHARD,,,39370,,,,,,,,,,,,,,,,,,,2004-07-12,F,,,,,93.0D,NAFRev1,O,5.798013,46.975859,0.96,housenumber,18 Rue de Strasbourg 39330 Mouchard,39370_0280_00018,G,18 RUE DE STRASBOURG,
320277189,00017,32027718900017,O,,NN,,,,true,1,,10,,RUE,DE LA REPUBLIQUE,39330,MOUCHARD,,,39370,,,,,,,,,,,,,,,,,,,,F,,,,,82.06,NAP,N,5.798138,46.976701,0.95,housenumber,10 Rue de la République 39330 Mouchard,39370_0220_00010,G,10 RUE DE LA REPUBLIQUE,
320277403,00038,32027740300038,O,1991-04-30,NN,,,,true,3,ZONE ARTISANALE,,,RTE,DE CRAMANS,39330,MOUCHARD,,,39370,,,,,,,,,,,,,,,,,,,1999-12-25,F,,,,,70.2C,NAF1993,N,5.794767,46.981736,0.83,street,Route de Cramans 39330 Mouchard,39370_0247,G,ROUTE DE CRAMANS,
320398852,00030,32039885200030,O,1988-02-01,NN,,,,false,3,,1,,RUE,MOUFFETARD,39330,MOUCHARD,,,39370,,,,,,,,,,,,,,,,,,,1993-12-13,F,,,,,93.0N,NAF1993,N,5.798604,46.974996,0.95,housenumber,1 Rue Mouffetard 39330 Mouchard,39370_0180_00001,G,1 RUE MOUFFETARD,
321066383,00043,32106638300043,O,,,,,,true,1,,1,,RUE,DU MONTAUBIN,39330,MOUCHARD,,,39370,,,,,,,,,,,,,,,,,,,1997-09-12,F,,,,,36.1G,NAF1993,N,5.794764,46.977027,0.95,housenumber,1 Rue du Montaubin 39330 Mouchard,39370_0160_00001,G,1 RUE DU MONTAUBIN,
321328056,00031,32132805600031,O,2002-05-13,NN,,,2006-11-25T09:49:25,false,3,,4,,RUE,DE LA CROIX ROUSSE,39330,MOUCHARD,,,39370,,,,,,,,,,,,,,,,,,,2003-09-01,F,,,,,52.5Z,NAFRev1,N,5.798507,46.974397,0.95,housenumber,4 Rue de la Croix-Rousse 39330 Mouchard,39370_0100_00004,G,4 RUE DE LA CROIX ROUSSE,
321491904,00025,32149190400025,O,1997-10-20,NN,,,2014-07-08T00:25:37,false,4,,11,,RUE,DE LA REPUBLIQUE,39330,MOUCHARD,,,39370,,,,,,,,,,,,,,,,,,,2008-09-22,F,,,,,49.32Z,NAFRev2,N,5.800996,46.976329,0.95,housenumber,11 Rue de la République 39330 Mouchard,39370_0220_00011,G,11 RUE DE LA REPUBLIQUE,
321788762,00029,32178876200029,O,1983-04-01,NN,,4399CZ,2019-06-24T13:21:21,false,5,CERTEMERY,,,,,39330,MOUCHARD,,,39370,,,,,,,,,,,,,,,,,,,2017-05-31,F,,,,,43.99C,NAFRev2,O,5.795455,46.976893,0.93,street,Rue de Certemery 39330 Mouchard,39370_0060,D,RUE DE CERTEMERY,
321788762,00045,32178876200045,O,2017-06-01,,,,2021-03-06T03:32:09,true,2,,,,HAM,DE CERTEMERY,39330,MOUCHARD,,,39370,,,,,,,,,,,,,,,,,,,2021-03-31,F,,,,,68.20B,NAFRev2,N,5.795455,46.976893,0.94,street,Rue de Certemery 39330 Mouchard,39370_0060,G,RUE DE CERTEMERY,
323269753,00022,32326975300022,O,1987-08-01,NN,,,2006-12-15T00:21:47,false,4,,4,,RUE,DE STRASBOURG,39330,MOUCHARD,,,39370,,,,,,,,,,,,,,,,,,,1995-12-25,F,,,,,52.4R,NAF1993,O,5.798673,46.976336,0.96,housenumber,4 Rue de Strasbourg 39330 Mouchard,39370_0280_00004,G,4 RUE DE STRASBOURG,
323463349,00015,32346334900015,O,,NN,,,,true,1,,14,,RUE,DE LA REPUBLIQUE,39330,MOUCHARD,,,39370,,,,,,,,,,,,,,,,,,,,F,,,,,64.11,NAP,N,5.79771,46.976812,0.95,housenumber,14 Rue de la République 39330 Mouchard,39370_0220_00014,G,14 RUE DE LA REPUBLIQUE,
323634915,00017,32363491500017,O,,,,,,true,1,,68,,RUE,DE STRASBOURG,39330,MOUCHARD,,,39370,,,,,,,,,,,,,,,,,,,,F,,,,,65.03,NAP,N,5.796656,46.973573,0.96,housenumber,68 Rue de Strasbourg 39330 Mouchard,39370_0280_00068,G,68 RUE DE STRASBOURG,
324406453,00013,32440645300013,O,1982-04-01,NN,,,2015-03-12T03:24:49,true,4,,3,,RUE,ALIXANT,39330,MOUCHARD,,,39370,,,,,,,,,,,,,,,,,,,2015-02-27,F,,,,,47.71Z,NAFRev2,N,5.797667,46.976126,0.87,housenumber,3 Rue Léopold Alixant 39330 Mouchard,39370_b061_00003,G,3 RUE LEOPOLD ALIXANT,
325079234,00010,32507923400010,O,,,,,,true,1,,1,,RUE,DE MONTAUBIN,39330,MOUCHARD,,,39370,,,,,,,,,,,,,,,,,,,,F,,,,,64.22,NAP,N,5.794764,46.977027,0.81,housenumber,1 Rue du Montaubin 39330 Mouchard,39370_0160_00001,G,1 RUE DU MONTAUBIN,
325294668,00034,32529466800034,O,2009-02-16,NN,,1085ZZ,2017-06-23T07:58:58,true,3,,1,,RUE,DE LA GARE,39330,MOUCHARD,,,39370,,,,,,,,,,,,,,,,,,,2016-07-22,F,,,,,56.10A,NAFRev2,N,5.800075,46.97658,0.94,housenumber,1 Rue de la Gare 39330 Mouchard,39370_iul2nr_00001,G,1 RUE DE LA GARE,
325932267,00033,32593226700033,O,1986-01-01,NN,,,2008-01-04T19:12:01,false,3,,27,,,REPUBLIQUE,39330,MOUCHARD,,,39370,,,,,,,,,,,,,,,,,,,2008-01-01,A,,,,,73.20Z,NAFRev2,N,5.797937,46.976672,0.94,housenumber,27 Rue de la République 39330 Mouchard,39370_0220_00027,G,27 RUE DE LA REPUBLIQUE,
326197167,00025,32619716700025,O,,,,,,true,1,,3,,RUE,DE MONTAUBIN,39330,MOUCHARD,,,39370,,,,,,,,,,,,,,,,,,,1984-12-25,F,,,,,15.13,NAP,N,5.793878,46.977126,0.81,housenumber,3 Rue du Montaubin 39330 Mouchard,39370_0160_00003,G,3 RUE DU MONTAUBIN,
326372851,00013,32637285100013,O,,NN,,,,true,1,,14,,RUE,DE LA REPUBLIQUE,39330,MOUCHARD,,,39370,,,,,,,,,,,,,,,,,,,1991-05-10,F,,,,,45.4C,NAF1993,N,5.79771,46.976812,0.95,housenumber,14 Rue de la République 39330 Mouchard,39370_0220_00014,G,14 RUE DE LA REPUBLIQUE,
327811584,00017,32781158400017,O,,,,,,true,1,,15,,RUE,DE STRASBOURG,39330,MOUCHARD,,,39370,,,,,,,,,,,,,,,,,,,1992-11-24,F,,,,,52.2C,NAF1993,N,5.797644,46.975424,0.96,housenumber,15 Rue de Strasbourg 39330 Mouchard,39370_0280_00015,G,15 RUE DE STRASBOURG,
328300967,00010,32830096700010,O,,NN,,,,true,1,,26,,RUE,DE STRASBOURG,39330,MOUCHARD,,,39370,,,,,,,,,,,,,,,,,,,1991-12-31,F,,,,,64.11,NAP,N,5.797491,46.97533,0.96,housenumber,26 Rue de Strasbourg 39330 Mouchard,39370_0280_00026,G,26 RUE DE STRASBOURG,
328530670,00012,32853067000012,O,,NN,,,,true,1,,2,,RUE,MOUFFETARD,39330,MOUCHARD,,,39370,,,,,,,,,,,,,,,,,,,1989-03-31,F,,,,,60.09,NAP,N,5.797793,46.975109,0.95,housenumber,2 Rue Mouffetard 39330 Mouchard,39370_0180_00002,G,2 RUE MOUFFETARD,
328938196,00016,32893819600016,O,1983-08-01,NN,,,,true,1,,,,,QUARTIER BEL AIR,39330,MOUCHARD,,,39370,,,,,,,,,,,,,,,,,,,1999-12-31,F,,,,,70.2C,NAF1993,N,5.804644,46.978207,0.34,street,Rue du Bel Air 39330 Mouchard,39370_0026,G,RUE DU BEL AIR,
329113278,00017,32911327800017,O,,NN,,,,true,1,,1,,RUE,DE LA REPUBLIQUE,39330,MOUCHARD,,,39370,,,,,,,,,,,,,,,,,,,1994-03-31,F,,,,,50.2Z,NAF1993,O,5.803381,46.975893,0.95,housenumber,1 Rue de la République 39330 Mouchard,39370_0220_00001,G,1 RUE DE LA REPUBLIQUE,
329863559,00020,32986355900020,O,1984-10-01,NN,,,2016-09-19T03:27:59,false,4,,16,,LOT,PASTEUR,39330,MOUCHARD,,,39370,,,,,,,,,,,,,,,,,,,1996-12-31,F,,,,,45.3A,NAF1993,O,5.793492,46.971771,0.52,housenumber,16 Rue Pasteur 39330 Mouchard,39370_0210_00016,G,16 RUE PASTEUR,
329863559,00038,32986355900038,O,1996-06-30,NN,,4321AB,2020-08-25T10:34:03,true,4,,6,,RUE,DU MOULIN,39330,MOUCHARD,,,39370,,,,,,,,,,,,,,,,,,,2018-06-30,F,,,,,43.21A,NAFRev2,O,5.793575,46.972677,0.95,housenumber,6 Rue du Moulin 39330 Mouchard,39370_0200_00006,G,6 RUE DU MOULIN,
330206137,00011,33020613700011,O,,,,,,true,1,,23,,RUE,DE LA REPUBLIQUE,39330,MOUCHARD,,,39370,,,,,,,,,,,,,,,,,,,1985-12-25,F,,,,,66.02,NAP,N,5.798956,46.9764,0.95,housenumber,23 Rue de la République 39330 Mouchard,39370_0220_00023,G,23 RUE DE LA REPUBLIQUE,
330562257,00015,33056225700015,O,1984-07-01,NN,,,2008-11-07T00:49:03,false,4,,16,,RUE,DE LA REPUBLIQUE,39330,MOUCHARD,,,39370,,,,,,,,,,,,,,,,,,,2003-08-18,F,,,,,45.3F,NAFRev1,N,5.797564,46.976851,0.95,housenumber,16 Rue de la République 39330 Mouchard,39370_0220_00016,G,16 RUE DE LA REPUBLIQUE,
330562257,00023,33056225700023,O,2003-08-18,,,,2013-04-04T03:52:02,true,4,,8,,RUE,DE CERTEMERY,39330,MOUCHARD,,,39370,,,,,,,,,,,,,,,,,,,2013-03-31,F,,,,,43.22B,NAFRev2,O,5.795229,46.977004,0.95,housenumber,8 Rue de Certemery 39330 Mouchard,39370_0060_00008,G,8 RUE DE CERTEMERY,
331524132,00023,33152413200023,O,,NN,,,,true,1,,35,,RUE,DE STRASBOURG,39330,MOUCHARD,,,39370,,,,,,,,,,,,,,,,,,,1997-07-25,F,,,,,52.7C,NAF1993,N,5.797298,46.974587,0.96,housenumber,35 Rue de Strasbourg 39330 Mouchard,39370_0280_00035,G,35 RUE DE STRASBOURG,
331793729,00012,33179372900012,O,,NN,,,,true,1,,39,,RUE,DE STRASBOURG,39330,MOUCHARD,,,39370,,,,,,,,,,,,,,,,,,,1989-03-31,F,,,,,64.45,NAP,N,5.79721,46.974441,0.96,housenumber,39 Rue de Strasbourg 39330 Mouchard,39370_0280_00039,G,39 RUE DE STRASBOURG,
332609544,00025,33260954400025,O,,NN,,,,true,1,,47,,RUE,DE LA REPUBLIQUE,39330,MOUCHARD,,,39370,,,,,,,,,,,,,,,,,,,1997-12-31,F,,,,,60.2E,NAF1993,O,5.794405,46.978945,0.95,housenumber,47 Rue de la République 39330 Mouchard,39370_0220_00047,G,47 RUE DE LA REPUBLIQUE,
334061348,00028,33406134800028,O,,,,,,true,1,,3,,RTE,DE CRAMANS,39330,MOUCHARD,,,39370,,,,,,,,,,,,,,,,,,,1987-09-30,F,,,,,24.03,NAP,N,5.794392,46.981086,0.84,housenumber,3 Route de Cramans 39330 Mouchard,39370_0247_00003,G,3 ROUTE DE CRAMANS,
334161494,00037,33416149400037,O,1992-10-01,,,,2006-11-25T10:25:11,false,3,,,,RUE,DU SQUARE ALIXANT,39330,MOUCHARD,,,39370,,,,,,,,,,,,,,,,,,,1993-09-16,F,,,,,92.3B,NAF1993,N,5.796756,46.97569,0.63,street,Square Alixant 39330 Mouchard,39370_ijkhne,G,SQUARE ALIXANT,
334660263,00016,33466026300016,O,,NN,,,,true,1,,43,,RUE,DE LA REPUBLIQUE,39330,MOUCHARD,,,39370,,,,,,,,,,,,,,,,,,,1997-07-11,F,,,,,45.3E,NAF1993,N,5.794998,46.978457,0.95,housenumber,43 Rue de la République 39330 Mouchard,39370_0220_00043,G,43 RUE DE LA REPUBLIQUE,
334841277,00018,33484127700018,O,1985-12-09,NN,,,2008-11-07T00:55:17,false,4,,14,,RUE,DE STRASBOURG,39330,MOUCHARD,,,39370,,,,,,,,,,,,,,,,,,,1998-06-01,F,,,,,52.2C,NAF1993,O,5.798293,46.976065,0.96,housenumber,14 Rue de Strasbourg 39330 Mouchard,39370_0280_00014,G,14 RUE DE STRASBOURG,
334841277,00026,33484127700026,O,1998-06-01,NN,,5610CQ,2020-10-27T08:46:30,false,11,,15,,RUE,ARISTIDE BRIAND,39330,MOUCHARD,,,39370,,,,,,,,,,,,,,,,,,,2019-11-24,F,,,,ROTISSERIE FIORI,56.10C,NAFRev2,N,5.797341,46.971828,0.95,housenumber,15 Rue Aristide Briand 39330 Mouchard,39370_0020_00015,G,15 RUE ARISTIDE BRIAND,
337605224,00019,33760522400019,O,,NN,,,,true,1,,30,,RUE,DE STRASBOURG,39330,MOUCHARD,,,39370,,,,,,,,,,,,,,,,,,,1987-06-30,F,,,,,67.01,NAP,N,5.797393,46.975131,0.96,housenumber,30 Rue de Strasbourg 39330 Mouchard,39370_0280_00030,G,30 RUE DE STRASBOURG,
338826373,00023,33882637300023,O,,NN,,,,true,1,,27,,RUE,DE LA REPUBLIQUE,39330,MOUCHARD,,,39370,,,,,,,,,,,,,,,,,,,1996-12-30,F,,,,,72.3Z,NAF1993,N,5.797937,46.976672,0.95,housenumber,27 Rue de la République 39330 Mouchard,39370_0220_00027,G,27 RUE DE LA REPUBLIQUE,
339015893,00029,33901589300029,O,1998-09-21,NN,,,2013-05-18T03:48:28,true,5,HOTEL DE VILLE,27,,RUE,DE STRASBOURG,39330,MOUCHARD,,,39370,,,,,,,,,,,,,,,,,,,2011-03-31,A,,,,,94.99Z,NAFRev2,N,5.797484,46.975049,0.96,housenumber,27 Rue de Strasbourg 39330 Mouchard,39370_0280_00027,G,27 RUE DE STRASBOURG,