siren,nic,siret,statutDiffusionEtablissement,dateCreationEtablissement,trancheEffectifsEtablissement,anneeEffectifsEtablissement,activitePrincipaleRegistreMetiersEtablissement,dateDernierTraitementEtablissement,etablissementSiege,nombrePeriodesEtablissement,complementAdresseEtablissement,numeroVoieEtablissement,indiceRepetitionEtablissement,typeVoieEtablissement,libelleVoieEtablissement,codePostalEtablissement,libelleCommuneEtablissement,libelleCommuneEtrangerEtablissement,distributionSpecialeEtablissement,codeCommuneEtablissement,codeCedexEtablissement,libelleCedexEtablissement,codePaysEtrangerEtablissement,libellePaysEtrangerEtablissement,complementAdresse2Etablissement,numeroVoie2Etablissement,indiceRepetition2Etablissement,typeVoie2Etablissement,libelleVoie2Etablissement,codePostal2Etablissement,libelleCommune2Etablissement,libelleCommuneEtranger2Etablissement,distributionSpeciale2Etablissement,codeCommune2Etablissement,codeCedex2Etablissement,libelleCedex2Etablissement,codePaysEtranger2Etablissement,libellePaysEtranger2Etablissement,dateDebut,etatAdministratifEtablissement,enseigne1Etablissement,enseigne2Etablissement,enseigne3Etablissement,denominationUsuelleEtablissement,activitePrincipaleEtablissement,nomenclatureActivitePrincipaleEtablissement,caractereEmployeurEtablissement,longitude,latitude,geo_score,geo_type,geo_adresse,geo_id,geo_ligne,geo_l4,geo_l5
039192224,00010,03919222400010,O,1997-12-25,,,,2008-01-04T18:00:54,true,2,,,,,LA MOTTE,45110,SIGLOY,,,45311,,,,,,,,,,,,,,,,,,,2008-01-01,A,,,,,81.10Z,NAFRev2,N,2.22653,47.833747,0.92,street,Route de la Motte 45110 Sigloy,45311_0046,G,ROUTE DE LA MOTTE,
086076650,00018,08607665000018,O,,,,,,true,1,,,,,,45110,SIGLOY,,,45311,,,,,,,,,,,,,,,,,,,1984-12-25,F,,,,,67.05,NAP,N,,,0,,,,,,
214500829,00087,21450082900087,O,2001-01-01,NN,,,2008-05-21T11:20:48,false,3,,,,LD,LA MALTOURNEE,45110,SIGLOY,,,45311,,,,,,,,,,,,,,,,,,,2002-12-13,A,CAMPING DE LA MALTOURNEE,,,,84.12Z,NAFRev2,N,2.223773,47.856305,0.94,street,La Maltournée 45110 Sigloy,45311_jzn8gv,G,LA MALTOURNEE,
214503112,00010,21450311200010,O,1983-03-01,02,2020,,2022-08-29T09:07:21,true,4,,,,RTE,DE CHATEAUNEUF,45110,SIGLOY,,,45311,,,,,,,,,,,,,,,,,,,2008-01-01,A,MAIRIE,,,,84.11Z,NAFRev2,O,2.225078,47.834599,0.85,street,Route de Châteauneuf 45110 Sigloy,45311_0016,G,ROUTE DE CHATEAUNEUF,
214503112,00036,21450311200036,O,1988-09-01,01,2020,,2022-08-29T09:07:21,false,4,AU BOURG,2,,RTE,DE CHATEAUNEUF,45110,SIGLOY,,,45311,,,,,,,,,,,,,,,,,,,2021-09-01,A,ECOLE MATERNELLE,,,,85.10Z,NAFRev2,N,2.225293,47.833908,0.86,housenumber,2 Route de Châteauneuf 45110 Sigloy,45311_0016_00002,G,2 ROUTE DE CHATEAUNEUF,
214503112,00044,21450311200044,O,1995-01-01,NN,,,2008-01-04T18:34:23,false,3,MAIRIE,,,RTE,DE CHATEAUNEUF SUR LOIRE,45110,SIGLOY,,,45311,,,,,,,,,,,,,,,,,,,2008-01-01,A,SERVICE ASSAINISSEMENT,,,,37.00Z,NAFRev2,N,2.225078,47.834599,0.55,street,Route de Châteauneuf 45110 Sigloy,45311_0016,G,ROUTE DE CHATEAUNEUF,
254500275,00014,25450027500014,O,1983-03-01,01,2020,,2022-08-29T09:10:02,true,3,MAIRIE,,,RTE,DE CHATEAUNEUF,45110,SIGLOY,,,45311,,,,,,,,,,,,,,,,,,,2008-01-01,A,,,,,36.00Z,NAFRev2,N,2.225078,47.834599,0.85,street,Route de Châteauneuf 45110 Sigloy,45311_0016,G,ROUTE DE CHATEAUNEUF,
254502131,00025,25450213100025,O,1998-10-05,03,2020,,2022-08-29T09:10:02,true,4,,,,RTE,DE CHATEAUNEUF,45110,SIGLOY,,,45311,,,,,,,,,,,,,,,,,,,2019-02-26,A,,,,,84.11Z,NAFRev2,O,2.225078,47.834599,0.85,street,Route de Châteauneuf 45110 Sigloy,45311_0016,G,ROUTE DE CHATEAUNEUF,
264548066,00010,26454806600010,O,1993-02-01,NN,,,2010-06-26T03:10:14,true,3,MAIRIE,,,RTE,DE CHATEAUNEUF,45110,SIGLOY,,,45311,,,,,,,,,,,,,,,,,,,2008-01-01,A,CDE,,,,88.99B,NAFRev2,N,2.225078,47.834599,0.85,street,Route de Châteauneuf 45110 Sigloy,45311_0016,G,ROUTE DE CHATEAUNEUF,
264548074,00014,26454807400014,O,1993-02-01,NN,,,2016-07-23T12:04:32,true,4,MAIRIE,,,RTE,DE CHATEAUNEUF,45110,SIGLOY,,,45311,,,,,,,,,,,,,,,,,,,2016-01-01,F,CCAS,,,,88.99B,NAFRev2,N,2.225078,47.834599,0.85,street,Route de Châteauneuf 45110 Sigloy,45311_0016,G,ROUTE DE CHATEAUNEUF,
294500392,00013,29450039200013,O,1983-09-27,NN,,,2019-06-24T13:14:34,true,3,MAIRIE,,,RTE,DE CHATEAUNEUF,45110,SIGLOY,,,45311,,,,,,,,,,,,,,,,,,,2008-01-01,A,,,,,42.99Z,NAFRev2,N,2.225078,47.834599,0.85,street,Route de Châteauneuf 45110 Sigloy,45311_0016,G,ROUTE DE CHATEAUNEUF,
303520621,00010,30352062100010,O,2000-07-07,NN,,,2008-11-07T00:19:07,true,3,,12,,RTE,DE TIGY,45110,SIGLOY,,,45311,,,,,,,,,,,,,,,,,,,2005-02-02,F,,,,,45.3E,NAFRev1,N,2.22434,47.833157,0.83,housenumber,12 Route de Tigy 45110 Sigloy,45311_0009_00012,G,12 ROUTE DE TIGY,
305647117,00038,30564711700038,O,1900-01-01,NN,,,2012-07-04T04:26:06,true,4,,,,RTE,DE TIGY,45110,SIGLOY,,,45311,,,,,,,,,,,,,,,,,,,2012-07-01,F,,,,,47.81Z,NAFRev2,N,2.22095,47.830764,0.79,street,Route de Tigy 45110 Sigloy,45311_0009,G,ROUTE DE TIGY,
306752312,00018,30675231200018,O,,,,,,true,1,,,,RTE,DE LA MOTTE,45110,SIGLOY,,,45311,,,,,,,,,,,,,,,,,,,1984-12-25,F,,,,,49.02,NAP,N,2.22653,47.833747,0.82,street,Route de la Motte 45110 Sigloy,45311_0046,G,ROUTE DE LA MOTTE,
306765421,00012,30676542100012,O,,NN,,,,true,1,,,,RTE,DE LA MOTTE,45110,SIGLOY,,,45311,,,,,,,,,,,,,,,,,,,1989-06-30,F,,,,,49.02,NAP,N,2.22653,47.833747,0.82,street,Route de la Motte 45110 Sigloy,45311_0046,G,ROUTE DE LA MOTTE,
312290208,00023,31229020800023,O,1982-06-07,,,,,true,4,,,,,AU BOURG,45110,SIGLOY,,,45311,,,,,,,,,,,,,,,,,,,2003-06-01,F,,,,,55.3A,NAFRev1,N,-1.9115621,47.1089349,0.88,poi.track,Chemin du Breil au Bourg Chaumes-en-Retz,https://osm.org/way/283246644,G,,
317628584,00011,31762858400011,O,1900-01-01,,,,2011-04-28T00:16:52,false,2,,,,,AU BOURG,45110,SIGLOY,,,45311,,,,,,,,,,,,,,,,,,,1984-12-25,F,,,,,67.07,NAP,N,-1.9115621,47.1089349,0.88,poi.track,Chemin du Breil au Bourg Chaumes-en-Retz,https://osm.org/way/283246644,G,,
318784394,00039,31878439400039,O,2018-03-01,,,,2021-02-23T10:43:17,true,1,,37,,RTE,DU CLOS DU VERGER,45110,SIGLOY,,,45311,,,,,,,,,,,,,,,,,,,2018-03-01,A,,,,,96.09Z,NAFRev2,N,2.220138,47.832457,0.78,housenumber,37 Route du Clos Verger 45110 Sigloy,45311_0025_00037,G,37 ROUTE DU CLOS VERGER,
323831271,00024,32383127100024,O,,,,,,true,1,,,,LD,LES VALLEES,45110,SIGLOY,,,45311,,,,,,,,,,,,,,,,,,,1987-12-31,F,,,,,55.60,NAP,N,2.205583,47.844862,0.76,street,Route des Vallées 45110 Sigloy,45311_0010,G,ROUTE DES VALLEES,
324490085,00010,32449008500010,O,1982-05-06,NN,,,2008-11-07T00:41:27,true,4,,103,,RTE,MARMAIN,45110,SIGLOY,,,45311,,,,,,,,,,,,,,,,,,,2005-12-12,F,,,,,28.5D,NAFRev1,O,2.207086,47.840203,0.83,housenumber,103 Route de Marmain 45110 Sigloy,45311_0043_00103,G,103 ROUTE DE MARMAIN,
327624714,00025,32762471400025,O,1987-07-30,NN,,,2006-12-15T00:23:54,false,3,,,,RTE,,45110,SIGLOY,,,45311,,,,,,,,,,,,,,,,,,,1992-10-09,F,,,,,52.6E,NAF1993,N,,,0,,,,,,
332993625,00042,33299362500042,O,2009-03-24,,,,2012-11-09T00:29:41,true,2,,64,,RTE,DE LA CHENAT,45110,SIGLOY,,,45311,,,,,,,,,,,,,,,,,,,2010-03-22,F,,,,,43.22A,NAFRev2,N,2.232318,47.84604,0.85,housenumber,64 Route de la Chenat 45110 Sigloy,45311_0019_00064,G,64 ROUTE DE LA CHENAT,
333291284,00011,33329128400011,O,1985-08-06,NN,,,2012-12-05T15:50:58,false,4,,,,LD,LES VALLEES,45110,SIGLOY,,,45311,,,,,,,,,,,,,,,,,,,2012-11-29,F,,,,,01.13Z,NAFRev2,N,2.205583,47.844862,0.76,street,Route des Vallées 45110 Sigloy,45311_0010,G,ROUTE DES VALLEES,
337481741,00011,33748174100011,O,1986-04-01,NN,,,2018-09-20T08:48:36,true,3,,,,LD,LE CLOS DU VERGER,45110,SIGLOY,,,45311,,,,,,,,,,,,,,,,,,,2008-01-01,A,,,,,68.20B,NAFRev2,N,2.224088,47.831768,0.72,street,Route du Clos Verger 45110 Sigloy,45311_0025,G,ROUTE DU CLOS VERGER,
338227739,00012,33822773900012,O,,,,,,true,1,,,,RUE,DE MALAKOFF,45110,SIGLOY,,,45311,,,,,,,,,,,,,,,,,,,1987-09-30,F,,,,,55.60,NAP,N,2.226742,47.840205,0.76,street,Impasse de Malakoff 45110 Sigloy,45311_0040,G,IMPASSE DE MALAKOFF,
338740541,00010,33874054100010,O,,NN,,,,true,1,,,,,LA MALVAUDIERE,45110,SIGLOY,,,45311,,,,,,,,,,,,,,,,,,,1994-02-18,F,,,,,45.2V,NAF1993,O,2.216544,47.827966,0.75,street,Route de la Malvandiere 45110 Sigloy,45311_8gd2xz,G,ROUTE DE LA MALVANDIERE,
341622397,00014,34162239700014,O,1987-01-01,,,,2008-03-28T11:30:42,true,3,,,,LD,LES AGNEAUX,45110,SIGLOY,,,45311,,,,,,,,,,,,,,,,,,,2008-01-01,A,,,,,01.43Z,NAFRev2,N,,,0,,,,,,
341789410,00014,34178941000014,O,,NN,,,,true,1,,,,,LA MALVAUDIERE,45110,SIGLOY,,,45311,,,,,,,,,,,,,,,,,,,1987-07-16,F,,,,,55.60,NAP,N,2.216544,47.827966,0.75,street,Route de la Malvandiere 45110 Sigloy,45311_8gd2xz,G,ROUTE DE LA MALVANDIERE,
342066883,00022,34206688300022,O,1992-05-09,NN,,,2008-11-07T01:03:06,false,4,,,,RTE,DE TIGY,45110,SIGLOY,,,45311,,,,,,,,,,,,,,,,,,,1995-12-25,F,,,,,51.6N,NAF1993,O,2.22095,47.830764,0.79,street,Route de Tigy 45110 Sigloy,45311_0009,G,ROUTE DE TIGY,
342584265,00017,34258426500017,O,,NN,,,,true,1,,,,RTE,DE GUILLY,45110,SIGLOY,,,45311,,,,,,,,,,,,,,,,,,,1990-10-24,F,,,,,38.40,NAP,N,2.226792,47.832787,0.82,street,Route de Guilly 45110 Sigloy,45311_0006,G,ROUTE DE GUILLY,
343025482,00021,34302548200021,O,2015-11-01,,,,2021-02-23T10:58:23,true,1,,71,,RTE,DU VERGER,45110,SIGLOY,,,45311,,,,,,,,,,,,,,,,,,,2015-11-01,A,,,,,01.11Z,NAFRev2,O,2.217968,47.832875,0.84,housenumber,71 Route du Verger 45110 Sigloy,45311_0058_00071,G,71 ROUTE DU VERGER,
345240865,00047,34524086500047,O,1994-03-01,NN,,,,false,4,,5,,RTE,DE MARMAIN,45110,SIGLOY,,,45311,,,,,,,,,,,,,,,,,,,2002-09-30,F,,,,,45.1A,NAF1993,N,2.217698,47.83607,0.84,housenumber,5 Route de Marmain 45110 Sigloy,45311_0043_00005,G,5 ROUTE DE MARMAIN,
345299838,00028,34529983800028,O,1900-01-01,NN,,,2011-04-28T00:37:51,false,4,,8,,RTE,DES GRANDS RUS,45110,SIGLOY,,,45311,,,,,,,,,,,,,,,,,,,1997-12-31,F,,,,,45.2V,NAF1993,O,2.230753,47.830526,0.85,housenumber,8 Route des Grands Rus 45110 Sigloy,45311_0032_00008,G,8 ROUTE DES GRANDS RUS,
349541888,00013,34954188800013,O,1989-01-01,00,2020,,2022-08-29T09:31:23,true,5,MAISON NEUVE,138,,RTE,D'OUVROUER,45110,SIGLOY,,,45311,,,,,,,,,,,,,,,,,,,2010-12-31,A,,,,,01.24Z,NAFRev2,O,2.207776,47.836888,0.85,housenumber,138 Route d’Ouvrouer 45110 Sigloy,45311_0005_00138,G,138 ROUTE D OUVROUER,
352337448,00018,35233744800018,O,1989-10-01,NN,,,2010-04-18T05:27:13,true,4,,,,,CORNEBOEUF,45110,SIGLOY,,,45311,,,,,,,,,,,,,,,,,,,2008-04-05,F,,,,,01.13Z,NAFRev2,N,0.2697641,46.4925661,0.88,poi.track,Chemin de Ruffigny à CorneBœuf Iteuil,https://osm.org/way/137725129,G,,
353142573,00024,35314257300024,O,1993-01-01,NN,,,,true,3,,12,,RTE,DE TIGY,45110,SIGLOY,,,45311,,,,,,,,,,,,,,,,,,,2003-12-31,F,,,,,60.2P,NAFRev1,N,2.22434,47.833157,0.83,housenumber,12 Route de Tigy 45110 Sigloy,45311_0009_00012,G,12 ROUTE DE TIGY,
378161301,00023,37816130100023,O,1998-03-19,NN,,,2008-11-08T00:33:38,true,4,,35,,IMP,DE TIRE PEINE,45110,SIGLOY,,,45311,,,,,,,,,,,,,,,,,,,2002-12-04,F,,,,,74.8K,NAF1993,N,2.236718,47.824411,0.85,housenumber,35 Impasse de Tire Peine 45110 Sigloy,45311_0054_00035,G,35 IMPASSE DE TIRE PEINE,
378438188,00013,37843818800013,O,1990-01-01,NN,,,2007-01-18T09:28:43,true,3,,,,,LE CARROUY,45110,SIGLOY,,,45311,,,,,,,,,,,,,,,,,,,1998-12-25,F,,,,,01.1A,NAF1993,N,,,0,,,,,,
379168750,00014,37916875000014,O,,NN,,,,true,1,,,,,LA GROSSE LA CHOLETTE,45110,SIGLOY,,,45311,,,,,,,,,,,,,,,,,,,1991-01-09,F,,,,,60.2L,NAF1993,O,2.216507,47.825568,0.5,street,Impasse de la Cholette 45110 Sigloy,45311_0022,G,IMPASSE DE LA CHOLETTE,
379260243,00025,37926024300025,O,2015-12-31,01,2020,,2022-08-29T09:06:18,true,1,,15,,RTE,D'OUVROUER LES CHAMPS,45110,SIGLOY,,,45311,,,,,,,,,,,,,,,,,,,2015-12-31,A,,,,,01.11Z,NAFRev2,N,2.224991,47.834676,0.49,housenumber,15 Route d’Ouvrouer 45110 Sigloy,45311_0005_00015,G,15 ROUTE D OUVROUER,
379753585,00015,37975358500015,O,,NN,,,,true,1,,,,RTE,DE TIGY,45110,SIGLOY,,,45311,,,,,,,,,,,,,,,,,,,1992-12-31,F,,,,,51.1R,NAF1993,N,2.22095,47.830764,0.79,street,Route de Tigy 45110 Sigloy,45311_0009,G,ROUTE DE TIGY,
381224005,00029,38122400500029,O,,NN,,,,true,1,,32,,RTE,DE NEUVY,45110,SIGLOY,,,45311,,,,,,,,,,,,,,,,,,,1997-07-16,F,,,,,45.4C,NAF1993,O,2.225564,47.830801,0.84,housenumber,32 Route de Neuvy 45110 Sigloy,45311_0008_00032,G,32 ROUTE DE NEUVY,
382183556,00010,38218355600010,O,,NN,,,,true,1,,,,CHE,DU VERGER,45110,SIGLOY,,,45311,,,,,,,,,,,,,,,,,,,1994-06-27,F,,,,,74.1G,NAF1993,N,2.215603,47.837586,0.74,street,Route du Verger 45110 Sigloy,45311_0058,G,ROUTE DU VERGER,
383206869,00018,38320686900018,O,1991-10-02,NN,,,2008-11-08T00:42:51,true,4,,16,,RTE,DES GUILLAUMELLES,45110,SIGLOY,,,45311,,,,,,,,,,,,,,,,,,,1996-12-25,F,,,,,45.4C,NAF1993,O,2.2207,47.835911,0.87,housenumber,16 Route des Guillaumelles 45110 Sigloy,45311_0033_00016,G,16 ROUTE DES GUILLAUMELLES,
383441219,00011,38344121900011,O,1991-10-01,NN,,,,false,3,LES ROBARCIERES,,,RTE,DE TIGY,45110,SIGLOY,,,45311,,,,,,,,,,,,,,,,,,,1996-01-01,F,,,,,70.2C,NAF1993,N,2.22095,47.830764,0.79,street,Route de Tigy 45110 Sigloy,45311_0009,G,ROUTE DE TIGY,
384022869,00026,38402286900026,O,1992-12-11,NN,,,,false,3,,,,RTE,DE TIGY,45110,SIGLOY,,,45311,,,,,,,,,,,,,,,,,,,1994-11-24,F,,,,,70.2C,NAF1993,N,2.22095,47.830764,0.79,street,Route de Tigy 45110 Sigloy,45311_0009,G,ROUTE DE TIGY,
384772711,00014,38477271100014,O,,NN,,,,true,1,,4,,IMP,LA CHOLETTE,45110,SIGLOY,,,45311,,,,,,,,,,,,,,,,,,,1996-03-30,F,,,,,70.1F,NAF1993,N,2.216861,47.825412,0.83,housenumber,4 Impasse de la Cholette 45110 Sigloy,45311_0022_00004,G,4 IMPASSE DE LA CHOLETTE,
388238388,00010,38823838800010,O,1992-02-01,NN,,,,true,4,,,,,LES BARRES,45110,SIGLOY,,,45311,,,,,,,,,,,,,,,,,,,2003-06-30,F,,,,,52.2A,NAFRev1,O,2.217853,47.855395,0.36,locality,Les Terres du Bith 45110 Sigloy,45311_B086,G,LES TERRES DU BITH,
388946311,00023,38894631100023,O,1999-05-01,NN,,,2008-11-08T00:49:56,true,3,,18,,RTE,DE GUILLY,45110,SIGLOY,,,45311,,,,,,,,,,,,,,,,,,,2004-06-19,F,,,,,15.8C,NAFRev1,O,2.226691,47.83279,0.84,housenumber,18 Route de Guilly 45110 Sigloy,45311_0006_00018,G,18 ROUTE DE GUILLY,
389174038,00023,38917403800023,O,1999-05-01,NN,,,2006-12-15T00:48:08,false,4,SARL CHALIN,,,,,45110,SIGLOY,,,45311,,,,,,,,,,,,,,,,,,,2002-04-22,F,,,,,74.1J,NAF1993,N,,,0,,,,,,
390000222,00021,39000022200021,O,2009-01-01,NN,,,2012-05-05T04:29:51,true,2,,,,,LA MALTOURNEE,45110,SIGLOY,,,45311,,,,,,,,,,,,,,,,,,,2010-12-31,F,CAMPING DE LA MALTOURNEE,,,,55.30Z,NAFRev2,O,2.223773,47.856305,0.94,street,La Maltournée 45110 Sigloy,45311_jzn8gv,G,LA MALTOURNEE,
390773216,00010,39077321600010,O,1993-04-01,NN,,,,false,4,,2,,RUE,DE LA PETITE PUCELLE,45110,SIGLOY,,,45311,,,,,,,,,,,,,,,,,,,1995-08-01,F,,,,,45.2V,NAF1993,O,2.225261,47.832139,0.84,housenumber,2 Rue de la Petite Pocelle 45110 Sigloy,45311_0049_00002,G,2 RUE DE LA PETITE POCELLE,
391182433,00022,39118243300022,O,1994-09-15,NN,,,,false,3,,123,,RTE,DE LA LEVEE,45110,SIGLOY,,,45311,,,,,,,,,,,,,,,,,,,1995-09-01,F,,,,,85.1C,NAF1993,N,2.213722,47.841963,0.86,housenumber,123 Route de la Levée 45110 Sigloy,45311_0035_00123,G,123 ROUTE DE LA LEVEE,
391232030,00026,39123203000026,O,2010-04-01,,,,2016-07-03T04:51:13,true,2,,6,B,RUE,DE LA PETITE POCELLE,45110,SIGLOY,,,45311,,,,,,,,,,,,,,,,,,,2013-05-20,F,,,,,46.13Z,NAFRev2,N,2.225906,47.832184,0.88,housenumber,6bis Rue de la Petite Pocelle 45110 Sigloy,45311_0049_00006_bis,G,6BIS RUE DE LA PETITE POCELLE,
391327616,00010,39132761600010,O,1993-05-13,NN,,,2018-09-04T07:42:17,true,3,,,,,CLOS DU VERGER,45110,SIGLOY,,,45311,,,,,,,,,,,,,,,,,,,2008-01-01,A,,,,,68.20B,NAFRev2,N,2.224088,47.831768,0.8,street,Route du Clos Verger 45110 Sigloy,45311_0025,G,ROUTE DU CLOS VERGER,
391395282,00018,39139528200018,O,1976-01-01,NN,,,2007-05-19T11:30:12,true,3,,115,,RTE,DE TIGY,45110,SIGLOY,,,45311,,,,,,,,,,,,,,,,,,,2006-04-01,F,,,,,01.1F,NAFRev1,N,2.218297,47.825779,0.84,housenumber,115 Route de Tigy 45110 Sigloy,45311_0009_00115,G,115 ROUTE DE TIGY,
397568049,00019,39756804900019,O,1987-01-01,NN,,,2019-06-21T11:25:28,true,3,,,,RTE,DE LA LEVEE,45110,SIGLOY,,,45311,,,,,,,,,,,,,,,,,,,2008-01-01,A,,,,,01.11Z,NAFRev2,N,2.214986,47.840032,0.83,street,Route de la Levée 45110 Sigloy,45311_0035,G,ROUTE DE LA LEVEE,
398620070,00027,39862007000027,O,1998-03-19,NN,,,2006-11-25T12:35:10,true,1,,35,,IMP,DE TIRE PEINE,45110,SIGLOY,,,45311,,,,,,,,,,,,,,,,,,,2002-12-04,F,,,,,74.1J,NAF1993,N,2.236718,47.824411,0.85,housenumber,35 Impasse de Tire Peine 45110 Sigloy,45311_0054_00035,G,35 IMPASSE DE TIRE PEINE,
398860189,00024,39886018900024,O,1994-11-15,NN,,,2008-11-08T01:05:40,true,3,,7,,RTE,DE TIGY,45110,SIGLOY,,,45311,,,,,,,,,,,,,,,,,,,2004-01-15,F,,,,,45.4C,NAFRev1,N,2.224544,47.83317,0.82,housenumber,7 Route de Tigy 45110 Sigloy,45311_0009_00007,G,7 ROUTE DE TIGY,
400298188,00014,40029818800014,O,1995-02-23,NN,,,2008-11-08T01:08:45,true,3,,18,,RTE,DE TIGY,45110,SIGLOY,,,45311,,,,,,,,,,,,,,,,,,,2004-02-03,F,,,,,50.1Z,NAFRev1,N,2.22335,47.832597,0.83,housenumber,18 Route de Tigy 45110 Sigloy,45311_0009_00018,G,18 ROUTE DE TIGY,
400690400,00017,40069040000017,O,1995-03-30,NN,,,2008-11-08T01:09:37,true,4,,105,,RTE,DE MARMAIN,45110,SIGLOY,,,45311,,,,,,,,,,,,,,,,,,,2001-08-03,F,,,,,28.5D,NAF1993,O,2.206803,47.840341,0.85,housenumber,105 Route de Marmain 45110 Sigloy,45311_0043_00105,G,105 ROUTE DE MARMAIN,
400756557,00056,40075655700056,O,2018-04-05,,,4334ZC,2021-02-23T11:24:44,true,1,,28,,RTE,DE MARMAIN,45110,SIGLOY,,,45311,,,,,,,,,,,,,,,,,,,2018-04-05,A,,,,,43.34Z,NAFRev2,N,2.215473,47.837262,0.85,housenumber,28 Route de Marmain 45110 Sigloy,45311_0043_00028,G,28 ROUTE DE MARMAIN,
400761037,00011,40076103700011,O,1995-02-01,NN,,,2008-01-06T16:16:26,true,3,LE PETIT VERGER,56,,RTE,DU VERGER,45110,SIGLOY,,,45311,,,,,,,,,,,,,,,,,,,2006-12-31,F,,,,,01.1A,NAFRev1,N,2.215128,47.834569,0.84,housenumber,56 Route du Verger 45110 Sigloy,45311_0058_00056,G,56 ROUTE DU VERGER,
401547336,00016,40154733600016,O,1995-08-01,NN,,,2006-11-25T14:51:26,true,4,,56,,RTE,DU VERGER,45110,SIGLOY,,,45311,,,,,,,,,,,,,,,,,,,2006-08-31,F,,,,,55.1E,NAFRev1,N,2.215128,47.834569,0.84,housenumber,56 Route du Verger 45110 Sigloy,45311_0058_00056,G,56 ROUTE DU VERGER,
401580063,00014,40158006300014,O,1994-01-01,NN,,,,true,1,,126,,RTE,DE NEUVY EN SULLIAS,45110,SIGLOY,,,45311,,,,,,,,,,,,,,,,,,,1999-06-14,F,,,,,01.3Z,NAF1993,N,2.224256,47.823206,0.48,housenumber,126 Route de Neuvy 45110 Sigloy,45311_0008_00126,G,126 ROUTE DE NEUVY,
402397343,00011,40239734300011,O,1947-01-01,NN,,,2008-07-10T00:46:50,true,3,LE BOURG,,,RTE,DE TIGY,45110,SIGLOY,,,45311,,,,,,,,,,,,,,,,,,,2008-01-01,A,,,,,01.11Z,NAFRev2,N,2.22095,47.830764,0.79,street,Route de Tigy 45110 Sigloy,45311_0009,G,ROUTE DE TIGY,
408010759,00012,40801075900012,O,1996-06-01,NN,,,2008-01-04T21:02:55,true,3,,17,,RTE,DE CHATEAUNEUF,45110,SIGLOY,,,45311,,,,,,,,,,,,,,,,,,,2008-01-01,A,,,,,01.11Z,NAFRev2,N,2.224867,47.835289,0.87,housenumber,17 Route de Châteauneuf 45110 Sigloy,45311_0016_00017,G,17 ROUTE DE CHATEAUNEUF,
412660656,00015,41266065600015,O,1997-02-24,NN,,,2008-01-05T20:28:52,true,3,,95,,RTE,DES VALLEES,45110,SIGLOY,,,45311,,,,,,,,,,,,,,,,,,,2008-01-01,A,,,,,68.20B,NAFRev2,N,2.207456,47.844716,0.85,housenumber,95 Route des Vallées 45110 Sigloy,45311_0010_00095,G,95 ROUTE DES VALLEES,
413023755,00015,41302375500015,O,,NN,,,,true,1,,2,,RUE,DE LA PUCELLE,45110,SIGLOY,,,45311,,,,,,,,,,,,,,,,,,,1994-01-01,F,,,,,01.1A,NAF1993,N,2.227324,47.8324,0.81,housenumber,2 Rue de la Pocelle 45110 Sigloy,45311_0052_00002,G,2 RUE DE LA POCELLE,
413588450,00028,41358845000028,O,2005-10-01,,,,2016-03-01T13:46:34,true,3,,88,,RTE,DES VALLEES,45110,SIGLOY,,,45311,,,,,,,,,,,,,,,,,,,2015-10-30,F,,,,,68.20B,NAFRev2,N,2.206399,47.844344,0.85,housenumber,88 Route des Vallées 45110 Sigloy,45311_0010_00088,G,88 ROUTE DES VALLEES,
414358713,00025,41435871300025,O,2015-02-16,,,,2016-08-17T08:26:59,true,2,,25,,,ROUTE DE CHATEAUNEUF,45110,SIGLOY,,,45311,,,,,,,,,,,,,,,,,,,2016-03-01,F,,,,,47.99A,NAFRev2,N,2.225298,47.836229,0.95,housenumber,25 Route de Châteauneuf 45110 Sigloy,45311_0016_00025,G,25 ROUTE DE CHATEAUNEUF,
414438226,00014,41443822600014,O,1997-11-12,NN,,,2008-11-08T01:30:16,true,4,,4,,RTE,DE CHATEAUNEUF,45110,SIGLOY,,,45311,,,,,,,,,,,,,,,,,,,2005-03-16,F,,,,,85.1J,NAFRev1,O,2.225244,47.834313,0.86,housenumber,4 Route de Châteauneuf 45110 Sigloy,45311_0016_00004,G,4 ROUTE DE CHATEAUNEUF,
418131553,00038,41813155300038,O,2006-01-17,NN,,,2017-07-03T09:54:09,false,4,,4,,RTE,DE CHATEAUNEUF,45110,SIGLOY,,,45311,,,,,,,,,,,,,,,,,,,2013-01-31,F,,,,,49.32Z,NAFRev2,O,2.225244,47.834313,0.86,housenumber,4 Route de Châteauneuf 45110 Sigloy,45311_0016_00004,G,4 ROUTE DE CHATEAUNEUF,
418284923,00038,41828492300038,O,2005-04-01,,,,2006-10-28T04:34:06,false,2,,18,,RTE,DE TIGY,45110,SIGLOY,,,45311,,,,,,,,,,,,,,,,,,,2006-04-01,F,,,,,01.2J,NAFRev1,N,2.22335,47.832597,0.83,housenumber,18 Route de Tigy 45110 Sigloy,45311_0009_00018,G,18 ROUTE DE TIGY,
420083958,00017,42008395800017,O,1984-12-31,,,,,true,1,,105,,RTE,DE NEUVY,45110,SIGLOY,,,45311,,,,,,,,,,,,,,,,,,,2001-09-15,F,,,,,01.1G,NAF1993,N,2.225306,47.824899,0.84,housenumber,105 Route de Neuvy 45110 Sigloy,45311_0008_00105,G,105 ROUTE DE NEUVY,
420083966,00010,42008396600010,O,1979-10-01,NN,,,2007-12-06T09:56:20,true,4,,260,,RTE,DE CHATEAUNEUF,45110,SIGLOY,,,45311,,,,,,,,,,,,,,,,,,,2005-03-31,F,,,,,01.1A,NAFRev1,N,2.223711,47.856013,0.87,housenumber,260 Route de Châteauneuf 45110 Sigloy,45311_0016_00260,G,260 ROUTE DE CHATEAUNEUF,
420083974,00014,42008397400014,O,1988-12-31,NN,,,2011-03-04T05:34:49,true,4,,85,,RTE,DU VERGER,45110,SIGLOY,,,45311,,,,,,,,,,,,,,,,,,,2010-10-31,F,,,,,01.11Z,NAFRev2,N,2.218054,47.832828,0.84,housenumber,85 Route du Verger 45110 Sigloy,45311_0058_00085,G,85 ROUTE DU VERGER,
420083982,00017,42008398200017,O,1981-01-12,NN,,,,true,1,,79,,RTE,DE LA TUILERIE,45110,SIGLOY,,,45311,,,,,,,,,,,,,,,,,,,2002-05-31,F,,,,,01.1C,NAF1993,N,2.234133,47.833093,0.87,housenumber,79 Route de la Tuilerie 45110 Sigloy,45311_0055_00079,G,79 ROUTE DE LA TUILERIE,
420083990,00010,42008399000010,O,1982-12-31,NN,,,2022-07-18T17:00:58,true,4,,2,,RTE,DE LA MOTTE,45110,SIGLOY,,,45311,,,,,,,,,,,,,,,,,,,2020-12-31,F,,,,,01.11Z,NAFRev2,N,2.225995,47.833437,0.84,housenumber,2 Route de la Motte 45110 Sigloy,45311_0046_00002,G,2 ROUTE DE LA MOTTE,
420403404,01492,42040340401492,O,2021-03-01,,,,2021-06-25T10:04:35,false,1,,173,,,RTE DE LA LEVEE,45110,SIGLOY,,,45311,,,,,,,,,,,,,,,,,,,2021-03-01,A,,,,,52.10B,NAFRev2,N,2.208997,47.844035,0.86,housenumber,173 Route de la Levée 45110 Sigloy,45311_0035_00173,G,173 ROUTE DE LA LEVEE,
422802769,00014,42280276900014,O,1998-03-27,NN,,,2017-05-04T01:41:09,true,5,,71,,RTE,DU VERGER,45110,SIGLOY,,,45311,,,,,,,,,,,,,,,,,,,2015-12-31,F,,,,,01.11Z,NAFRev2,O,2.217968,47.832875,0.84,housenumber,71 Route du Verger 45110 Sigloy,45311_0058_00071,G,71 ROUTE DU VERGER,
422965707,00017,42296570700017,O,1976-08-01,NN,,,2008-01-05T00:30:37,true,3,,,,,LA MESTINIERE,45110,SIGLOY,,,45311,,,,,,,,,,,,,,,,,,,2008-01-01,A,,,,,01.13Z,NAFRev2,N,,,0,,,,,,
423446111,00019,42344611100019,O,1999-07-12,NN,,,2008-11-08T01:43:47,false,4,,25,,RTE,DU FOURNIL,45110,SIGLOY,,,45311,,,,,,,,,,,,,,,,,,,2003-05-07,F,JPP SERVICE,,,,45.3A,NAFRev1,N,2.233019,47.8317,0.84,housenumber,25 Route du Fournil 45110 Sigloy,45311_0030_00025,G,25 ROUTE DU FOURNIL,
423446111,00027,42344611100027,O,2003-05-07,01,2020,4321AB,2022-08-29T09:04:51,true,4,LES PRATEAUX,105,,RTE,DE NEUVY,45110,SIGLOY,,,45311,,,,,,,,,,,,,,,,,,,2008-07-20,A,,,,,43.21A,NAFRev2,O,2.225306,47.824899,0.84,housenumber,105 Route de Neuvy 45110 Sigloy,45311_0008_00105,G,105 ROUTE DE NEUVY,
429953508,00018,42995350800018,O,2000-01-01,NN,,,2006-10-31T00:53:06,true,3,LA CHANSOY,126,,RTE,DE NEUVY EN SULLIAS,45110,SIGLOY,,,45311,,,,,,,,,,,,,,,,,,,2005-12-31,F,,,,,01.3Z,NAFRev1,N,2.224256,47.823206,0.48,housenumber,126 Route de Neuvy 45110 Sigloy,45311_0008_00126,G,126 ROUTE DE NEUVY,