siren,nic,siret,statutDiffusionEtablissement,dateCreationEtablissement,trancheEffectifsEtablissement,anneeEffectifsEtablissement,activitePrincipaleRegistreMetiersEtablissement,dateDernierTraitementEtablissement,etablissementSiege,nombrePeriodesEtablissement,complementAdresseEtablissement,numeroVoieEtablissement,indiceRepetitionEtablissement,typeVoieEtablissement,libelleVoieEtablissement,codePostalEtablissement,libelleCommuneEtablissement,libelleCommuneEtrangerEtablissement,distributionSpecialeEtablissement,codeCommuneEtablissement,codeCedexEtablissement,libelleCedexEtablissement,codePaysEtrangerEtablissement,libellePaysEtrangerEtablissement,complementAdresse2Etablissement,numeroVoie2Etablissement,indiceRepetition2Etablissement,typeVoie2Etablissement,libelleVoie2Etablissement,codePostal2Etablissement,libelleCommune2Etablissement,libelleCommuneEtranger2Etablissement,distributionSpeciale2Etablissement,codeCommune2Etablissement,codeCedex2Etablissement,libelleCedex2Etablissement,codePaysEtranger2Etablissement,libellePaysEtranger2Etablissement,dateDebut,etatAdministratifEtablissement,enseigne1Etablissement,enseigne2Etablissement,enseigne3Etablissement,denominationUsuelleEtablissement,activitePrincipaleEtablissement,nomenclatureActivitePrincipaleEtablissement,caractereEmployeurEtablissement,longitude,latitude,geo_score,geo_type,geo_adresse,geo_id,geo_ligne,geo_l4,geo_l5
130017791,01271,13001779101271,O,2013-01-01,02,2020,,2022-08-29T09:03:42,false,1,CENTRE DE CHAMPIGNY LES LANGRES,58,,RUE,DU PORT,52200,CHAMPIGNY-LES-LANGRES,,,52102,,,,,,,,,,,,,,,,,,,2013-01-01,A,DT NE AG LONGEAU BARRAGES,,,,84.13Z,NAFRev2,N,5.341022,47.880373,0.94,housenumber,58 Rue du Port 52200 Champigny-lès-Langres,52102_0080_00058,G,58 RUE DU PORT,
130017791,01289,13001779101289,O,2013-01-01,01,2020,,2022-08-29T09:03:42,false,1,CENTRE DE CHAMPIGNY LES LANGRES,58,,RUE,DU PORT,52200,CHAMPIGNY-LES-LANGRES,,,52102,,,,,,,,,,,,,,,,,,,2013-01-01,A,DT NE AG SAINT DIZIER CHAMPIGNY,,,,84.13Z,NAFRev2,N,5.341022,47.880373,0.94,housenumber,58 Rue du Port 52200 Champigny-lès-Langres,52102_0080_00058,G,58 RUE DU PORT,
215200718,00017,21520071800017,O,1983-03-01,01,2020,,2022-08-29T09:07:36,true,4,,248,,RUE,PIERRE DURAND,52200,CHAMPIGNY-LES-LANGRES,,,52102,,,,,,,,,,,,,,,,,,,2008-01-01,A,MAIRIE,,,,84.11Z,NAFRev2,O,5.346026,47.8932,0.95,housenumber,248 Rue Pierre Durand 52200 Champigny-lès-Langres,52102_0075_00248,G,248 RUE PIERRE DURAND,
215200718,00025,21520071800025,O,1983-12-21,NN,,,2019-11-14T14:00:42,false,4,,,,RUE,DERRIERE LA FORGE,52200,CHAMPIGNY-LES-LANGRES,,,52102,,,,,,,,,,,,,,,,,,,2011-08-31,F,ECOLE PRIMAIRE PUBLIQUE,,,,85.20Z,NAFRev2,N,5.346821,47.890384,0.95,street,Rue Derriere la Forge 52200 Champigny-lès-Langres,52102_0019,G,RUE DERRIERE LA FORGE,
215200718,00033,21520071800033,O,1997-01-01,NN,,,2019-11-14T14:00:42,false,3,MAIRIE,248,,RUE,PIERRE DURAND,52200,CHAMPIGNY-LES-LANGRES,,,52102,,,,,,,,,,,,,,,,,,,2008-01-01,A,SERVICE EAUX ET ASSAINISSEMENT,,,,36.00Z,NAFRev2,N,5.346026,47.8932,0.95,housenumber,248 Rue Pierre Durand 52200 Champigny-lès-Langres,52102_0075_00248,G,248 RUE PIERRE DURAND,
265201228,00011,26520122800011,O,1983-03-01,NN,,,2019-11-14T14:00:42,true,4,MAIRIE,248,,RUE,PIERRE DURAND,52200,CHAMPIGNY-LES-LANGRES,,,52102,,,,,,,,,,,,,,,,,,,2016-01-01,F,CCAS,,,,88.99B,NAFRev2,N,5.346026,47.8932,0.95,housenumber,248 Rue Pierre Durand 52200 Champigny-lès-Langres,52102_0075_00248,G,248 RUE PIERRE DURAND,
295203830,00019,29520383000019,O,1985-05-20,NN,,,2019-11-14T14:00:42,true,3,MAIRIE,248,,RUE,PIERRE DURAND,52200,CHAMPIGNY-LES-LANGRES,,,52102,,,,,,,,,,,,,,,,,,,2008-01-01,A,,,,,42.99Z,NAFRev2,N,5.346026,47.8932,0.95,housenumber,248 Rue Pierre Durand 52200 Champigny-lès-Langres,52102_0075_00248,G,248 RUE PIERRE DURAND,
302878871,00011,30287887100011,O,1900-01-01,NN,,,2021-02-23T10:36:23,true,3,,,,RUE,DU MOULINOT,52200,CHAMPIGNY-LES-LANGRES,,,52102,,,,,,,,,,,,,,,,,,,2008-01-01,A,,,,,01.50Z,NAFRev2,N,5.345111,47.893705,0.94,street,Rue du Moulinot 52200 Champigny-lès-Langres,52102_0065,G,RUE DU MOULINOT,
302878889,00013,30287888900013,O,,,,,2019-11-14T14:00:42,true,1,,,,,,52200,CHAMPIGNY-LES-LANGRES,,,52102,,,,,,,,,,,,,,,,,,,1985-12-25,F,,,,,01.80,NAP,N,,,0,,,,,,
303852628,00013,30385262800013,O,1976-01-01,NN,,,2019-11-14T14:00:42,true,1,,,,RUE,PIERRE DURAND,52200,CHAMPIGNY-LES-LANGRES,,,52102,,,,,,,,,,,,,,,,,,,2001-12-31,F,,,,,55.3A,NAF1993,N,5.34584,47.890681,0.95,street,Rue Pierre Durand 52200 Champigny-lès-Langres,52102_0075,G,RUE PIERRE DURAND,
304860208,00061,30486020800061,O,2004-05-15,NN,,,2019-11-14T14:00:42,false,3,,,,RUE,DU PORT,52200,CHAMPIGNY-LES-LANGRES,,,52102,,,,,,,,,,,,,,,,,,,2008-01-01,A,,,,,68.20B,NAFRev2,N,5.340692,47.880552,0.94,street,Rue du Port 52200 Champigny-lès-Langres,52102_0080,G,RUE DU PORT,
306226010,00016,30622601000016,O,,,,,2019-11-14T14:00:42,true,1,,,,,,52200,CHAMPIGNY-LES-LANGRES,,,52102,,,,,,,,,,,,,,,,,,,1984-12-25,F,,,,,64.49,NAP,N,,,0,,,,,,
315450221,00017,31545022100017,O,,,,,2019-11-14T14:00:42,true,1,,,,,,52200,CHAMPIGNY-LES-LANGRES,,,52102,,,,,,,,,,,,,,,,,,,1987-12-25,F,,,,,69.11,NAP,N,,,0,,,,,,
315795104,00027,31579510400027,O,1989-11-08,NN,,,2019-11-14T14:00:42,true,1,,,,,,52200,CHAMPIGNY-LES-LANGRES,,,52102,,,,,,,,,,,,,,,,,,,1998-12-31,F,,,,,71.3A,NAF1993,N,,,0,,,,,,
323498584,00016,32349858400016,O,,NN,,,2019-11-14T14:00:42,true,1,,,,RTE,DE LANGRES,52200,CHAMPIGNY-LES-LANGRES,,,52102,,,,,,,,,,,,,,,,,,,,F,,,,,64.23,NAP,N,5.3431,47.880331,0.8,street,Route de Lorraine 52200 Champigny-lès-Langres,52102_0050,G,ROUTE DE LORRAINE,
324542372,00010,32454237200010,O,1900-01-01,NN,,3109BA,2019-11-14T14:00:42,true,6,,90,,RUE,DE LA BAIE,52200,CHAMPIGNY-LES-LANGRES,,,52102,,,,,,,,,,,,,,,,,,,2008-01-01,A,,,,,31.09B,NAFRev2,N,5.34762,47.895421,0.94,housenumber,90 Rue de la Baie 52200 Champigny-lès-Langres,52102_0005_00090,G,90 RUE DE LA BAIE,
324542372,00028,32454237200028,O,1997-06-01,,,,2019-11-14T14:00:42,false,3,,90,,RUE,DE LA BAIE,52200,CHAMPIGNY-LES-LANGRES,,,52102,,,,,,,,,,,,,,,,,,,2015-11-30,F,,,,,68.20B,NAFRev2,N,5.34762,47.895421,0.94,housenumber,90 Rue de la Baie 52200 Champigny-lès-Langres,52102_0005_00090,G,90 RUE DE LA BAIE,
333665594,00029,33366559400029,O,2014-11-18,,,4120BA,2019-11-14T14:00:42,true,2,,119,,RUE,DE LORRAINE,52200,CHAMPIGNY-LES-LANGRES,,,52102,,,,,,,,,,,,,,,,,,,2016-06-30,F,,,,,41.20A,NAFRev2,N,5.342288,47.880567,0.81,housenumber,119 Route de Lorraine 52200 Champigny-lès-Langres,52102_0050_00119,G,119 ROUTE DE LORRAINE,
339396376,00016,33939637600016,O,,NN,,,2019-11-14T14:00:42,true,1,,,,,,52200,CHAMPIGNY-LES-LANGRES,,,52102,,,,,,,,,,,,,,,,,,,1988-03-16,F,,,,,67.01,NAP,N,,,0,,,,,,
341634970,00030,34163497000030,O,1990-07-09,NN,,,2019-11-14T14:00:42,false,3,,89,,RUE,DU PORT,52200,CHAMPIGNY-LES-LANGRES,,,52102,,,,,,,,,,,,,,,,,,,2003-11-04,F,PUCES 52,,,,52.5Z,NAFRev1,N,5.340692,47.880552,0.77,street,Rue du Port 52200 Champigny-lès-Langres,52102_0080,G,RUE DU PORT,
348482431,00015,34848243100015,O,1988-11-02,NN,,,2019-11-14T14:00:42,true,3,,,,,PONT DU CANAL,52200,CHAMPIGNY-LES-LANGRES,,,52102,,,,,,,,,,,,,,,,,,,2006-03-30,F,,,,,51.5J,NAFRev1,N,5.343018,47.880119,0.41,street,Impasse du Canal 52200 Champigny-lès-Langres,52102_0012,G,IMPASSE DU CANAL,
377543004,00016,37754300400016,O,1989-12-06,NN,,,2019-11-14T14:00:42,true,1,,,,,,52200,CHAMPIGNY-LES-LANGRES,,,52102,,,,,,,,,,,,,,,,,,,1999-01-27,F,,,,,55.3A,NAF1993,O,,,0,,,,,,
380389957,00016,38038995700016,O,1990-10-01,01,2020,,2022-08-29T09:07:27,true,5,,,,,RLE DES GRANDS JARDINS,52200,CHAMPIGNY-LES-LANGRES,,,52102,,,,,,,,,,,,,,,,,,,2014-12-31,A,,,,,01.41Z,NAFRev2,O,5.344885,47.894151,0.86,street,Ruelle des Grands Jardins 52200 Champigny-lès-Langres,52102_0040,G,RUELLE DES GRANDS JARDINS,
384159331,00014,38415933100014,O,1991-11-04,NN,,,2019-11-14T14:00:42,true,3,MAIRIE,,,,,52200,CHAMPIGNY-LES-LANGRES,,,52102,,,,,,,,,,,,,,,,,,,2008-01-01,A,,,,,01.11Z,NAFRev2,N,,,0,,,,,,
385183793,00012,38518379300012,O,,NN,,,2019-11-14T14:00:42,true,1,,374,,RUE,PIERRE DURAND,52200,CHAMPIGNY-LES-LANGRES,,,52102,,,,,,,,,,,,,,,,,,,1995-06-30,F,,,,,01.4B,NAF1993,N,5.345612,47.892403,0.95,housenumber,374 Rue Pierre Durand 52200 Champigny-lès-Langres,52102_0075_00374,G,374 RUE PIERRE DURAND,
388769523,00019,38876952300019,O,1992-10-01,NN,,,2019-11-14T14:00:42,true,4,,900,,RUE,PIERRE DURAND,52200,CHAMPIGNY-LES-LANGRES,,,52102,,,,,,,,,,,,,,,,,,,2015-04-15,F,,,,,47.89Z,NAFRev2,N,5.346432,47.887679,0.95,housenumber,900 Rue Pierre Durand 52200 Champigny-lès-Langres,52102_0075_00900,G,900 RUE PIERRE DURAND,
389406943,00016,38940694300016,O,1992-12-01,NN,,,2019-11-14T14:00:42,false,5,MR PETIT FABRICE,,,,,52200,CHAMPIGNY-LES-LANGRES,,,52102,,,,,,,,,,,,,,,,,,,2019-10-07,F,,,,,01.50Z,NAFRev2,O,,,0,,,,,,
389406943,00024,38940694300024,O,2019-10-07,,,,2021-02-23T11:15:21,true,1,,151,,RUE,DE LA BAIE,52200,CHAMPIGNY-LES-LANGRES,,,52102,,,,,,,,,,,,,,,,,,,2019-10-07,A,,,,,01.50Z,NAFRev2,N,5.348158,47.895898,0.94,housenumber,151 Rue de la Baie 52200 Champigny-lès-Langres,52102_0005_00151,G,151 RUE DE LA BAIE,
392322996,00019,39232299600019,O,,,,,2019-11-14T14:00:42,true,1,,,,,MAIRIE,52200,CHAMPIGNY-LES-LANGRES,,,52102,,,,,,,,,,,,,,,,,,,1997-11-28,F,,,,,71.3A,NAF1993,N,3.0709671,50.6304695,0.92,poi.townhall,Hôtel de Ville Lille,https://osm.org/way/40917078,G,,
392610358,00021,39261035800021,O,2016-04-05,,,,2021-08-26T13:47:05,true,2,,57,,RUE,PIERRE DURAND,52200,CHAMPIGNY-LES-LANGRES,,,52102,,,,,,,,,,,,,,,,,,,2021-08-05,A,,,,,47.89Z,NAFRev2,N,5.346573,47.894491,0.95,housenumber,57 Rue Pierre Durand 52200 Champigny-lès-Langres,52102_0075_00057,G,57 RUE PIERRE DURAND,
399319623,00019,39931962300019,O,1995-01-01,NN,,,2019-11-14T14:00:42,true,3,JEAN MICHEL ROVILLE,,,,,52200,CHAMPIGNY-LES-LANGRES,,,52102,,,,,,,,,,,,,,,,,,,2008-01-01,A,,,,,68.20B,NAFRev2,N,,,0,,,,,,
399570084,00026,39957008400026,O,2001-12-01,NN,,2825ZA,2019-11-14T14:00:42,false,5,,61,,RUE,DES MARDELLES,52200,CHAMPIGNY-LES-LANGRES,,,52102,,,,,,,,,,,,,,,,,,,2015-12-31,F,,,,,28.25Z,NAFRev2,N,5.348258,47.895214,0.94,housenumber,61 Rue des Mardelles 52200 Champigny-lès-Langres,52102_0055_00061,G,61 RUE DES MARDELLES,
399938521,00032,39993852100032,O,1997-09-01,NN,,,2019-11-14T14:00:42,false,4,,,,,,52200,CHAMPIGNY-LES-LANGRES,,,52102,,,,,,,,,,,,,,,,,,,2001-01-01,F,,,,,74.8F,NAF1993,N,,,0,,,,,,
400797064,00013,40079706400013,O,1995-04-01,NN,,,2019-11-14T14:00:42,true,1,,80,,IMP,DES PONTS,52200,CHAMPIGNY-LES-LANGRES,,,52102,,,,,,,,,,,,,,,,,,,2000-04-30,F,,,,,92.3J,NAF1993,N,5.342581,47.879832,0.83,housenumber,80 Impasse des Ponts 52200 Champigny-lès-Langres,52102_0078_00080,G,80 IMPASSE DES PONTS,
402212088,00015,40221208800015,O,,NN,,,2019-11-14T14:00:42,true,1,,80,,IMP,DES PONTS,52200,CHAMPIGNY-LES-LANGRES,,,52102,,,,,,,,,,,,,,,,,,,1997-08-31,F,,,,,74.1J,NAF1993,N,5.342581,47.879832,0.83,housenumber,80 Impasse des Ponts 52200 Champigny-lès-Langres,52102_0078_00080,G,80 IMPASSE DES PONTS,
402609036,00015,40260903600015,O,1995-10-16,NN,,,2019-11-14T14:00:42,false,6,,135,,RUE,DE LA MARNE,52200,CHAMPIGNY-LES-LANGRES,,,52102,,,,,,,,,,,,,,,,,,,2012-04-18,F,,,,,32.20Z,NAFRev2,N,5.342926,47.881856,0.94,housenumber,135 Rue de la Marne 52200 Champigny-lès-Langres,52102_0057_00135,G,135 RUE DE LA MARNE,
405361064,00067,40536106400067,O,2001-04-01,NN,,,2019-11-14T14:00:42,false,5,,,,RUE,DU PORT,52200,CHAMPIGNY-LES-LANGRES,,,52102,,,,,,,,,,,,,,,,,,,2006-10-19,F,,,,,71.4B,NAFRev1,N,5.340692,47.880552,0.94,street,Rue du Port 52200 Champigny-lès-Langres,52102_0080,G,RUE DU PORT,
408041879,00011,40804187900011,O,1979-01-01,NN,,,2019-11-14T14:00:42,true,4,,,,,,52200,CHAMPIGNY-LES-LANGRES,,,52102,,,,,,,,,,,,,,,,,,,2000-03-31,F,,,,,01.1A,NAF1993,N,,,0,,,,,,
409725397,00015,40972539700015,O,1977-06-23,NN,,,2021-06-09T18:46:12,true,3,,70,R,RUE,DE ST MENGE,52200,CHAMPIGNY-LES-LANGRES,,,52102,,,,,,,,,,,,,,,,,,,2008-01-01,A,,,,,01.41Z,NAFRev2,N,5.346103,47.895642,0.44,street,Rue Saint Menge 52200 Champigny-lès-Langres,52102_0090,G,RUE SAINT MENGE,
409725405,00016,40972540500016,O,1979-01-01,NN,,,2019-11-14T14:00:42,true,1,,,,,,52200,CHAMPIGNY-LES-LANGRES,,,52102,,,,,,,,,,,,,,,,,,,1999-09-30,F,,,,,01.2G,NAF1993,N,,,0,,,,,,
410409940,00013,41040994000013,O,1997-01-01,,,,2019-11-14T14:00:42,true,1,,4,,RUE,MARDELLES,52200,CHAMPIGNY-LES-LANGRES,,,52102,,,,,,,,,,,,,,,,,,,1998-12-31,F,,,,,60.2L,NAF1993,N,5.347561,47.895226,0.88,housenumber,4 Rue des Mardelles 52200 Champigny-lès-Langres,52102_0055_00004,G,4 RUE DES MARDELLES,
411855950,00019,41185595000019,O,1996-11-20,,,,2019-11-14T14:00:42,true,1,,4,,RUE,DES MARDELLES,52200,CHAMPIGNY-LES-LANGRES,,,52102,,,,,,,,,,,,,,,,,,,1998-12-31,F,,,,,74.1J,NAF1993,N,5.347561,47.895226,0.94,housenumber,4 Rue des Mardelles 52200 Champigny-lès-Langres,52102_0055_00004,G,4 RUE DES MARDELLES,
413582958,00018,41358295800018,O,1997-07-17,NN,,,2019-11-14T14:00:42,true,1,,,,,,52200,CHAMPIGNY-LES-LANGRES,,,52102,,,,,,,,,,,,,,,,,,,1999-02-06,F,,,,,92.3A,NAF1993,O,,,0,,,,,,
417636644,00060,41763664400060,O,2013-04-02,,,,2019-11-14T14:00:42,true,2,,80,,RUE,DU CHATAIGNIER,52200,CHAMPIGNY-LES-LANGRES,,,52102,,,,,,,,,,,,,,,,,,,2015-12-01,F,,,,,47.99B,NAFRev2,N,5.34516,47.888542,0.94,housenumber,80 Rue du Chataignier 52200 Champigny-lès-Langres,52102_0015_00080,G,80 RUE DU CHATAIGNIER,
418678777,00024,41867877700024,O,1999-08-16,NN,,,2019-11-14T14:00:42,true,1,,341,,RUE,PIERRE DURAND,52200,CHAMPIGNY-LES-LANGRES,,,52102,,,,,,,,,,,,,,,,,,,2001-01-28,F,,,,,45.2V,NAF1993,N,5.345704,47.892529,0.95,housenumber,341 Rue Pierre Durand 52200 Champigny-lès-Langres,52102_0075_00341,G,341 RUE PIERRE DURAND,
420337578,00017,42033757800017,O,1998-10-06,NN,,,2022-02-23T15:09:08,true,5,,189,,RUE,DE LORRAINE,52200,CHAMPIGNY-LES-LANGRES,,,52102,,,,,,,,,,,,,,,,,,,2008-06-02,F,,,,,43.22B,NAFRev2,N,5.343225,47.88038,0.81,housenumber,189 Route de Lorraine 52200 Champigny-lès-Langres,52102_0050_00189,G,189 ROUTE DE LORRAINE,
421419532,00013,42141953200013,O,1998-01-01,NN,,,2019-11-14T14:00:42,true,3,,,,,,52200,CHAMPIGNY-LES-LANGRES,,,52102,,,,,,,,,,,,,,,,,,,2008-01-01,A,,,,,68.20B,NAFRev2,N,,,0,,,,,,
422981340,00017,42298134000017,O,1999-04-01,NN,,,2019-11-14T14:00:42,true,4,,,,RTE,DE PEIGNEY,52200,CHAMPIGNY-LES-LANGRES,,,52102,,,,,,,,,,,,,,,,,,,2012-06-30,F,,,,,56.10A,NAFRev2,O,,,0,,,,,,
423175272,00016,42317527200016,O,1999-05-01,NN,,,2019-11-14T14:00:42,false,4,,57,,RUE,PIERRE DURAND,52200,CHAMPIGNY-LES-LANGRES,,,52102,,,,,,,,,,,,,,,,,,,2001-01-01,F,,,,,92.3A,NAF1993,O,5.346573,47.894491,0.95,housenumber,57 Rue Pierre Durand 52200 Champigny-lès-Langres,52102_0075_00057,G,57 RUE PIERRE DURAND,
424329878,00013,42432987800013,O,1999-10-01,NN,,,2019-11-14T14:00:42,true,4,,469,,RUE,PIERRE DURAND,52200,CHAMPIGNY-LES-LANGRES,,,52102,,,,,,,,,,,,,,,,,,,2009-12-31,F,,,,,01.47Z,NAFRev2,N,5.34584,47.890681,0.8,street,Rue Pierre Durand 52200 Champigny-lès-Langres,52102_0075,G,RUE PIERRE DURAND,
427984083,00019,42798408300019,O,1969-01-01,NN,,,2019-11-14T14:00:42,true,1,,,,,,52200,CHAMPIGNY-LES-LANGRES,,,52102,,,,,,,,,,,,,,,,,,,2002-12-31,F,,,,,01.3Z,NAF1993,N,,,0,,,,,,
430079368,00014,43007936800014,O,2000-04-03,,,,2019-11-14T14:00:42,true,1,,109,,PL,JACOTIN TESTEVUIDE,52200,CHAMPIGNY-LES-LANGRES,,,52102,,,,,,,,,,,,,,,,,,,2000-05-31,F,,,,,45.4J,NAF1993,N,5.347088,47.894125,0.87,housenumber,109 Place Jacotin Testevuide 52200 Champigny-lès-Langres,52102_0025_00109,G,109 PLACE JACOTIN TESTEVUIDE,
431169432,00017,43116943200017,O,1994-04-01,NN,,,2019-11-14T14:00:42,true,3,,,,RUE,DE LA BAIE,52200,CHAMPIGNY-LES-LANGRES,,,52102,,,,,,,,,,,,,,,,,,,2008-01-01,A,,,,,68.20B,NAFRev2,N,5.347577,47.895508,0.94,street,Rue de la Baie 52200 Champigny-lès-Langres,52102_0005,G,RUE DE LA BAIE,
431169697,00015,43116969700015,O,1998-04-01,NN,,,2020-08-21T03:47:21,true,4,,570,,RUE,PIERRE DURAND,52200,CHAMPIGNY-LES-LANGRES,,,52102,,,,,,,,,,,,,,,,,,,2019-07-22,F,,,,,68.20B,NAFRev2,N,5.34572,47.890676,0.95,housenumber,570 Rue Pierre Durand 52200 Champigny-lès-Langres,52102_0075_00570,G,570 RUE PIERRE DURAND,
435092028,00016,43509202800016,O,2001-03-09,NN,,,2020-12-07T10:14:19,true,3,,71,,IMP,BELLEVUE,52200,CHAMPIGNY-LES-LANGRES,,,52102,,,,,,,,,,,,,,,,,,,2008-01-01,A,,,,,68.20B,NAFRev2,N,5.343243,47.882511,0.82,housenumber,71 Impasse Bellevue 52200 Champigny-lès-Langres,52102_0007_00071,G,71 IMPASSE BELLEVUE,
440291375,00028,44029137500028,O,2006-01-15,,,,2019-11-14T14:00:42,true,3,,104,,RUE,MOULINOT,52200,CHAMPIGNY-LES-LANGRES,,,52102,,,,,,,,,,,,,,,,,,,2014-03-31,F,,,,,73.11Z,NAFRev2,N,5.345524,47.893662,0.89,housenumber,104 Rue du Moulinot 52200 Champigny-lès-Langres,52102_0065_00104,G,104 RUE DU MOULINOT,
440500205,00016,44050020500016,O,2001-10-01,NN,,,2019-11-14T14:00:42,true,3,,221,,RUE,PIERRE DURAND,52200,CHAMPIGNY-LES-LANGRES,,,52102,,,,,,,,,,,,,,,,,,,2002-12-31,F,,,,,70.2A,NAF1993,N,5.346581,47.893422,0.95,housenumber,221 Rue Pierre Durand 52200 Champigny-lès-Langres,52102_0075_00221,G,221 RUE PIERRE DURAND,
443317060,00012,44331706000012,O,2002-08-07,NN,,,2019-11-14T14:00:42,true,4,,57,,RUE,PIERRE DURAND,52200,CHAMPIGNY-LES-LANGRES,,,52102,,,,,,,,,,,,,,,,,,,2007-04-26,F,,,,,92.3K,NAFRev1,O,5.346573,47.894491,0.95,housenumber,57 Rue Pierre Durand 52200 Champigny-lès-Langres,52102_0075_00057,G,57 RUE PIERRE DURAND,
448485920,00046,44848592000046,O,2016-10-01,NN,,,2019-11-14T14:00:42,true,2,,175,,,RUE    CHAMP TALOT,52200,CHAMPIGNY-LES-LANGRES,,,52102,,,,,,,,,,,,,,,,,,,2018-12-31,F,,,,HELIOS,56.10C,NAFRev2,N,5.347918,47.889794,0.94,housenumber,175 Rue Champ Talot 52200 Champigny-lès-Langres,52102_0013_00175,G,175 RUE CHAMP TALOT,
451150940,00059,45115094000059,O,2004-05-15,NN,,,2019-11-14T14:00:42,false,3,,,,RUE,DU PORT,52200,CHAMPIGNY-LES-LANGRES,,,52102,,,,,,,,,,,,,,,,,,,2006-06-29,F,,,,,74.1J,NAFRev1,N,5.340692,47.880552,0.94,street,Rue du Port 52200 Champigny-lès-Langres,52102_0080,G,RUE DU PORT,
453495483,00027,45349548300027,O,2009-01-15,,,,2019-11-14T14:00:42,false,2,,25,,RUE,DU MOULINOT,52200,CHAMPIGNY-LES-LANGRES,,,52102,,,,,,,,,,,,,,,,,,,2009-07-01,F,,,,,62.02A,NAFRev2,N,5.34633,47.894094,0.94,housenumber,25 Rue du Moulinot 52200 Champigny-lès-Langres,52102_0065_00025,G,25 RUE DU MOULINOT,
478564271,00045,47856427100045,O,2009-02-01,,,,2019-11-14T14:00:42,false,2,,1,,CHE,DU MOULIN ROUGE,52200,CHAMPIGNY-LES-LANGRES,,,52102,,,,,,,,,,,,,,,,,,,2011-10-01,F,LES FILLOTS DE MORPHEE,,,,01.49Z,NAFRev2,N,5.342551,47.892136,0.76,street,Route du Moulin Rouge 52200 Champigny-lès-Langres,52102_d2o91f,G,ROUTE DU MOULIN ROUGE,
478814171,00011,47881417100011,O,2004-09-01,NN,,,2019-11-14T14:00:42,false,4,CHEZ MR JEAUGEY JEAN-MICHE,95,,PL,JACOTIN TESTEVUIDE,52200,CHAMPIGNY-LES-LANGRES,,,52102,,,,,,,,,,,,,,,,,,,2016-08-01,F,,,,,68.20B,NAFRev2,N,5.347128,47.894227,0.87,housenumber,95 Place Jacotin Testevuide 52200 Champigny-lès-Langres,52102_0025_00095,G,95 PLACE JACOTIN TESTEVUIDE,
478814171,00029,47881417100029,O,2016-08-01,,,,2022-02-19T04:00:47,true,1,,20,,PL,DE LA FONTAINE,52200,CHAMPIGNY-LES-LANGRES,,,52102,,,,,,,,,,,,,,,,,,,2016-08-01,A,,,,,68.20B,NAFRev2,N,5.346141,47.894665,0.85,housenumber,20 Place de la Fontaine 52200 Champigny-lès-Langres,52102_0036_00020,G,20 PLACE DE LA FONTAINE,
487761884,00021,48776188400021,O,2009-02-01,02,2020,1089ZZ,2022-08-29T09:19:35,true,3,,155,,RUE,DE LORRAINE,52200,CHAMPIGNY-LES-LANGRES,,,52102,,,,,,,,,,,,,,,,,,,2016-08-01,A,,,,,56.10C,NAFRev2,O,5.342927,47.880487,0.81,housenumber,155 Route de Lorraine 52200 Champigny-lès-Langres,52102_0050_00155,G,155 ROUTE DE LORRAINE,
487775884,00017,48777588400017,O,2005-12-19,,,,2019-11-14T14:00:42,true,2,,100,,RUE,DU CHATAIGNIER,52200,CHAMPIGNY-LES-LANGRES,,,52102,,,,,,,,,,,,,,,,,,,2008-01-01,A,,,,,68.20B,NAFRev2,N,5.344948,47.888626,0.94,housenumber,100 Rue du Chataignier 52200 Champigny-lès-Langres,52102_0015_00100,G,100 RUE DU CHATAIGNIER,
487809048,00019,48780904800019,O,2006-01-03,,,,2019-11-14T14:00:42,true,2,,760,,RUE,PIERRE DURAND,52200,CHAMPIGNY-LES-LANGRES,,,52102,,,,,,,,,,,,,,,,,,,2008-01-01,A,,,,,68.20B,NAFRev2,N,5.345952,47.888958,0.95,housenumber,760 Rue Pierre Durand 52200 Champigny-lès-Langres,52102_0075_00760,G,760 RUE PIERRE DURAND,
488330143,00014,48833014300014,O,2006-01-31,NN,,,2019-11-14T14:00:42,false,3,,100,,RUE,DU CHATAIGNER,52200,CHAMPIGNY-LES-LANGRES,,,52102,,,,,,,,,,,,,,,,,,,2008-01-01,F,,,,,47.74Z,NAFRev2,O,5.344948,47.888626,0.86,housenumber,100 Rue du Chataignier 52200 Champigny-lès-Langres,52102_0015_00100,G,100 RUE DU CHATAIGNIER,
493737209,00012,49373720900012,O,2007-01-02,,,,2019-11-14T14:00:42,false,3,,119,,RTE,DE LORRAINE,52200,CHAMPIGNY-LES-LANGRES,,,52102,,,,,,,,,,,,,,,,,,,2007-05-01,F,,,,,80.4C,NAFRev1,O,5.342288,47.880567,0.85,housenumber,119 Route de Lorraine 52200 Champigny-lès-Langres,52102_0050_00119,G,119 ROUTE DE LORRAINE,
500976709,00013,50097670900013,O,2007-11-09,00,2020,5610CQ,2022-08-29T09:02:32,true,4,,230,,RUE,DE LORRAINE,52200,CHAMPIGNY-LES-LANGRES,,,52102,,,,,,,,,,,,,,,,,,,2012-07-01,A,LE RELAIS DE LA MARNE,,,LE RELAIS DE LA MARNE,56.10A,NAFRev2,O,5.343738,47.880075,0.81,housenumber,230 Route de Lorraine 52200 Champigny-lès-Langres,52102_0050_00230,G,230 ROUTE DE LORRAINE,
502921372,00020,50292137200020,O,2013-10-01,NN,,,2020-08-25T10:15:46,true,3,,174,,RUE,CHAMP TALOT,52200,CHAMPIGNY-LES-LANGRES,,,52102,,,,,,,,,,,,,,,,,,,2019-06-30,F,,,,,43.99C,NAFRev2,N,5.347798,47.88977,0.94,housenumber,174 Rue Champ Talot 52200 Champigny-lès-Langres,52102_0013_00174,G,174 RUE CHAMP TALOT,
515249332,00013,51524933200013,O,2009-10-30,,,,2019-11-14T14:00:42,true,2,,19,,RUE,DE SAINT MENGE,52200,CHAMPIGNY-LES-LANGRES,,,52102,,,,,,,,,,,,,,,,,,,2015-12-31,F,,,,,43.34Z,NAFRev2,N,5.346338,47.895253,0.83,housenumber,19 Rue Saint Menge 52200 Champigny-lès-Langres,52102_0090_00019,G,19 RUE SAINT MENGE,
519650998,00015,51965099800015,O,2010-02-01,,,,2019-11-14T14:00:42,false,4,,780,,RUE,SAINT SEBASTIEN,52200,CHAMPIGNY-LES-LANGRES,,,52102,,,,,,,,,,,,,,,,,,,2015-09-07,F,,,,G&H DISCOUNT,47.91A,NAFRev2,N,5.3461,47.885067,0.94,housenumber,780 Rue Saint Sebastien 52200 Champigny-lès-Langres,52102_0092_00780,G,780 RUE SAINT SEBASTIEN,
522392091,00024,52239209100024,O,2014-10-01,,,,2019-11-14T14:00:42,true,1,,374,,RUE,R    PIERRE DURAND,52200,CHAMPIGNY-LES-LANGRES,,,52102,,,,,,,,,,,,,,,,,,,2014-10-01,A,,,,,46.90Z,NAFRev2,N,5.345612,47.892403,0.85,housenumber,374 Rue Pierre Durand 52200 Champigny-lès-Langres,52102_0075_00374,G,374 RUE PIERRE DURAND,
532671682,00013,53267168200013,O,2011-04-30,,,,2019-11-14T14:00:42,true,1,,100,,RUE,DU CHATAIGNIER,52200,CHAMPIGNY-LES-LANGRES,,,52102,,,,,,,,,,,,,,,,,,,2011-04-30,A,,,,,68.20B,NAFRev2,N,5.344948,47.888626,0.94,housenumber,100 Rue du Chataignier 52200 Champigny-lès-Langres,52102_0015_00100,G,100 RUE DU CHATAIGNIER,
533788840,00015,53378884000015,O,1987-01-02,,,,2019-11-14T14:00:42,true,1,,45,,RUE,DE LA BAIE,52200,CHAMPIGNY-LES-LANGRES,,,52102,,,,,,,,,,,,,,,,,,,1987-01-02,A,,,,,90.01Z,NAFRev2,N,5.347116,47.895254,0.94,housenumber,45 Rue de la Baie 52200 Champigny-lès-Langres,52102_0005_00045,G,45 RUE DE LA BAIE,
537398299,00025,53739829900025,O,2018-10-01,02,2020,,2022-08-29T09:35:51,true,3,,570,,RUE,PIERRE DURAND,52200,CHAMPIGNY-LES-LANGRES,,,52102,,,,,,,,,,,,,,,,,,,2019-12-20,A,,,,,43.22B,NAFRev2,O,5.34572,47.890676,0.95,housenumber,570 Rue Pierre Durand 52200 Champigny-lès-Langres,52102_0075_00570,G,570 RUE PIERRE DURAND,
563840305,00012,56384030500012,O,,NN,,,2019-11-14T14:00:42,true,1,,,,,,52200,CHAMPIGNY-LES-LANGRES,,,52102,,,,,,,,,,,,,,,,,,,,F,,,,,69.11,NAP,N,,,0,,,,,,
583841275,00014,58384127500014,O,,,,,2019-11-14T14:00:42,true,1,,,,,,52200,CHAMPIGNY-LES-LANGRES,,,52102,,,,,,,,,,,,,,,,,,,1984-12-25,F,,,,,67.05,NAP,N,,,0,,,,,,
623840154,00016,62384015400016,O,,,,,2019-11-14T14:00:42,true,1,,,,,,52200,CHAMPIGNY-LES-LANGRES,,,52102,,,,,,,,,,,,,,,,,,,1984-12-25,F,,,,,57.02,NAP,N,,,0,,,,,,