siren,nic,siret,statutDiffusionEtablissement,dateCreationEtablissement,trancheEffectifsEtablissement,anneeEffectifsEtablissement,activitePrincipaleRegistreMetiersEtablissement,dateDernierTraitementEtablissement,etablissementSiege,nombrePeriodesEtablissement,complementAdresseEtablissement,numeroVoieEtablissement,indiceRepetitionEtablissement,typeVoieEtablissement,libelleVoieEtablissement,codePostalEtablissement,libelleCommuneEtablissement,libelleCommuneEtrangerEtablissement,distributionSpecialeEtablissement,codeCommuneEtablissement,codeCedexEtablissement,libelleCedexEtablissement,codePaysEtrangerEtablissement,libellePaysEtrangerEtablissement,complementAdresse2Etablissement,numeroVoie2Etablissement,indiceRepetition2Etablissement,typeVoie2Etablissement,libelleVoie2Etablissement,codePostal2Etablissement,libelleCommune2Etablissement,libelleCommuneEtranger2Etablissement,distributionSpeciale2Etablissement,codeCommune2Etablissement,codeCedex2Etablissement,libelleCedex2Etablissement,codePaysEtranger2Etablissement,libellePaysEtranger2Etablissement,dateDebut,etatAdministratifEtablissement,enseigne1Etablissement,enseigne2Etablissement,enseigne3Etablissement,denominationUsuelleEtablissement,activitePrincipaleEtablissement,nomenclatureActivitePrincipaleEtablissement,caractereEmployeurEtablissement,longitude,latitude,geo_score,geo_type,geo_adresse,geo_id,geo_ligne,geo_l4,geo_l5
215704255,00011,21570425500011,O,1983-03-01,02,2020,,2022-08-29T09:07:51,true,4,,,,,,57580,LUPPY,,,57425,,,,,,,,,,,,,,,,,,,2008-01-01,A,MAIRIE,,,,84.11Z,NAFRev2,O,,,0,,,,,,
215704255,00029,21570425500029,O,1983-12-21,03,2020,,2022-08-29T09:07:51,false,5,,11,,RUE,PRINCIPALE,57580,LUPPY,,,57425,,,,,,,,,,,,,,,,,,,2021-12-25,A,ECOLE PRIMAIRE DE LUPPY,,,,85.20Z,NAFRev2,N,6.346493,48.981454,0.95,housenumber,11 Rue Principale 57580 Luppy,57425_0025_00011,G,11 RUE PRINCIPALE,
215704255,00037,21570425500037,O,1989-09-04,NN,,,,false,4,,,,RUE,PRINCIPALE,57580,LUPPY,,,57425,,,,,,,,,,,,,,,,,,,2002-08-31,F,ECOLE MATERNELLE PUBLIQUE,,,,80.1Z,NAF1993,N,6.344422,48.981141,0.95,street,Rue Principale 57580 Luppy,57425_0025,G,RUE PRINCIPALE,
215704255,00045,21570425500045,O,1997-01-01,NN,,,2008-01-04T18:36:59,false,3,,,,RUE,PRINCIPALE,57580,LUPPY,,,57425,,,,,,,,,,,,,,,,,,,2008-01-01,A,SCE ASSAINISSEMENT,,,,37.00Z,NAFRev2,N,6.344422,48.981141,0.95,street,Rue Principale 57580 Luppy,57425_0025,G,RUE PRINCIPALE,
215704255,00052,21570425500052,O,1998-01-01,NN,,,2016-01-12T00:10:30,false,3,,11,,RUE,PRINCIPALE,57580,LUPPY,,,57425,,,,,,,,,,,,,,,,,,,2008-01-01,A,EXPLOITATION FORESTIERE,,,,02.20Z,NAFRev2,N,6.346493,48.981454,0.95,housenumber,11 Rue Principale 57580 Luppy,57425_0025_00011,G,11 RUE PRINCIPALE,
295700975,00010,29570097500010,O,1983-08-10,NN,,,2006-11-25T09:10:51,true,4,MAIRIE,,,,,57580,LUPPY,,,57425,,,,,,,,,,,,,,,,,,,1993-12-25,F,,,,,70.1C,NAF1993,N,,,0,,,,,,
295705685,00010,29570568500010,O,1999-05-03,NN,,,,true,4,MAIRIE,,,,,57580,LUPPY,,,57425,,,,,,,,,,,,,,,,,,,2002-12-25,F,,,,,70.1C,NAF1993,N,,,0,,,,,,
314169962,00011,31416996200011,O,,,,,,true,1,,70,,RUE,PRINCIPALE,57580,LUPPY,,,57425,,,,,,,,,,,,,,,,,,,1984-12-25,F,,,,,55.72,NAP,N,6.344422,48.981141,0.82,street,Rue Principale 57580 Luppy,57425_0025,G,RUE PRINCIPALE,
314268988,00016,31426898800016,O,1978-01-01,NN,,,2008-12-19T03:53:53,true,4,,27,,RUE,PRINCIPALE,57580,LUPPY,,,57425,,,,,,,,,,,,,,,,,,,2008-01-01,F,,,,,68.20B,NAFRev2,N,6.344775,48.981331,0.95,housenumber,27 Rue Principale 57580 Luppy,57425_0025_00027,G,27 RUE PRINCIPALE,
314386962,00018,31438696200018,O,,,,,,true,1,,30,,RUE,PRINCIPALE,57580,LUPPY,,,57425,,,,,,,,,,,,,,,,,,,1984-12-25,F,,,,,81.21,NAP,N,6.34259,48.980464,0.95,housenumber,30 Rue Principale 57580 Luppy,57425_0025_00030,G,30 RUE PRINCIPALE,
318632395,00014,31863239500014,O,,,,,,true,1,,,,,LOT DU STADE,57580,LUPPY,,,57425,,,,,,,,,,,,,,,,,,,1991-11-14,F,,,,,55.72,NAP,N,,,0,,,,,,
319239224,00011,31923922400011,O,,NN,,,,true,1,,2,,LOT,LE STADE,57580,LUPPY,,,57425,,,,,,,,,,,,,,,,,,,1987-12-25,F,,,,,78.02,NAP,N,,,0,,,,,,
319811287,00030,31981128700030,O,1990-07-01,NN,,,2006-12-15T00:20:20,false,3,,13,,RUE,DE LA CORVEE,57580,LUPPY,,,57425,,,,,,,,,,,,,,,,,,,1994-06-30,F,,,,,52.6E,NAF1993,N,6.344509,48.983043,0.95,housenumber,13 Rue de la Corvee 57580 Luppy,57425_0009_00013,G,13 RUE DE LA CORVEE,
322420068,00023,32242006800023,O,1987-05-11,NN,,,2006-10-27T01:18:36,false,3,,46,,RUE,PRINCIPALE,57580,LUPPY,,,57425,,,,,,,,,,,,,,,,,,,2004-06-30,F,AU CHIABOUT,,,,52.5Z,NAFRev1,N,6.341128,48.980192,0.95,housenumber,46 Rue Principale 57580 Luppy,57425_0025_00046,G,46 RUE PRINCIPALE,
322420068,00049,32242006800049,O,2020-07-01,,,9524ZZ,2021-02-23T10:46:00,true,1,,10,,,PETITE RUE,57580,LUPPY,,,57425,,,,,,,,,,,,,,,,,,,2020-07-01,A,,,,,95.24Z,NAFRev2,N,6.3444,48.980821,0.95,housenumber,10 Petite Rue 57580 Luppy,57425_b294_00010,G,10 PETITE RUE,
325209419,00010,32520941900010,O,1981-04-01,NN,,,2008-01-04T19:04:35,true,3,,4,,LOT,LE STADE,57580,LUPPY,,,57425,,,,,,,,,,,,,,,,,,,2008-01-01,A,,,,,47.99A,NAFRev2,N,,,0,,,,,,
326455300,00011,32645530000011,O,,NN,,,,true,1,,31,,,,57580,LUPPY,,,57425,,,,,,,,,,,,,,,,,,,1986-04-30,F,,,,,60.09,NAP,N,,,0,,,,,,
327922126,00013,32792212600013,O,,,,,,true,1,,30,,RUE,PRINCIPALE,57580,LUPPY,,,57425,,,,,,,,,,,,,,,,,,,1984-12-25,F,,,,,67.04,NAP,N,6.34259,48.980464,0.95,housenumber,30 Rue Principale 57580 Luppy,57425_0025_00030,G,30 RUE PRINCIPALE,
330410242,00011,33041024200011,O,,NN,,,,true,1,,30,,RUE,PRINCIPALE,57580,LUPPY,,,57425,,,,,,,,,,,,,,,,,,,,F,,,,,67.04,NAP,N,6.34259,48.980464,0.95,housenumber,30 Rue Principale 57580 Luppy,57425_0025_00030,G,30 RUE PRINCIPALE,
331511287,00020,33151128700020,O,1985-11-01,NN,,,2008-11-07T00:50:18,true,3,,10,,RUE,DES MALINS PRES,57580,LUPPY,,,57425,,,,,,,,,,,,,,,,,,,2005-03-30,F,,,,,36.1K,NAFRev1,N,6.343563,48.982493,0.95,housenumber,10 Rue des Malins Pres 57580 Luppy,57425_0018_00010,G,10 RUE DES MALINS PRES,
332032739,00044,33203273900044,O,2012-01-01,,,,2013-12-09T08:21:09,false,1,,,,,BOIS SAINT PAUL,57580,LUPPY,,,57425,,,,,,,,,,,,,,,,,,,2012-01-01,A,BOIS SAINT PAUL,,,,02.10Z,NAFRev2,N,6.348916,48.982292,0.33,street,Le Clos Saint Pierre 57580 Luppy,57425_B295,G,LE CLOS SAINT PIERRE,
333243715,00021,33324371500021,O,,,,,,true,1,,64,,RUE,PRINCIPALE,57580,LUPPY,,,57425,,,,,,,,,,,,,,,,,,,1987-12-02,F,,,,,55.72,NAP,N,6.344422,48.981141,0.82,street,Rue Principale 57580 Luppy,57425_0025,G,RUE PRINCIPALE,
334242443,00011,33424244300011,O,,NN,,,,true,1,,,,,,57580,LUPPY,,,57425,,,,,,,,,,,,,,,,,,,,F,,,,,01.00,NAP,N,,,0,,,,,,
339206500,00011,33920650000011,O,,NN,,,,true,1,,134,,RTE,TRAGNY,57580,LUPPY,,,57425,,,,,,,,,,,,,,,,,,,1992-03-31,F,,,,,50.2Z,NAF1993,N,6.345594,48.9801,0.41,street,Route de Tragny 57580 Luppy,57425_0050,G,ROUTE DE TRAGNY,
339526360,00013,33952636000013,O,1986-10-15,NN,,,2006-10-27T02:57:05,true,4,,36,,RUE,DE TRAGNY,57580,LUPPY,,,57425,,,,,,,,,,,,,,,,,,,2001-12-25,F,,,,,85.1G,NAF1993,N,6.346342,48.978638,0.95,housenumber,36 Rue de Tragny 57580 Luppy,57425_0039_00036,G,36 RUE DE TRAGNY,
341378164,00014,34137816400014,O,1987-06-02,,,,,true,4,,19,,,LE STADE,57580,LUPPY,,,57425,,,,,,,,,,,,,,,,,,,1991-12-25,F,,,,,57.11,NAP,N,0.2471109,48.0358072,0.79,poi.stadium,(Stade) Sargé-lès-le-Mans,https://osm.org/way/126138110,G,,
341426310,00015,34142631000015,O,1985-01-02,NN,,,,true,3,,158,,RTE,DE TRAGNY,57580,LUPPY,,,57425,,,,,,,,,,,,,,,,,,,2003-12-31,F,,,,,52.6G,NAFRev1,N,6.345594,48.9801,0.56,street,Route de Tragny 57580 Luppy,57425_0050,G,ROUTE DE TRAGNY,
347625238,00014,34762523800014,O,1988-07-11,NN,,,2007-03-16T05:04:34,true,3,,30,,RUE,PRINCIPALE,57580,LUPPY,,,57425,,,,,,,,,,,,,,,,,,,2007-03-30,F,,,,,55.4B,NAFRev1,N,6.34259,48.980464,0.95,housenumber,30 Rue Principale 57580 Luppy,57425_0025_00030,G,30 RUE PRINCIPALE,
349650077,00010,34965007700010,O,1983-02-01,NN,,,2007-05-11T04:00:42,true,3,,,,,FERME DE HICOURT,57580,LUPPY,,,57425,,,,,,,,,,,,,,,,,,,2006-12-31,F,,,,,70.2C,NAFRev1,N,6.33584,48.994661,0.94,locality,Ferme de Hicourt 57580 Luppy,57425_B102,G,FERME DE HICOURT,
349834101,00017,34983410100017,O,1989-02-01,NN,,,2021-12-02T15:25:09,true,3,FERME DE HICOURT,,,,,57580,LUPPY,,,57425,,,,,,,,,,,,,,,,,,,2008-01-01,A,,,,,01.11Z,NAFRev2,N,6.33584,48.994661,0.94,locality,Ferme de Hicourt 57580 Luppy,57425_B102,D,FERME DE HICOURT,
350907077,00019,35090707700019,O,1989-06-01,01,2020,4322BA,2022-08-29T09:01:25,true,4,,22,,RUE,DES MALINS PRES,57580,LUPPY,,,57425,,,,,,,,,,,,,,,,,,,2008-01-01,A,,,,,43.29A,NAFRev2,O,6.342976,48.983523,0.95,housenumber,22 Rue des Malins Pres 57580 Luppy,57425_0018_00022,G,22 RUE DES MALINS PRES,
352707947,00011,35270794700011,O,1984-01-15,NN,,,2013-05-24T03:50:09,true,4,,14,,RUE,DU FLOPRE,57580,LUPPY,,,57425,,,,,,,,,,,,,,,,,,,2013-01-31,F,,,,,01.11Z,NAFRev2,N,6.347279,48.982478,0.94,housenumber,14 Rue du Flopre 57580 Luppy,57425_0015_00014,G,14 RUE DU FLOPRE,
353442411,00040,35344241100040,O,1998-04-01,NN,,,2009-03-13T11:05:06,false,4,,6,,IMP,DE LA VIGNOTTE,57580,LUPPY,,,57425,,,,,,,,,,,,,,,,,,,2003-04-02,F,,,,,45.2J,NAFRev1,O,6.343127,48.984343,0.86,housenumber,6 Impasse de la Vignotte 57580 Luppy,57425_0054_00006,G,6 IMPASSE DE LA VIGNOTTE,
353655368,00028,35365536800028,O,1997-07-01,NN,,,2008-11-08T00:31:25,false,5,,46,,RUE,PRINCIPALE,57580,LUPPY,,,57425,,,,,,,,,,,,,,,,,,,2002-07-01,F,ENT.PEZZOTA P.,,,,45.2V,NAF1993,O,6.341128,48.980192,0.95,housenumber,46 Rue Principale 57580 Luppy,57425_0025_00046,G,46 RUE PRINCIPALE,
353655368,00044,35365536800044,O,2002-07-01,01,2020,4399CZ,2022-08-29T09:04:06,true,3,,3,,,PETITE RUE,57580,LUPPY,,,57425,,,,,,,,,,,,,,,,,,,2008-01-01,A,,,,,43.99C,NAFRev2,O,6.345053,48.980878,0.95,housenumber,3 Petite Rue 57580 Luppy,57425_b294_00003,G,3 PETITE RUE,
356703215,00018,35670321500018,O,,NN,,,,true,1,,30,,,,57580,LUPPY,,,57425,,,,,,,,,,,,,,,,,,,,F,,,,,81.21,NAP,N,,,0,,,,,,
366800563,00012,36680056300012,O,,,,,,true,1,,,,RUE,PRINCIPALE,57580,LUPPY,,,57425,,,,,,,,,,,,,,,,,,,1987-10-31,F,,,,,55.60,NAP,N,6.344422,48.981141,0.95,street,Rue Principale 57580 Luppy,57425_0025,G,RUE PRINCIPALE,
373701127,00012,37370112700012,O,1973-01-01,NN,,,2009-10-28T03:32:37,true,4,,,,,,57580,LUPPY,,,57425,,,,,,,,,,,,,,,,,,,2009-09-30,F,,,,,47.89Z,NAFRev2,N,,,0,,,,,,
378724728,00027,37872472800027,O,1900-01-01,NN,,,2011-04-28T00:45:07,false,3,,4,,RUE,BLANCPAIN,57580,LUPPY,,,57425,,,,,,,,,,,,,,,,,,,1991-12-25,F,,,,,55.70,NAP,N,6.342492,48.983504,0.88,housenumber,4 Rue du Blancpain 57580 Luppy,57425_0005_00004,G,4 RUE DU BLANCPAIN,
381949999,00019,38194999900019,O,1991-04-05,NN,,,2016-09-30T04:57:17,true,4,,10,,,PETITE RUE,57580,LUPPY,,,57425,,,,,,,,,,,,,,,,,,,2014-10-07,A,,,,,68.20B,NAFRev2,N,6.3444,48.980821,0.95,housenumber,10 Petite Rue 57580 Luppy,57425_b294_00010,G,10 PETITE RUE,
383850708,00017,38385070800017,O,1991-11-15,NN,,,2008-11-08T00:44:03,false,4,,,,LOT,DU STADE,57580,LUPPY,,,57425,,,,,,,,,,,,,,,,,,,1999-06-01,F,,,,,45.2V,NAF1993,O,,,0,,,,,,
391270410,00023,39127041000023,O,1999-03-01,NN,,,2012-05-11T10:01:10,true,4,,,,,HARAS DE LUPPY,57580,LUPPY,,,57425,,,,,,,,,,,,,,,,,,,2012-02-11,F,,,,,01.43Z,NAFRev2,N,6.330128,48.984329,0.42,locality,Haut de la Mare 57580 Luppy,57425_B141,G,HAUT DE LA MARE,
392774444,00013,39277444400013,O,1977-01-01,NN,,,2007-05-19T11:35:46,false,3,,153,,RUE,DE TRAGNY,57580,LUPPY,,,57425,,,,,,,,,,,,,,,,,,,2006-05-01,F,,,,,01.3Z,NAFRev1,N,6.345782,48.979351,0.77,street,Rue de Tragny 57580 Luppy,57425_0039,G,RUE DE TRAGNY,
392774444,00021,39277444400021,O,2006-05-01,01,2020,,2022-08-29T09:16:48,true,2,,33,,RTE,DE TRAGNY,57580,LUPPY,,,57425,,,,,,,,,,,,,,,,,,,2008-01-01,A,,,,,01.50Z,NAFRev2,N,6.346148,48.978502,0.79,housenumber,33 Rue de Tragny 57580 Luppy,57425_0039_00033,G,33 RUE DE TRAGNY,
399283936,00025,39928393600025,O,2002-10-21,NN,,,2009-11-17T20:12:17,true,3,,8,,RUE,BLANCPAIN,57580,LUPPY,,,57425,,,,,,,,,,,,,,,,,,,2003-12-25,F,,,,,45.4D,NAFRev1,N,6.342359,48.983722,0.88,housenumber,8 Rue du Blancpain 57580 Luppy,57425_0005_00008,G,8 RUE DU BLANCPAIN,
403464571,00021,40346457100021,O,2013-07-09,NN,,,2021-02-23T11:27:46,true,1,,23,,RUE,PRINCIPALE,57580,LUPPY,,,57425,,,,,,,,,,,,,,,,,,,2013-07-09,A,,,,,47.89Z,NAFRev2,N,6.345186,48.981362,0.95,housenumber,23 Rue Principale 57580 Luppy,57425_0025_00023,G,23 RUE PRINCIPALE,
404729071,00013,40472907100013,O,,NN,,,,true,1,,13,,RUE,DE LA CORVEE,57580,LUPPY,,,57425,,,,,,,,,,,,,,,,,,,1996-12-25,F,,,,,74.8F,NAF1993,N,6.344509,48.983043,0.95,housenumber,13 Rue de la Corvee 57580 Luppy,57425_0009_00013,G,13 RUE DE LA CORVEE,
404899791,00028,40489979100028,O,2000-04-01,NN,,,2012-11-23T08:45:08,true,4,,25,,RUE,DE LA CORVEE,57580,LUPPY,,,57425,,,,,,,,,,,,,,,,,,,2012-11-09,F,,,,,47.89Z,NAFRev2,N,6.344394,48.983981,0.95,housenumber,25 Rue de la Corvee 57580 Luppy,57425_0009_00025,G,25 RUE DE LA CORVEE,
408930428,00011,40893042800011,O,1980-01-01,NN,,,2012-02-10T05:43:05,true,12,,105,,RUE,PRINCIPALE,57580,LUPPY,,,57425,,,,,,,,,,,,,,,,,,,2011-03-05,F,,,,,01.11Z,NAFRev2,N,6.344422,48.981141,0.78,street,Rue Principale 57580 Luppy,57425_0025,G,RUE PRINCIPALE,
408930428,00029,40893042800029,O,1996-11-18,NN,,,2008-11-08T01:20:55,false,5,,22,,RUE,PRINCIPALE,57580,LUPPY,,,57425,,,,,,,,,,,,,,,,,,,2006-04-01,F,,,,,15.9A,NAFRev1,N,6.343195,48.980584,0.95,housenumber,22 Rue Principale 57580 Luppy,57425_0025_00022,G,22 RUE PRINCIPALE,
408930436,00014,40893043600014,O,1980-01-01,NN,,,2009-03-02T09:05:40,true,4,,,,,FERME ZEDREVAUX,57580,LUPPY,,,57425,,,,,,,,,,,,,,,,,,,2008-12-31,F,,,,,01.11Z,NAFRev2,N,6.341725,48.961241,0.93,street,Ferme de Zedrevaux 57580 Luppy,57425_bwfbin,G,FERME DE ZEDREVAUX,
408930444,00018,40893044400018,O,1986-09-01,NN,,,,true,1,,184,,RTE,DE TRAGNY,57580,LUPPY,,,57425,,,,,,,,,,,,,,,,,,,2000-08-31,F,,,,,01.1F,NAF1993,N,6.345594,48.9801,0.56,street,Route de Tragny 57580 Luppy,57425_0050,G,ROUTE DE TRAGNY,
408930451,00013,40893045100013,O,1986-01-01,NN,,,2006-10-28T03:37:20,true,3,,,,,,57580,LUPPY,,,57425,,,,,,,,,,,,,,,,,,,2005-12-31,F,,,,,01.3Z,NAFRev1,N,,,0,,,,,,
413439118,00014,41343911800014,O,1997-04-01,,,,,false,3,MME REZNY,26,,RUE,DE TRAGNY,57580,LUPPY,,,57425,,,,,,,,,,,,,,,,,,,2003-01-01,F,,,,,91.3E,NAF1993,N,6.346208,48.979295,0.95,housenumber,26 Rue de Tragny 57580 Luppy,57425_0039_00026,G,26 RUE DE TRAGNY,
413439118,00022,41343911800022,O,2003-01-01,,,,2008-01-04T22:33:26,true,3,,5,B,IMP,DE LA VIGNOTTE,57580,LUPPY,,,57425,,,,,,,,,,,,,,,,,,,2008-01-01,A,,,,,94.99Z,NAFRev2,O,6.343273,48.984377,0.78,housenumber,5bis Impasse de la Vignotte 57580 Luppy,57425_0054_00005_bis,G,5BIS IMPASSE DE LA VIGNOTTE,
415218411,00031,41521841100031,O,2018-08-17,,,4520AC,2021-07-13T11:39:44,true,2,,9,,RUE,DE L'EGLISE,57580,LUPPY,,,57425,,,,,,,,,,,,,,,,,,,2020-12-31,F,,,,MAGNY AUTO,45.20A,NAFRev2,N,6.342714,48.981347,0.94,housenumber,9 Rue de l’Eglise 57580 Luppy,57425_0014_00009,G,9 RUE DE L EGLISE,
418112439,00025,41811243900025,O,1998-06-01,,,,2011-05-03T00:33:52,false,3,,,,RUE,PRINCIPALE,57580,LUPPY,,,57425,,,,,,,,,,,,,,,,,,,2000-06-30,F,,,,,45.3C,NAF1993,N,6.344422,48.981141,0.95,street,Rue Principale 57580 Luppy,57425_0025,G,RUE PRINCIPALE,
419563234,00014,41956323400014,O,1998-07-16,NN,,,2008-01-04T23:38:52,true,3,BELLOY HERVE,33,,RTE,DE TRAGNY,57580,LUPPY,,,57425,,,,,,,,,,,,,,,,,,,2008-01-01,A,,,,,68.20A,NAFRev2,N,6.346148,48.978502,0.79,housenumber,33 Rue de Tragny 57580 Luppy,57425_0039_00033,G,33 RUE DE TRAGNY,
428012686,00013,42801268600013,O,1992-10-01,NN,,,2007-05-11T16:22:31,true,3,,40,,RUE,TRAGNY,57580,LUPPY,,,57425,,,,,,,,,,,,,,,,,,,2006-12-31,F,,,,,70.2C,NAFRev1,N,6.346481,48.978411,0.77,interpolation,40 Rue de Tragny 57580 Luppy,,G,38 RUE DE TRAGNY,
430462861,00013,43046286100013,O,2000-04-06,NN,,,2008-01-05T01:53:24,true,3,,25,,RUE,PRINCIPALE,57580,LUPPY,,,57425,,,,,,,,,,,,,,,,,,,2008-01-01,A,,,,,68.20A,NAFRev2,N,6.345406,48.981379,0.95,housenumber,25 Rue Principale 57580 Luppy,57425_0025_00025,G,25 RUE PRINCIPALE,
432536183,00010,43253618300010,O,2000-06-01,NN,,,2008-01-04T18:39:59,true,3,MME TURBAN LUCETTE,46,,RUE,PRINCIPALE,57580,LUPPY,,,57425,,,,,,,,,,,,,,,,,,,2008-01-01,A,,,,,68.20A,NAFRev2,N,6.341128,48.980192,0.95,housenumber,46 Rue Principale 57580 Luppy,57425_0025_00046,G,46 RUE PRINCIPALE,
433393626,00018,43339362600018,O,1974-06-28,NN,,,2008-01-04T19:02:30,true,3,MR GASCARD LUC,,,,FERME DE HICOURT,57580,LUPPY,,,57425,,,,,,,,,,,,,,,,,,,2008-01-01,A,,,,,68.20B,NAFRev2,N,6.33584,48.994661,0.94,locality,Ferme de Hicourt 57580 Luppy,57425_B102,G,FERME DE HICOURT,
433803418,00022,43380341800022,O,2020-11-20,,,,2021-02-17T09:34:33,true,1,,3,,RUE,DU CHATEAU,57580,LUPPY,,,57425,,,,,,,,,,,,,,,,,,,2020-11-20,A,,,,,68.20A,NAFRev2,N,6.347458,48.980299,0.94,housenumber,3 Rue du Chateau 57580 Luppy,57425_0007_00003,G,3 RUE DU CHATEAU,
438342370,00014,43834237000014,O,2001-06-26,NN,,,2008-01-04T20:09:31,true,3,MME NOWICKI NATHALIE,10,,,PETITE RUE,57580,LUPPY,,,57425,,,,,,,,,,,,,,,,,,,2008-01-01,A,,,,,68.20A,NAFRev2,N,6.3444,48.980821,0.95,housenumber,10 Petite Rue 57580 Luppy,57425_b294_00010,G,10 PETITE RUE,
440614667,00010,44061466700010,O,2002-01-02,NN,,4334ZB,2015-03-18T01:15:09,true,3,,63,,RUE,PRINCIPALE,57580,LUPPY,,,57425,,,,,,,,,,,,,,,,,,,2008-01-01,A,,,,,43.34Z,NAFRev2,O,6.342079,48.980447,0.95,housenumber,63 Rue Principale 57580 Luppy,57425_0025_00063,G,63 RUE PRINCIPALE,
440883304,00014,44088330400014,O,2002-01-15,NN,,,2017-07-20T03:07:03,true,3,MR DI GIOVANNI ORONZO,22,,RUE,DES MALINS PRES,57580,LUPPY,,,57425,,,,,,,,,,,,,,,,,,,2008-01-01,A,,,,,68.20B,NAFRev2,N,6.342976,48.983523,0.95,housenumber,22 Rue des Malins Pres 57580 Luppy,57425_0018_00022,G,22 RUE DES MALINS PRES,
442910824,00014,44291082400014,O,2002-08-01,NN,,,2014-04-04T05:06:41,true,4,CHEZ MME COUTURIER,,,,ROUTE DE TRAGNY,57580,LUPPY,,,57425,,,,,,,,,,,,,,,,,,,2014-01-31,F,,,,,01.11Z,NAFRev2,N,6.345594,48.9801,0.94,street,Route de Tragny 57580 Luppy,57425_0050,G,ROUTE DE TRAGNY,
448196998,00018,44819699800018,O,2003-03-15,NN,,,2010-02-14T04:05:14,true,3,,21,,RUE,PRINCIPALE,57580,LUPPY,,,57425,,,,,,,,,,,,,,,,,,,2005-03-23,F,,,,,45.2V,NAFRev1,O,6.345406,48.981379,0.95,housenumber,21 Rue Principale 57580 Luppy,57425_0025_00021,G,21 RUE PRINCIPALE,
448621631,00010,44862163100010,O,2003-04-15,NN,,,2008-01-04T23:25:22,true,3,MR DVORSAK DENIS,10,,RUE,DU HAUT DE LA MARE,57580,LUPPY,,,57425,,,,,,,,,,,,,,,,,,,2008-01-01,A,,,,,68.20A,NAFRev2,N,6.342365,48.982684,0.95,housenumber,10 Rue du Haut de la Mare 57580 Luppy,57425_0017_00010,G,10 RUE DU HAUT DE LA MARE,
448678433,00013,44867843300013,O,2003-04-23,NN,,,2006-10-31T05:16:10,false,3,MR DI MAIO MAURICE,2,,RUE,DE L EGLISE,57580,LUPPY,,,57425,,,,,,,,,,,,,,,,,,,2005-03-07,F,,,,,70.2C,NAFRev1,N,6.343119,48.981224,0.94,housenumber,2 Rue de l’Eglise 57580 Luppy,57425_0014_00002,G,2 RUE DE L EGLISE,
450238076,00019,45023807600019,O,2003-08-21,NN,,,2008-01-05T21:29:16,true,3,,26,,RUE,D'ANCY LES SOLGNE,57580,LUPPY,,,57425,,,,,,,,,,,,,,,,,,,2008-01-01,A,,,,,68.20B,NAFRev2,N,6.338443,48.978868,0.84,housenumber,26 Route d’Ancy les Solgne 57580 Luppy,57425_0001_00026,G,26 ROUTE D ANCY LES SOLGNE,
451184873,00029,45118487300029,O,2005-09-01,01,2020,3109AZ,2022-08-29T09:06:13,true,3,,10,,RUE,DES MALINS PRES,57580,LUPPY,,,57425,,,,,,,,,,,,,,,,,,,2008-01-01,A,,,,,31.09A,NAFRev2,O,6.343563,48.982493,0.95,housenumber,10 Rue des Malins Pres 57580 Luppy,57425_0018_00010,G,10 RUE DES MALINS PRES,
479232399,00010,47923239900010,O,2004-10-15,NN,,,2012-02-28T11:18:40,false,4,,69,,RUE,PRINCIPALE,57580,LUPPY,,,57425,,,,,,,,,,,,,,,,,,,2011-05-31,F,,,,,68.20B,NAFRev2,N,6.341741,48.980442,0.95,housenumber,69 Rue Principale 57580 Luppy,57425_0025_00069,G,69 RUE PRINCIPALE,
480267582,00025,48026758200025,O,2010-10-08,,,,2021-02-23T13:43:14,true,1,,5,,,PETITE RUE,57580,LUPPY,,,57425,,,,,,,,,,,,,,,,,,,2010-10-08,A,,,,,68.20B,NAFRev2,N,6.344164,48.980857,0.95,housenumber,5 Petite Rue 57580 Luppy,57425_b294_00005,G,5 PETITE RUE,
481279032,00017,48127903200017,O,2005-04-01,00,2020,4321AB,2022-08-29T09:14:42,false,3,,22,,RUE,DES MALINS PRES,57580,LUPPY,,,57425,,,,,,,,,,,,,,,,,,,2020-12-31,A,,,,,43.21A,NAFRev2,N,6.342976,48.983523,0.95,housenumber,22 Rue des Malins Pres 57580 Luppy,57425_0018_00022,G,22 RUE DES MALINS PRES,
484993647,00011,48499364700011,O,2005-11-01,,,4334ZC,2015-03-18T01:21:56,true,3,,55,,RUE,PRINCIPALE,57580,LUPPY,,,57425,,,,,,,,,,,,,,,,,,,2014-06-26,F,,,,,43.34Z,NAFRev2,N,6.342595,48.980686,0.95,housenumber,55 Rue Principale 57580 Luppy,57425_0025_00055,G,55 RUE PRINCIPALE,
491192407,00022,49119240700022,O,2006-07-24,,,,2021-02-23T13:57:21,true,2,,8,,RUE,PETITE,57580,LUPPY,,,57425,,,,,,,,,,,,,,,,,,,2008-01-01,A,,,,,53.20Z,NAFRev2,N,6.344566,48.980834,0.77,housenumber,8 Petite Rue 57580 Luppy,57425_b294_00008,G,8 PETITE RUE,
491602223,00019,49160222300019,O,2006-09-01,,,,2014-07-17T19:27:36,true,3,,,,RUE,PRINCIPALE,57580,LUPPY,,,57425,,,,,,,,,,,,,,,,,,,2014-05-02,F,,,,,02.40Z,NAFRev2,N,6.344422,48.981141,0.95,street,Rue Principale 57580 Luppy,57425_0025,G,RUE PRINCIPALE,
491800033,00012,49180003300012,O,2006-06-01,,,,2008-01-05T22:16:37,true,2,,,,,FERME DE ZEDERVEAUX,57580,LUPPY,,,57425,,,,,,,,,,,,,,,,,,,2008-01-01,A,,,,,68.20B,NAFRev2,N,6.341725,48.961241,0.57,street,Ferme de Zedrevaux 57580 Luppy,57425_bwfbin,G,FERME DE ZEDREVAUX,
492688114,00023,49268811400023,O,2011-02-21,02,2019,4322BA,2021-10-27T08:31:14,true,3,,6,,RUE,BLANCPAIN,57580,LUPPY,,,57425,,,,,,,,,,,,,,,,,,,2015-08-31,A,,,,MON PLOMBIER,43.22B,NAFRev2,N,6.342437,48.983592,0.88,housenumber,6 Rue du Blancpain 57580 Luppy,57425_0005_00006,G,6 RUE DU BLANCPAIN,
493600340,00019,49360034000019,O,2007-02-01,,,,2009-12-10T20:15:19,true,3,,4,,RUE,DU BLANCPAIN,57580,LUPPY,,,57425,,,,,,,,,,,,,,,,,,,2009-12-20,F,,,,,62.09Z,NAFRev2,N,6.342492,48.983504,0.95,housenumber,4 Rue du Blancpain 57580 Luppy,57425_0005_00004,G,4 RUE DU BLANCPAIN,
502842545,00019,50284254500019,O,2008-03-17,,,,2019-03-06T15:45:58,true,2,,5,,IMP,DE LA VIGNOTTE,57580,LUPPY,,,57425,,,,,,,,,,,,,,,,,,,2012-05-18,A,,,,,47.89Z,NAFRev2,N,6.343511,48.984443,0.86,housenumber,5 Impasse de la Vignotte 57580 Luppy,57425_0054_00005,G,5 IMPASSE DE LA VIGNOTTE,
503281677,00032,50328167700032,O,2020-01-01,,,,2021-02-23T14:15:02,true,1,,69,,RUE,PRINCIPALE,57580,LUPPY,,,57425,,,,,,,,,,,,,,,,,,,2020-01-01,A,BERTRAND NATHANAEL,,,,02.10Z,NAFRev2,N,6.341741,48.980442,0.95,housenumber,69 Rue Principale 57580 Luppy,57425_0025_00069,G,69 RUE PRINCIPALE,
508193448,00034,50819344800034,O,2017-12-07,,,,2022-01-14T08:43:19,true,2,,23,,RUE,PRINCIPALE,57580,LUPPY,,,57425,,,,,,,,,,,,,,,,,,,2021-12-28,A,,,,TRADITION GOURMANDE,47.81Z,NAFRev2,O,6.345186,48.981362,0.95,housenumber,23 Rue Principale 57580 Luppy,57425_0025_00023,G,23 RUE PRINCIPALE,
508253200,00010,50825320000010,O,2008-08-25,,,,2021-07-31T03:36:36,false,2,,6,,IMP,DE LA VIGNOTTE,57580,LUPPY,,,57425,,,,,,,,,,,,,,,,,,,2020-03-01,F,,,,,68.20B,NAFRev2,N,6.343127,48.984343,0.86,housenumber,6 Impasse de la Vignotte 57580 Luppy,57425_0054_00006,G,6 IMPASSE DE LA VIGNOTTE,
509375119,00021,50937511900021,O,2009-03-21,,,,2021-02-23T15:15:41,true,3,,16,,,LE CLOS SAINT PIERRE,57580,LUPPY,,,57425,,,,,,,,,,,,,,,,,,,2019-06-19,A,,,,,86.90D,NAFRev2,N,6.349573,48.982574,0.95,housenumber,16 Le Clos Saint Pierre 57580 Luppy,57425_b295_00016,G,16 LE CLOS SAINT PIERRE,
515264901,00015,51526490100015,O,2009-09-18,,,,2009-10-06T03:54:27,true,1,,26,,RUE,PRINCIPALE,57580,LUPPY,,,57425,,,,,,,,,,,,,,,,,,,2009-09-18,A,,,,,47.99A,NAFRev2,N,6.342938,48.980533,0.95,housenumber,26 Rue Principale 57580 Luppy,57425_0025_00026,G,26 RUE PRINCIPALE,
518449681,00023,51844968100023,O,2016-08-01,,,4333ZZ,2019-01-24T19:34:13,false,2,,10,,RUE,PRINCIPALE,57580,LUPPY,,,57425,,,,,,,,,,,,,,,,,,,2019-01-01,F,LORRAINE INTERIEUR,,,LORRAINE INTERIEUR,43.33Z,NAFRev2,N,6.345128,48.981278,0.95,housenumber,10 Rue Principale 57580 Luppy,57425_0025_00010,G,10 RUE PRINCIPALE,