siren,nic,siret,statutDiffusionEtablissement,dateCreationEtablissement,trancheEffectifsEtablissement,anneeEffectifsEtablissement,activitePrincipaleRegistreMetiersEtablissement,dateDernierTraitementEtablissement,etablissementSiege,nombrePeriodesEtablissement,complementAdresseEtablissement,numeroVoieEtablissement,indiceRepetitionEtablissement,typeVoieEtablissement,libelleVoieEtablissement,codePostalEtablissement,libelleCommuneEtablissement,libelleCommuneEtrangerEtablissement,distributionSpecialeEtablissement,codeCommuneEtablissement,codeCedexEtablissement,libelleCedexEtablissement,codePaysEtrangerEtablissement,libellePaysEtrangerEtablissement,complementAdresse2Etablissement,numeroVoie2Etablissement,indiceRepetition2Etablissement,typeVoie2Etablissement,libelleVoie2Etablissement,codePostal2Etablissement,libelleCommune2Etablissement,libelleCommuneEtranger2Etablissement,distributionSpeciale2Etablissement,codeCommune2Etablissement,codeCedex2Etablissement,libelleCedex2Etablissement,codePaysEtranger2Etablissement,libellePaysEtranger2Etablissement,dateDebut,etatAdministratifEtablissement,enseigne1Etablissement,enseigne2Etablissement,enseigne3Etablissement,denominationUsuelleEtablissement,activitePrincipaleEtablissement,nomenclatureActivitePrincipaleEtablissement,caractereEmployeurEtablissement,longitude,latitude,geo_score,geo_type,geo_adresse,geo_id,geo_ligne,geo_l4,geo_l5
045470234,00019,04547023400019,O,,NN,,,,true,1,,,,,,64570,ANCE,,,64020,,,,,,,,,,,,,,,,,,,1993-05-03,F,,,,,70.2C,NAF1993,N,,,0,,,,,,
046170676,00012,04617067600012,O,,,,,,true,1,,,,,,64570,ANCE,,,64020,,,,,,,,,,,,,,,,,,,1984-12-25,F,,,,,57.02,NAP,N,,,0,,,,,,
256402082,00018,25640208200018,O,,,,,2006-11-25T09:09:18,true,1,,,,,,64570,ANCE,,,64020,,,,,,,,,,,,,,,,,,,,F,,,,,90.11,NAP,N,,,0,,,,,,
305432270,00018,30543227000018,O,,,,,2010-03-09T05:55:25,true,1,,,,,,64570,ANCE,,,64020,,,,,,,,,,,,,,,,,,,1984-12-25,F,,,,,67.04,NAP,N,,,0,,,,,,
305876914,00014,30587691400014,O,1966-01-01,NN,,,,true,1,,,,,,64570,ANCE,,,64020,,,,,,,,,,,,,,,,,,,1998-10-31,F,,,,,15.5C,NAF1993,O,,,0,,,,,,
319411757,00010,31941175700010,O,,NN,,,,true,1,,,,LOT,BARBE LABARTHE,64570,ANCE,,,64020,,,,,,,,,,,,,,,,,,,1987-12-01,F,,,,,64.11,NAP,N,,,0,,,,,,
326777489,00021,32677748900021,O,,,,,,true,1,,,,,,64570,ANCE,,,64020,,,,,,,,,,,,,,,,,,,1994-11-15,F,,,,,52.6D,NAF1993,N,,,0,,,,,,
326905189,00014,32690518900014,O,,NN,,,,true,1,,,,,,64570,ANCE,,,64020,,,,,,,,,,,,,,,,,,,1992-01-31,F,,,,,45.1A,NAF1993,N,,,0,,,,,,
342101177,00034,34210117700034,O,1998-10-01,NN,,,,true,1,,,,,MAISON BARBELABARCHE,64570,ANCE,,,64020,,,,,,,,,,,,,,,,,,,2002-06-30,F,,,,,45.4J,NAF1993,N,-0.705734,43.161021,0.33,street,Chemin de Labaig 64570 Ance Féas,64225_0240,G,CHEMIN DE LABAIG,
390922730,00010,39092273000010,O,1993-04-21,NN,,,,true,1,,,,,,64570,ANCE,,,64020,,,,,,,,,,,,,,,,,,,1999-01-01,F,,,,,74.1J,NAF1993,N,,,0,,,,,,
391242344,00011,39124234400011,O,1993-05-04,NN,,,,true,1,,,,,,64570,ANCE,,,64020,,,,,,,,,,,,,,,,,,,1998-12-31,F,,,,,70.2C,NAF1993,N,,,0,,,,,,
419176094,00011,41917609400011,O,1982-12-31,NN,,,,true,1,,,,,,64570,ANCE,,,64020,,,,,,,,,,,,,,,,,,,2001-10-27,F,,,,,01.1A,NAF1993,N,,,0,,,,,,
419176110,00015,41917611000015,O,1987-12-31,NN,,,,true,1,,,,,,64570,ANCE,,,64020,,,,,,,,,,,,,,,,,,,2001-09-20,F,,,,,01.1A,NAF1993,N,,,0,,,,,,
419176169,00011,41917616900011,O,1987-11-01,,,,,true,1,,,,,,64570,ANCE,,,64020,,,,,,,,,,,,,,,,,,,2000-10-30,F,,,,,01.1A,NAF1993,N,,,0,,,,,,
782231013,00015,78223101300015,O,,NN,,,,true,1,,,,,,64570,ANCE,,,64020,,,,,,,,,,,,,,,,,,,1995-07-31,F,,,,,45.2V,NAF1993,N,,,0,,,,,,
