siren,nic,siret,statutDiffusionEtablissement,dateCreationEtablissement,trancheEffectifsEtablissement,anneeEffectifsEtablissement,activitePrincipaleRegistreMetiersEtablissement,dateDernierTraitementEtablissement,etablissementSiege,nombrePeriodesEtablissement,complementAdresseEtablissement,numeroVoieEtablissement,indiceRepetitionEtablissement,typeVoieEtablissement,libelleVoieEtablissement,codePostalEtablissement,libelleCommuneEtablissement,libelleCommuneEtrangerEtablissement,distributionSpecialeEtablissement,codeCommuneEtablissement,codeCedexEtablissement,libelleCedexEtablissement,codePaysEtrangerEtablissement,libellePaysEtrangerEtablissement,complementAdresse2Etablissement,numeroVoie2Etablissement,indiceRepetition2Etablissement,typeVoie2Etablissement,libelleVoie2Etablissement,codePostal2Etablissement,libelleCommune2Etablissement,libelleCommuneEtranger2Etablissement,distributionSpeciale2Etablissement,codeCommune2Etablissement,codeCedex2Etablissement,libelleCedex2Etablissement,codePaysEtranger2Etablissement,libellePaysEtranger2Etablissement,dateDebut,etatAdministratifEtablissement,enseigne1Etablissement,enseigne2Etablissement,enseigne3Etablissement,denominationUsuelleEtablissement,activitePrincipaleEtablissement,nomenclatureActivitePrincipaleEtablissement,caractereEmployeurEtablissement,longitude,latitude,geo_score,geo_type,geo_adresse,geo_id,geo_ligne,geo_l4,geo_l5
039324959,00012,03932495900012,O,,,,,2019-11-14T14:00:58,true,1,,,,RUE,DU COULANT,77590,BOIS-LE-ROI,,,77037,,,,,,,,,,,,,,,,,,,1997-12-25,F,,,,,70.3C,NAF1993,N,2.673069,48.483009,0.96,street,Rue du Coulant 77590 Bois-le-Roi,77037_0210,G,RUE DU COULANT,
197700024,00015,19770002400015,O,1983-03-01,12,2020,,2022-08-29T09:04:42,true,4,,670,,ALL,DE BARBEAU,77590,BOIS-LE-ROI,,,77037,,,,,,,,,,,,,,,,,,,2015-12-27,A,,,,,85.31Z,NAFRev2,O,2.70286,48.477512,0.87,housenumber,670 Allée de Barbeau 77590 Bois-le-Roi,77037_0050_00670,G,670 ALLEE DE BARBEAU,
217700376,00015,21770037600015,O,1983-03-01,22,2020,,2022-08-29T09:08:56,true,4,,4,,AV,PAUL DOUMER,77590,BOIS-LE-ROI,,,77037,,,,,,,,,,,,,,,,,,,2008-01-01,A,MAIRIE,,,,84.11Z,NAFRev2,O,2.693678,48.47595,0.85,housenumber,4 Avenue Paul Doumer 77590 Bois-le-Roi,77037_0790_00004,G,4 AVENUE PAUL DOUMER,
217700376,00023,21770037600023,O,1983-12-21,11,2020,,2022-08-29T09:08:56,false,3,,10,,RUE,JULIEN COQUEMENT,77590,BOIS-LE-ROI,,,77037,,,,,,,,,,,,,,,,,,,2008-01-01,A,ECOLE MATERNELLE PUBLIQUE ROBERT LESOURD,,,,85.10Z,NAFRev2,N,2.701328,48.473066,0.96,housenumber,10 Rue Julien Coquement 77590 Bois-le-Roi,77037_0530_00010,G,10 RUE JULIEN COQUEMENT,
217700376,00031,21770037600031,O,1983-12-21,11,2020,,2022-08-29T09:08:56,false,3,,,,RUE,DE VERDUN,77590,BOIS-LE-ROI,,,77037,,,,,,,,,,,,,,,,,,,2008-01-01,A,ECOLE ELEMENTAIRE PUBLIQ OLIVIER METRA,,,,85.20Z,NAFRev2,N,2.700204,48.470929,0.95,street,Rue de Verdun 77590 Bois-le-Roi,77037_0965,G,RUE DE VERDUN,
217700376,00049,21770037600049,O,1995-06-26,03,2020,,2022-08-29T09:08:56,false,3,,,,RUE,DU CLOS DE LA CURE,77590,BOIS-LE-ROI,,,77037,,,,,,,,,,,,,,,,,,,2008-01-01,A,ECOLE ELEMENTAIRE PUBLIQUE DES VIARONS,,,,85.20Z,NAFRev2,N,2.697205,48.474319,0.96,street,Rue du Clos de la Cure 77590 Bois-le-Roi,77037_0170,G,RUE DU CLOS DE LA CURE,
217700376,00056,21770037600056,O,1996-12-25,NN,,,2019-11-14T14:00:58,false,3,,4,,AV,PAUL DOUMER,77590,BOIS-LE-ROI,,,77037,,,,,,,,,,,,,,,,,,,2017-12-31,F,SCE EAU DE BOIS LE ROI,,,,36.00Z,NAFRev2,N,2.693678,48.47595,0.85,housenumber,4 Avenue Paul Doumer 77590 Bois-le-Roi,77037_0790_00004,G,4 AVENUE PAUL DOUMER,
247700610,00055,24770061000055,O,2015-08-14,NN,,,2019-11-14T14:00:58,true,2,MAIRIE,4,,AV,PAUL DOUMER,77590,BOIS-LE-ROI,,,77037,,,,,,,,,,,,,,,,,,,2018-02-03,F,,,,,84.11Z,NAFRev2,O,2.693678,48.47595,0.85,housenumber,4 Avenue Paul Doumer 77590 Bois-le-Roi,77037_0790_00004,G,4 AVENUE PAUL DOUMER,
257701284,00016,25770128400016,O,1983-03-01,NN,,,2019-11-14T14:00:58,true,4,,4,,AV,PAUL DOUMER,77590,BOIS-LE-ROI,,,77037,,,,,,,,,,,,,,,,,,,2003-12-25,F,,,,,75.1C,NAFRev1,N,2.693678,48.47595,0.85,housenumber,4 Avenue Paul Doumer 77590 Bois-le-Roi,77037_0790_00004,G,4 AVENUE PAUL DOUMER,
257702084,00019,25770208400019,O,1983-03-01,NN,,,2019-11-14T14:00:58,true,3,MAIRIE,4,,AV,PAUL DOUMER,77590,BOIS-LE-ROI,,,77037,,,,,,,,,,,,,,,,,,,2004-02-16,F,,,,,75.1C,NAFRev1,N,2.693678,48.47595,0.85,housenumber,4 Avenue Paul Doumer 77590 Bois-le-Roi,77037_0790_00004,G,4 AVENUE PAUL DOUMER,
257702464,00021,25770246400021,O,1994-12-25,,,,2019-11-14T14:00:58,true,1,,4,,AV,PAUL DOUMER,77590,BOIS-LE-ROI,,,77037,,,,,,,,,,,,,,,,,,,1996-12-25,F,,,,,75.1E,NAF1993,N,2.693678,48.47595,0.85,housenumber,4 Avenue Paul Doumer 77590 Bois-le-Roi,77037_0790_00004,G,4 AVENUE PAUL DOUMER,
257702985,00017,25770298500017,O,1983-03-01,01,2020,,2022-08-29T09:10:11,true,3,MAIRIE,4,,AV,PAUL DOUMER,77590,BOIS-LE-ROI,,,77037,,,,,,,,,,,,,,,,,,,2008-01-01,A,,,,,93.11Z,NAFRev2,O,2.693678,48.47595,0.85,housenumber,4 Avenue Paul Doumer 77590 Bois-le-Roi,77037_0790_00004,G,4 AVENUE PAUL DOUMER,
257703082,00012,25770308200012,O,1983-03-01,NN,,,2019-11-14T14:00:58,true,3,MAIRIE,4,,AV,PAUL DOUMER,77590,BOIS-LE-ROI,,,77037,,,,,,,,,,,,,,,,,,,2006-06-02,F,,,,,75.1C,NAFRev1,N,2.693678,48.47595,0.85,housenumber,4 Avenue Paul Doumer 77590 Bois-le-Roi,77037_0790_00004,G,4 AVENUE PAUL DOUMER,
257703108,00015,25770310800015,O,1983-03-01,NN,,,2019-11-14T14:00:58,true,5,MAIRIE,4,A,AV,PAUL DOUMER,77590,BOIS-LE-ROI,,,77037,,,,,,,,,,,,,,,,,,,2013-09-23,F,,,,,36.00Z,NAFRev2,O,2.693779,48.476257,0.68,interpolation,4 Avenue Paul Doumer 77590 Bois-le-Roi,,G,2 AVENUE PAUL DOUMER,
267702132,00015,26770213200015,O,1983-03-01,01,2020,,2022-08-29T09:10:44,true,4,MAIRIE,4,,AV,PAUL DOUMER,77590,BOIS-LE-ROI,,,77037,,,,,,,,,,,,,,,,,,,2008-01-01,A,CCAS,,,,88.99B,NAFRev2,O,2.693678,48.47595,0.85,housenumber,4 Avenue Paul Doumer 77590 Bois-le-Roi,77037_0790_00004,G,4 AVENUE PAUL DOUMER,
267706331,00019,26770633100019,O,1983-03-01,NN,,,2019-11-14T14:00:58,true,3,MAIRIE,4,,AV,PAUL DOUMER,77590,BOIS-LE-ROI,,,77037,,,,,,,,,,,,,,,,,,,2003-02-05,F,CDE,,,,85.3K,NAFRev1,N,2.693678,48.47595,0.85,housenumber,4 Avenue Paul Doumer 77590 Bois-le-Roi,77037_0790_00004,G,4 AVENUE PAUL DOUMER,
300070166,00032,30007016600032,O,1900-01-01,NN,,,2019-11-14T14:00:58,false,5,,38,,AV,GALLIENI,77590,BOIS-LE-ROI,,BP 19,77037,,,,,,,,,,,,,,,,,,,2013-12-23,F,,,,,85.59A,NAFRev2,O,2.687791,48.476601,0.84,housenumber,38 Avenue Galliéni 77590 Bois-le-Roi,77037_0380_00038,G,38 AVENUE GALLIENI,
300070166,00065,30007016600065,O,2013-12-23,02,2020,,2022-08-29T09:11:00,true,1,,40,,AV,GALLIENI,77590,BOIS-LE-ROI,,,77037,,,,,,,,,,,,,,,,,,,2013-12-23,A,I.F.C,,,,85.59A,NAFRev2,O,2.687183,48.476697,0.84,housenumber,40 Avenue Galliéni 77590 Bois-le-Roi,77037_0380_00040,G,40 AVENUE GALLIENI,
300554367,00015,30055436700015,O,,NN,,,2019-11-14T14:00:58,true,1,,49,,RUE,COLINET,77590,BOIS-LE-ROI,,,77037,,,,,,,,,,,,,,,,,,,,F,,,,,55.60,NAP,N,2.696766,48.46627,0.96,housenumber,49 Rue Colinet 77590 Bois-le-Roi,77037_0190_00049,G,49 RUE COLINET,
300979473,00018,30097947300018,O,,,,,2019-11-14T14:00:58,true,1,,22,,CITE,DE LA MULATIERE,77590,BOIS-LE-ROI,,,77037,,,,,,,,,,,,,,,,,,,1985-12-25,F,,,,,77.09,NAP,N,2.69553,48.478424,0.77,housenumber,22 Clos de la Mulatière 77590 Bois-le-Roi,77037_0695_00022,G,22 CLOS DE LA MULATIERE,
300983962,00048,30098396200048,O,2001-05-02,NN,,,2019-11-14T14:00:58,true,4,,15,,RUE,DE LA REPUBLIQUE,77590,BOIS-LE-ROI,,,77037,,,,,,,,,,,,,,,,,,,2003-09-30,F,,,,,52.4F,NAFRev1,N,2.706621,48.467259,0.96,housenumber,15 Rue de la République 77590 Bois-le-Roi,77037_0860_00015,G,15 RUE DE LA REPUBLIQUE,
301162350,00039,30116235000039,O,1988-08-01,NN,,,2019-11-14T14:00:58,false,4,,6,,PL,DE LA REPUBLIQUE,77590,BOIS-LE-ROI,,,77037,,,,,,,,,,,,,,,,,,,1995-12-25,F,AGENCE DE BOIS LE ROI,,,,70.3A,NAF1993,O,2.707365,48.468769,0.87,housenumber,6 Place de la Republique 77590 Bois-le-Roi,77037_0850_00006,G,6 PLACE DE LA REPUBLIQUE,
301453593,00016,30145359300016,O,,,,,2019-11-14T14:00:58,true,1,,27,,AV,JOFFRE,77590,BOIS-LE-ROI,,,77037,,,,,,,,,,,,,,,,,,,1990-09-30,F,,,,,92.7A,NAF1993,N,2.710985,48.466412,0.8,housenumber,27 Avenue du Marechal Joffre 77590 Bois-le-Roi,77037_0520_00027,G,27 AVENUE DU MARECHAL JOFFRE,
301633798,00014,30163379800014,O,,,,,2019-11-14T14:00:58,true,1,,89,,AV,GALLIENI,77590,BOIS-LE-ROI,,,77037,,,,,,,,,,,,,,,,,,,1984-12-25,F,,,,,55.60,NAP,N,2.683603,48.47823,0.84,housenumber,89 Avenue Galliéni 77590 Bois-le-Roi,77037_0380_00089,G,89 AVENUE GALLIENI,
301687547,00010,30168754700010,O,,NN,,,2019-11-14T14:00:58,true,1,,11,,RUE,DE FRANCE,77590,BOIS-LE-ROI,,,77037,,,,,,,,,,,,,,,,,,,1990-11-27,F,,,,,77.14,NAP,N,2.705997,48.468746,0.96,housenumber,11 Rue de France 77590 Bois-le-Roi,77037_0360_00011,G,11 RUE DE FRANCE,
301708194,00016,30170819400016,O,,,,,2019-11-14T14:00:58,true,1,,60,,AV,FOCH,77590,BOIS-LE-ROI,,,77037,,,,,,,,,,,,,,,,,,,1984-12-25,F,,,,,55.71,NAP,N,2.703863,48.470621,0.79,housenumber,60 Avenue Foch 77590 Bois-le-Roi,77037_0320_00060,G,60 AVENUE FOCH,
301760815,00011,30176081500011,O,,,,,2019-11-14T14:00:58,true,1,,80,,AV,FOCH,77590,BOIS-LE-ROI,,,77037,,,,,,,,,,,,,,,,,,,1984-12-25,F,,,,,64.25,NAP,N,2.705504,48.469852,0.79,housenumber,80 Avenue Foch 77590 Bois-le-Roi,77037_0320_00080,G,80 AVENUE FOCH,
302025515,00024,30202551500024,O,,NN,,,2019-11-14T14:00:58,true,1,,96,,AV,FOCH,77590,BOIS-LE-ROI,,,77037,,,,,,,,,,,,,,,,,,,1990-05-21,F,,,,,86.06,NAP,N,2.706845,48.469224,0.79,housenumber,96 Avenue Foch 77590 Bois-le-Roi,77037_0320_00096,G,96 AVENUE FOCH,
302383039,00013,30238303900013,O,,,,,2019-11-14T14:00:58,true,1,,10,,RUE,GUIDO SIGRISTE,77590,BOIS-LE-ROI,,,77037,,,,,,,,,,,,,,,,,,,1984-12-25,F,,,,,55.60,NAP,N,2.702822,48.467125,0.96,housenumber,10 Rue Guido Sigriste 77590 Bois-le-Roi,77037_0440_00010,G,10 RUE GUIDO SIGRISTE,
302710405,00010,30271040500010,O,,,,,2019-11-14T14:00:58,true,1,,10,,RUE,GUIDO SIGRISTE,77590,BOIS-LE-ROI,,,77037,,,,,,,,,,,,,,,,,,,1984-12-25,F,,,,,00.10,NAP,N,2.702822,48.467125,0.96,housenumber,10 Rue Guido Sigriste 77590 Bois-le-Roi,77037_0440_00010,G,10 RUE GUIDO SIGRISTE,
303028997,00011,30302899700011,O,,NN,,,2019-11-14T14:00:58,true,1,,85,,AV,GALLIENI,77590,BOIS-LE-ROI,,,77037,,,,,,,,,,,,,,,,,,,,F,,,,,38.40,NAP,N,2.684248,48.478278,0.84,housenumber,85 Avenue Galliéni 77590 Bois-le-Roi,77037_0380_00085,G,85 AVENUE GALLIENI,
303029011,00010,30302901100010,O,1900-01-01,NN,,,2019-11-14T14:00:58,true,3,,5,,RUE,GUSTAVE MATHIEU,77590,BOIS-LE-ROI,,,77037,,,,,,,,,,,,,,,,,,,2008-01-01,A,,,,,68.20A,NAFRev2,N,2.694631,48.472992,0.96,housenumber,5 Rue Gustave Mathieu 77590 Bois-le-Roi,77037_0470_00005,G,5 RUE GUSTAVE MATHIEU,
303752752,00012,30375275200012,O,,,,,2019-11-14T14:00:58,true,1,,16,,AV,PAUL DOUMER,77590,BOIS-LE-ROI,,,77037,,,,,,,,,,,,,,,,,,,1984-12-25,F,,,,,,,N,2.694378,48.478284,0.85,housenumber,16 Avenue Paul Doumer 77590 Bois-le-Roi,77037_0790_00016,G,16 AVENUE PAUL DOUMER,
303876486,00026,30387648600026,O,,,,,2019-11-14T14:00:58,true,1,,43,,RUE,GUIDO SIGRISTE,77590,BOIS-LE-ROI,,,77037,,,,,,,,,,,,,,,,,,,1991-12-25,F,,,,,77.03,NAP,N,2.701156,48.465762,0.96,housenumber,43 Rue Guido Sigriste 77590 Bois-le-Roi,77037_0440_00043,G,43 RUE GUIDO SIGRISTE,
303938740,00022,30393874000022,O,,NN,,,2019-11-14T14:00:58,true,1,,4,B,RUE,CHANTEMERLE,77590,BOIS-LE-ROI,,,77037,,,,,,,,,,,,,,,,,,,1994-08-29,F,,,,,51.4J,NAF1993,O,2.689597,48.478846,0.86,housenumber,4bis Rue de Chantemerle 77590 Bois-le-Roi,77037_0115_00004_bis,G,4BIS RUE DE CHANTEMERLE,
304072473,00016,30407247300016,O,1959-01-01,NN,,,2019-11-14T14:00:58,true,3,,61,,AV,ALFRED ROLL,77590,BOIS-LE-ROI,,,77037,,,,,,,,,,,,,,,,,,,2008-01-01,A,,,,,56.30Z,NAFRev2,N,2.677587,48.481152,0.86,housenumber,61 Avenue Alfred Roll 77590 Bois-le-Roi,77037_0030_00061,G,61 AVENUE ALFRED ROLL,
304072861,00012,30407286100012,O,,,,,2019-11-14T14:00:58,true,1,,,,RUE,C SERMAIZE,77590,BOIS-LE-ROI,,,77037,,,,,,,,,,,,,,,,,,,1984-12-25,F,,,,,55.10,NAP,N,,,0,,,,,,
304075153,00029,30407515300029,O,,,,,2019-11-14T14:00:58,true,1,,29,,AV,ROLLAND,77590,BOIS-LE-ROI,,,77037,,,,,,,,,,,,,,,,,,,1984-12-25,F,,,,,86.06,NAP,N,,,0,,,,,,
304101348,00015,30410134800015,O,,NN,,,2019-11-14T14:00:58,true,1,,,,,,77590,BOIS-LE-ROI,,,77037,,,,,,,,,,,,,,,,,,,1988-12-25,F,,,,,38.40,NAP,N,,,0,,,,,,
304101389,00019,30410138900019,O,,,,,2019-11-14T14:00:58,true,1,,,,,,77590,BOIS-LE-ROI,,,77037,,,,,,,,,,,,,,,,,,,1988-02-16,F,,,,,85.03,NAP,N,,,0,,,,,,
304231509,00023,30423150900023,O,1900-01-01,,,,2019-11-14T14:00:58,false,6,,73,,RUE,DE LA REPUBLIQUE,77590,BOIS-LE-ROI,,,77037,,,,,,,,,,,,,,,,,,,2014-01-20,F,,,,,43.99C,NAFRev2,N,2.700524,48.462938,0.96,housenumber,73 Rue de la République 77590 Bois-le-Roi,77037_0860_00073,G,73 RUE DE LA REPUBLIQUE,
304231509,00031,30423150900031,O,2004-11-23,NN,,,2019-11-14T14:00:58,false,4,,18,,ALL,DE BARBEAU,77590,BOIS-LE-ROI,,,77037,,,,,,,,,,,,,,,,,,,2013-01-01,F,,,,,43.99C,NAFRev2,N,2.697732,48.478249,0.86,housenumber,18 Allée de Barbeau 77590 Bois-le-Roi,77037_0050_00018,G,18 ALLEE DE BARBEAU,
304231509,00056,30423150900056,O,2021-06-21,,,,2021-09-06T10:00:20,false,1,,1,B,RUE,GUSTAVE BAUDOIN,77590,BOIS-LE-ROI,,BP 9,77037,,,,,,,,,,,,,,,,,,,2021-06-21,A,,,,,01.49Z,NAFRev2,N,2.691453,48.471516,0.88,housenumber,1bis Rue Gustave Baudoin 77590 Bois-le-Roi,77037_0460_00001_bis,G,1BIS RUE GUSTAVE BAUDOIN,
304645211,00018,30464521100018,O,,NN,,,2019-11-14T14:00:58,true,1,,92,,AV,FOCH,77590,BOIS-LE-ROI,,,77037,,,,,,,,,,,,,,,,,,,,F,,,,,67.08,NAP,N,2.70651,48.469372,0.79,housenumber,92 Avenue Foch 77590 Bois-le-Roi,77037_0320_00092,G,92 AVENUE FOCH,
304962483,00026,30496248300026,O,,NN,,,2019-11-14T14:00:58,true,1,,15,,AV,GALLIENI,77590,BOIS-LE-ROI,,,77037,,,,,,,,,,,,,,,,,,,1993-08-27,F,,,,,70.2C,NAF1993,N,2.691069,48.474876,0.84,housenumber,15 Avenue Galliéni 77590 Bois-le-Roi,77037_0380_00015,G,15 AVENUE GALLIENI,
305175051,00013,30517505100013,O,,NN,,,2019-11-14T14:00:58,true,1,,1,,RUE,AUGUSTE FROT,77590,BOIS-LE-ROI,,,77037,,,,,,,,,,,,,,,,,,,1989-09-28,F,,,,,69.23,NAP,N,2.705737,48.479178,0.96,housenumber,1 Rue Auguste Frot 77590 Bois-le-Roi,77037_0040_00001,G,1 RUE AUGUSTE FROT,
305368540,00012,30536854000012,O,1976-01-01,NN,,,2019-11-14T14:00:58,true,1,,5,,PL,DE LA CITE,77590,BOIS-LE-ROI,,,77037,,,,,,,,,,,,,,,,,,,1996-10-27,F,,,,,70.2C,NAF1993,N,2.707783,48.468058,0.84,housenumber,5 Place de la Cite 77590 Bois-le-Roi,77037_0160_00005,G,5 PLACE DE LA CITE,
305636094,00016,30563609400016,O,,NN,,,2019-11-14T14:00:58,true,1,,60,,AV,FOCH,77590,BOIS-LE-ROI,,,77037,,,,,,,,,,,,,,,,,,,,F,,,,,55.71,NAP,N,2.703863,48.470621,0.79,housenumber,60 Avenue Foch 77590 Bois-le-Roi,77037_0320_00060,G,60 AVENUE FOCH,
305696361,00024,30569636100024,O,1900-01-01,NN,,,2019-11-14T14:00:58,true,5,,1,,RUE,CARNOT,77590,BOIS-LE-ROI,,,77037,,,,,,,,,,,,,,,,,,,2011-12-30,F,,,,,95.21Z,NAFRev2,O,2.707476,48.469422,0.97,housenumber,1 Rue Carnot 77590 Bois-le-Roi,77037_0100_00001,G,1 RUE CARNOT,
305716714,00012,30571671400012,O,,,,,2019-11-14T14:00:58,true,1,,,,ALL,BARBEAU,77590,BOIS-LE-ROI,,,77037,,,,,,,,,,,,,,,,,,,1984-12-25,F,,,,,55.71,NAP,N,2.700567,48.477796,0.8,street,Allée de Barbeau 77590 Bois-le-Roi,77037_0050,G,ALLEE DE BARBEAU,
305727406,00012,30572740600012,O,,,,,2019-11-14T14:00:58,true,1,,,,RUE,MICHELET,77590,BOIS-LE-ROI,,,77037,,,,,,,,,,,,,,,,,,,1985-12-25,F,,,,,55.60,NAP,N,2.676983,48.480144,0.96,street,Rue Michelet 77590 Bois-le-Roi,77037_0650,G,RUE MICHELET,
306664038,00016,30666403800016,O,,NN,,,2019-11-14T14:00:58,true,1,,13,,RUE,DES SESCOIS,77590,BOIS-LE-ROI,,,77037,,,,,,,,,,,,,,,,,,,,F,,,,,55.60,NAP,N,2.689617,48.4774,0.96,housenumber,13 Rue des Sescois 77590 Bois-le-Roi,77037_0900_00013,G,13 RUE DES SESCOIS,
306776469,00018,30677646900018,O,,,,,2019-11-14T14:00:58,true,1,,13,,RUE,DES SESCOIS,77590,BOIS-LE-ROI,,,77037,,,,,,,,,,,,,,,,,,,1985-12-25,F,,,,,00.10,NAP,N,2.689617,48.4774,0.96,housenumber,13 Rue des Sescois 77590 Bois-le-Roi,77037_0900_00013,G,13 RUE DES SESCOIS,
307574707,00013,30757470700013,O,,,,,2019-11-14T14:00:58,true,1,,33,,RUE,AUGUSTE FROT,77590,BOIS-LE-ROI,,,77037,,,,,,,,,,,,,,,,,,,1990-06-30,F,,,,,55.71,NAP,N,2.705052,48.4745,0.96,housenumber,33 Rue Auguste Frot 77590 Bois-le-Roi,77037_0040_00033,G,33 RUE AUGUSTE FROT,
307593186,00017,30759318600017,O,,NN,,,2019-11-14T14:00:58,true,1,,35,,AV,MAL JOFFRE,77590,BOIS-LE-ROI,,,77037,,,,,,,,,,,,,,,,,,,,F,,,,,51.20,NAP,N,2.709916,48.466664,0.41,street,Avenue du Marechal Joffre 77590 Bois-le-Roi,77037_0520,G,AVENUE DU MARECHAL JOFFRE,
307593491,00011,30759349100011,O,1976-01-01,NN,,,2019-11-14T14:00:58,false,5,,57,,AV,ALFRED ROLL,77590,BOIS-LE-ROI,,,77037,,,,,,,,,,,,,,,,,,,2018-06-04,F,,,,,46.69B,NAFRev2,N,2.678209,48.480968,0.86,housenumber,57 Avenue Alfred Roll 77590 Bois-le-Roi,77037_0030_00057,G,57 AVENUE ALFRED ROLL,
307593491,00029,30759349100029,O,2018-06-04,,,,2022-01-27T04:10:28,true,2,,28,,RUE,DU BUISSON CHEYDEAU,77590,BOIS-LE-ROI,,,77037,,,,,,,,,,,,,,,,,,,2021-07-31,F,,,,,68.20B,NAFRev2,N,2.677653,48.480294,0.96,housenumber,28 Rue du Buisson Cheydeau 77590 Bois-le-Roi,77037_0090_00028,G,28 RUE DU BUISSON CHEYDEAU,
307981472,00011,30798147200011,O,,NN,,,2019-11-14T14:00:58,true,1,,50,,,Q OLIVIER METRA,77590,BOIS-LE-ROI,,,77037,,,,,,,,,,,,,,,,,,,1990-12-25,F,,,,,79.01,NAP,N,2.704391,48.480835,0.86,housenumber,50 Quai Olivier Metra 77590 Bois-le-Roi,77037_0710_00050,G,50 QUAI OLIVIER METRA,
308254895,00011,30825489500011,O,,,,,2019-11-14T14:00:58,true,1,,55,,RUE,MOREAU DE TOURS,77590,BOIS-LE-ROI,,,77037,,,,,,,,,,,,,,,,,,,1984-12-25,F,,,,,51.20,NAP,N,2.697644,48.46673,0.96,housenumber,55 Rue Moreau de Tours 77590 Bois-le-Roi,77037_0670_00055,G,55 RUE MOREAU DE TOURS,
308319490,00022,30831949000022,O,,NN,,,2019-11-14T14:00:58,true,1,,8,B,PL,DE LA REPUBLIQUE,77590,BOIS-LE-ROI,,,77037,,,,,,,,,,,,,,,,,,,,F,,,,,64.22,NAP,N,2.706537,48.468469,0.8,housenumber,8bis Place de la Republique 77590 Bois-le-Roi,77037_0850_00008_bis,G,8BIS PLACE DE LA REPUBLIQUE,
308517507,00031,30851750700031,O,1983-12-30,NN,,,2019-11-14T14:00:58,true,4,,29,,RUE,DE LA PRESCHE,77590,BOIS-LE-ROI,,,77037,,,,,,,,,,,,,,,,,,,2013-02-01,F,,,,,49.32Z,NAFRev2,N,2.701727,48.464744,0.96,housenumber,29 Rue de la Presche 77590 Bois-le-Roi,77037_0840_00029,G,29 RUE DE LA PRESCHE,
308635366,00021,30863536600021,O,,,,,2019-11-14T14:00:58,true,1,,8,,RUE,POUPART,77590,BOIS-LE-ROI,,,77037,,,,,,,,,,,,,,,,,,,1984-12-25,F,,,,,18.07,NAP,N,2.702491,48.48051,0.94,housenumber,8 Rue Poupart d’Avyl 77590 Bois-le-Roi,77037_0820_00008,G,8 RUE POUPART D AVYL,
308733096,00033,30873309600033,O,,NN,,,2019-11-14T14:00:58,true,1,,46,,AV,GALLIENI,77590,BOIS-LE-ROI,,,77037,,,,,,,,,,,,,,,,,,,1997-08-14,F,,,,,79.06,NAP,N,2.685871,48.477065,0.84,housenumber,46 Avenue Galliéni 77590 Bois-le-Roi,77037_0380_00046,G,46 AVENUE GALLIENI,
309065910,00106,30906591000106,O,1997-01-01,NN,,,2019-11-14T14:00:58,false,4,,1,,RUE,DE LA REPUBLIQUE,77590,BOIS-LE-ROI,,,77037,,,,,,,,,,,,,,,,,,,2002-12-25,F,,,,,45.2E,NAF1993,N,2.707338,48.467851,0.96,housenumber,1 Rue de la République 77590 Bois-le-Roi,77037_0860_00001,G,1 RUE DE LA REPUBLIQUE,
309181485,00025,30918148500025,O,,NN,,,2019-11-14T14:00:58,true,1,,5,,,Q DE LA RUELLE,77590,BOIS-LE-ROI,,,77037,,,,,,,,,,,,,,,,,,,1992-12-25,F,,,,,55.1A,NAF1993,N,2.692061,48.480848,0.85,housenumber,5 Quai de la Ruelle 77590 Bois-le-Roi,77037_0870_00005,G,5 QUAI DE LA RUELLE,
309300226,00037,30930022600037,O,2003-07-01,NN,,,2019-11-14T14:00:58,true,3,,10,,AV,PAUL DOUMER,77590,BOIS-LE-ROI,,,77037,,,,,,,,,,,,,,,,,,,2004-05-01,F,,,,,45.3E,NAFRev1,N,2.694218,48.477624,0.85,housenumber,10 Avenue Paul Doumer 77590 Bois-le-Roi,77037_0790_00010,G,10 AVENUE PAUL DOUMER,
309454163,00010,30945416300010,O,1900-01-01,NN,,,2019-11-14T14:00:58,true,5,,21,,RUE,AIME PERRET,77590,BOIS-LE-ROI,,,77037,,,,,,,,,,,,,,,,,,,2010-04-30,F,,,,,43.91B,NAFRev2,O,2.69854,48.468809,0.96,housenumber,21 Rue Aimé Perret 77590 Bois-le-Roi,77037_0010_00021,G,21 RUE AIME PERRET,
309564631,00013,30956463100013,O,,NN,,,2019-11-14T14:00:58,true,1,,21,,ALL,DE BARBEAU,77590,BOIS-LE-ROI,,,77037,,,,,,,,,,,,,,,,,,,1989-09-06,F,,,,,82.06,NAP,N,2.694595,48.478315,0.86,housenumber,21 Allée de Barbeau 77590 Bois-le-Roi,77037_0050_00021,G,21 ALLEE DE BARBEAU,
309633352,00013,30963335200013,O,,NN,,,2019-11-14T14:00:58,true,1,,1,,AV,GALLIENI,77590,BOIS-LE-ROI,,,77037,,,,,,,,,,,,,,,,,,,1988-12-31,F,,,,,79.06,NAP,N,2.692799,48.47435,0.83,housenumber,1 Avenue Galliéni 77590 Bois-le-Roi,77037_0380_00001,G,1 AVENUE GALLIENI,
310054978,00013,31005497800013,O,,,,,2019-11-14T14:00:58,true,1,,39,,RUE,CARNOT,77590,BOIS-LE-ROI,,,77037,,,,,,,,,,,,,,,,,,,1984-12-25,F,,,,,64.49,NAP,N,2.70819,48.47135,0.97,housenumber,39 Rue Carnot 77590 Bois-le-Roi,77037_0100_00039,G,39 RUE CARNOT,
310065321,00054,31006532100054,O,2012-07-01,,,,2019-11-14T14:00:58,true,2,,6,,RUE,DENECOURT,77590,BOIS-LE-ROI,,,77037,,,,,,,,,,,,,,,,,,,2017-07-01,F,,,,,85.51Z,NAFRev2,N,2.697357,48.466098,0.96,housenumber,6 Rue Denecourt 77590 Bois-le-Roi,77037_0270_00006,G,6 RUE DENECOURT,
310354618,00038,31035461800038,O,1981-01-01,,,,2019-11-14T14:00:58,true,3,,16,,AV,PAUL DOUMER,77590,BOIS-LE-ROI,,,77037,,,,,,,,,,,,,,,,,,,1991-12-25,F,,,,,47.02,NAP,N,2.694378,48.478284,0.85,housenumber,16 Avenue Paul Doumer 77590 Bois-le-Roi,77037_0790_00016,G,16 AVENUE PAUL DOUMER,
310549217,00035,31054921700035,O,2011-03-15,,,,2019-11-14T14:00:58,true,2,,51,,AV,ALFRED ROLL,77590,BOIS-LE-ROI,,,77037,,,,,,,,,,,,,,,,,,,2013-12-31,F,,,,,46.19B,NAFRev2,N,2.678722,48.480764,0.86,housenumber,51 Avenue Alfred Roll 77590 Bois-le-Roi,77037_0030_00051,G,51 AVENUE ALFRED ROLL,
310706817,00015,31070681700015,O,1900-01-01,NN,,,2019-11-14T14:00:58,true,3,,2,,AV,PAUL DOUMER,77590,BOIS-LE-ROI,,,77037,,,,,,,,,,,,,,,,,,,2008-01-01,A,,,,,68.20B,NAFRev2,N,2.693496,48.475306,0.85,housenumber,2 Avenue Paul Doumer 77590 Bois-le-Roi,77037_0790_00002,G,2 AVENUE PAUL DOUMER,
310962642,00016,31096264200016,O,1977-01-01,NN,,,2019-11-14T14:00:58,true,6,,45,,RUE,DE LA REPUBLIQUE,77590,BOIS-LE-ROI,,,77037,,,,,,,,,,,,,,,,,,,2010-12-16,F,,,,,90.01Z,NAFRev2,N,2.703782,48.465227,0.96,housenumber,45 Rue de la République 77590 Bois-le-Roi,77037_0860_00045,G,45 RUE DE LA REPUBLIQUE,
311016729,00023,31101672900023,O,,NN,,,2019-11-14T14:00:58,true,1,,59,,RUE,CARNOT,77590,BOIS-LE-ROI,,,77037,,,,,,,,,,,,,,,,,,,1993-11-02,F,,,,,93.0B,NAF1993,N,2.708093,48.473755,0.97,housenumber,59 Rue Carnot 77590 Bois-le-Roi,77037_0100_00059,G,59 RUE CARNOT,
312317589,00025,31231758900025,O,,NN,,,2019-11-14T14:00:58,true,1,,61,,RUE,ALFRED ROLL,77590,BOIS-LE-ROI,,,77037,,,,,,,,,,,,,,,,,,,1988-12-25,F,,,,,55.10,NAP,N,2.677587,48.481152,0.82,housenumber,61 Avenue Alfred Roll 77590 Bois-le-Roi,77037_0030_00061,G,61 AVENUE ALFRED ROLL,
312423858,00017,31242385800017,O,,NN,,,2019-11-14T14:00:58,true,1,,66,,RUE,CARNOT,77590,BOIS-LE-ROI,,,77037,,,,,,,,,,,,,,,,,,,1988-12-25,F,,,,,81.21,NAP,N,2.708683,48.475446,0.97,housenumber,66 Rue Carnot 77590 Bois-le-Roi,77037_0100_00066,G,66 RUE CARNOT,
312423866,00010,31242386600010,O,1978-01-01,NN,,,2019-11-14T14:00:58,true,4,,27,,RUE,DU CORMIER,77590,BOIS-LE-ROI,,,77037,,,,,,,,,,,,,,,,,,,2003-12-31,F,,,,,45.2R,NAFRev1,O,2.710948,48.469772,0.96,housenumber,27 Rue du Cormier 77590 Bois-le-Roi,77037_0200_00027,G,27 RUE DU CORMIER,
312599053,00013,31259905300013,O,,NN,,,2019-11-14T14:00:58,true,1,,18,,RUE,JULIEN COQUEMENT,77590,BOIS-LE-ROI,,,77037,,,,,,,,,,,,,,,,,,,1987-06-05,F,,,,,60.03,NAP,N,2.70055,48.473568,0.96,housenumber,18 Rue Julien Coquement 77590 Bois-le-Roi,77037_0530_00018,G,18 RUE JULIEN COQUEMENT,
312599202,00016,31259920200016,O,,,,,2019-11-14T14:00:58,true,1,,,,CHE,DES GRES,77590,BOIS-LE-ROI,,,77037,,,,,,,,,,,,,,,,,,,1984-12-25,F,,,,,00.10,NAP,N,2.707231,48.476215,0.72,street,Rue des Gres 77590 Bois-le-Roi,77037_0420,G,RUE DES GRES,
312599335,00014,31259933500014,O,,NN,,,2019-11-14T14:00:58,true,1,,,,CHE,DES GRES,77590,BOIS-LE-ROI,,,77037,,,,,,,,,,,,,,,,,,,1988-04-30,F,,,,,55.71,NAP,N,2.707231,48.476215,0.72,street,Rue des Gres 77590 Bois-le-Roi,77037_0420,G,RUE DES GRES,