siren,nic,siret,statutDiffusionEtablissement,dateCreationEtablissement,trancheEffectifsEtablissement,anneeEffectifsEtablissement,activitePrincipaleRegistreMetiersEtablissement,dateDernierTraitementEtablissement,etablissementSiege,nombrePeriodesEtablissement,complementAdresseEtablissement,numeroVoieEtablissement,indiceRepetitionEtablissement,typeVoieEtablissement,libelleVoieEtablissement,codePostalEtablissement,libelleCommuneEtablissement,libelleCommuneEtrangerEtablissement,distributionSpecialeEtablissement,codeCommuneEtablissement,codeCedexEtablissement,libelleCedexEtablissement,codePaysEtrangerEtablissement,libellePaysEtrangerEtablissement,complementAdresse2Etablissement,numeroVoie2Etablissement,indiceRepetition2Etablissement,typeVoie2Etablissement,libelleVoie2Etablissement,codePostal2Etablissement,libelleCommune2Etablissement,libelleCommuneEtranger2Etablissement,distributionSpeciale2Etablissement,codeCommune2Etablissement,codeCedex2Etablissement,libelleCedex2Etablissement,codePaysEtranger2Etablissement,libellePaysEtranger2Etablissement,dateDebut,etatAdministratifEtablissement,enseigne1Etablissement,enseigne2Etablissement,enseigne3Etablissement,denominationUsuelleEtablissement,activitePrincipaleEtablissement,nomenclatureActivitePrincipaleEtablissement,caractereEmployeurEtablissement,longitude,latitude,geo_score,geo_type,geo_adresse,geo_id,geo_ligne,geo_l4,geo_l5
218801785,00013,21880178500013,O,1983-03-01,12,2020,,2022-08-29T09:09:22,true,4,,10,,RUE,DE LA MAIRIE,88390,LES FORGES,,,88178,,,,,,,,,,,,,,,,,,,2008-01-01,A,MAIRIE,,,,84.11Z,NAFRev2,O,6.388145,48.178465,0.95,housenumber,10 Rue de la Mairie 88390 Les Forges,88178_0033_00010,G,10 RUE DE LA MAIRIE,
218801785,00021,21880178500021,O,1983-12-21,03,2020,,2022-08-29T09:09:22,false,3,,8,,RUE,DE LA MAIRIE,88390,LES FORGES,,,88178,,,,,,,,,,,,,,,,,,,2008-01-01,A,ECOLE PRIMAIRE PUBLIQUE,,,,85.20Z,NAFRev2,N,6.388145,48.178465,0.95,housenumber,8 Rue de la Mairie 88390 Les Forges,88178_0033_00008,G,8 RUE DE LA MAIRIE,
218801785,00047,21880178500047,O,1983-12-21,11,2019,,2021-10-27T08:11:10,false,3,,8,,RUE,DE LA MAIRIE,88390,LES FORGES,,,88178,,,,,,,,,,,,,,,,,,,2008-01-01,A,ECOLE MATERNELLE PUBLIQUE,,,,85.10Z,NAFRev2,N,6.388145,48.178465,0.95,housenumber,8 Rue de la Mairie 88390 Les Forges,88178_0033_00008,G,8 RUE DE LA MAIRIE,
218801785,00062,21880178500062,O,1995-12-25,NN,,,2019-01-18T16:56:47,false,3,,10,,RUE,DE LA MAIRIE,88390,LES FORGES,,,88178,,,,,,,,,,,,,,,,,,,2018-12-31,F,SCE ASSAINISSEMENT,,,,37.00Z,NAFRev2,N,6.388145,48.178465,0.95,housenumber,10 Rue de la Mairie 88390 Les Forges,88178_0033_00010,G,10 RUE DE LA MAIRIE,
248800534,00013,24880053400013,O,1997-12-31,NN,,,2007-05-19T08:22:56,false,3,MAIRIE,10,,RUE,DE LA MAIRIE,88390,LES FORGES,,,88178,,,,,,,,,,,,,,,,,,,2006-09-07,F,,,,,75.1A,NAFRev1,O,6.388145,48.178465,0.95,housenumber,10 Rue de la Mairie 88390 Les Forges,88178_0033_00010,G,10 RUE DE LA MAIRIE,
248800534,00021,24880053400021,O,1999-06-10,NN,,,2006-11-25T09:08:53,false,4,,10,,RUE,DE LA MAIRIE,88390,LES FORGES,,,88178,,,,,,,,,,,,,,,,,,,2001-12-25,F,ZONE ARTISANALE,,,,70.1C,NAF1993,N,6.388145,48.178465,0.95,housenumber,10 Rue de la Mairie 88390 Les Forges,88178_0033_00010,G,10 RUE DE LA MAIRIE,
248800534,00039,24880053400039,O,2006-09-07,NN,,,2014-06-13T23:42:03,true,3,,4,,ALL,DU VAL D'AVIERE,88390,LES FORGES,,,88178,,,,,,,,,,,,,,,,,,,2013-01-01,F,,,,,84.11Z,NAFRev2,O,6.385808,48.182735,0.9,housenumber,4 Allée du Val d’Aviére 88390 Les Forges,88178_0098_00004,G,4 ALLEE DU VAL D AVIERE,
258800168,00027,25880016800027,O,1989-06-08,NN,,,2006-10-26T23:44:38,true,4,MAIRIE,,,,,88390,LES FORGES,,,88178,,,,,,,,,,,,,,,,,,,2004-12-31,F,,,,,92.6A,NAFRev1,O,6.387786,48.178473,0.92,street,Rue de la Mairie 88390 Les Forges,88178_0033,D,RUE DE LA MAIRIE,
258800754,00024,25880075400024,O,2010-12-23,02,2019,,2021-10-27T08:12:32,true,2,,1,,ALL,DU VAL D'AVIERE,88390,LES FORGES,,,88178,,,,,,,,,,,,,,,,,,,2020-01-16,F,,,,,36.00Z,NAFRev2,O,6.385798,48.181805,0.9,housenumber,1 Allée du Val d’Aviére 88390 Les Forges,88178_0098_00001,G,1 ALLEE DU VAL D AVIERE,
258801422,00118,25880142200118,O,1999-03-03,,,,2022-07-08T09:40:34,false,1,,,,ALL,DU VAL D'AVIERES,88390,LES FORGES,,,88178,,,,,,,,,,,,,,,,,,,1999-03-03,A,DECHETERIE DE LES FORGES,,,,38.11Z,NAFRev2,N,6.385808,48.182735,0.85,street,Allée du Val d’Aviére 88390 Les Forges,88178_0098,G,ALLEE DU VAL D AVIERE,
268800117,00015,26880011700015,O,1983-03-01,NN,,,2008-01-04T19:04:38,true,3,,,,RUE,DE LA MAIRIE,88390,LES FORGES,,,88178,,,,,,,,,,,,,,,,,,,2008-01-01,A,CCAS,,,,88.99B,NAFRev2,N,6.387786,48.178473,0.95,street,Rue de la Mairie 88390 Les Forges,88178_0033,G,RUE DE LA MAIRIE,
278800263,00016,27880026300016,O,,,,,,true,1,,,,,,88390,LES FORGES,,,88178,,,,,,,,,,,,,,,,,,,1995-12-25,F,,,,,90.0A,NAF1993,N,,,0,,,,,,
300153368,00125,30015336800125,O,2011-07-01,02,2020,,2022-08-29T09:11:01,false,1,,,,LD,PRE DU PUITS,88390,LES FORGES,,,88178,,,,,,,,,,,,,,,,,,,2011-07-01,A,,,,,46.49Z,NAFRev2,O,6.387124,48.181269,0.94,street,Rue du Pré du Puits 88390 Les Forges,88178_0078,G,RUE DU PRE DU PUITS,
301417028,00018,30141702800018,O,,NN,,,,true,1,,1,,RUE,SAUVEUX,88390,LES FORGES,,,88178,,,,,,,,,,,,,,,,,,,1989-12-31,F,,,,,13.10,NAP,N,6.388724,48.176407,0.88,housenumber,1 Rue du Sauveux 88390 Les Forges,88178_0085_00001,G,1 RUE DU SAUVEUX,
301417689,00017,30141768900017,O,1979-01-01,NN,,,,true,1,,32,,RTE,DE DARNEY,88390,LES FORGES,,,88178,,,,,,,,,,,,,,,,,,,1999-01-31,F,,,,,60.2E,NAF1993,N,6.383354,48.171335,0.84,housenumber,32 Route de Darney 88390 Les Forges,88178_0021_00032,G,32 ROUTE DE DARNEY,
302449368,00034,30244936800034,O,1994-05-01,NN,,,2008-11-07T00:18:30,true,3,,13,,RUE,PRE DU PUITS,88390,LES FORGES,,,88178,,,,,,,,,,,,,,,,,,,2004-07-30,F,,,,,45.4F,NAFRev1,N,6.387124,48.181269,0.76,street,Rue du Pré du Puits 88390 Les Forges,88178_0078,G,RUE DU PRE DU PUITS,
302605837,00020,30260583700020,O,1983-10-01,NN,,,2006-10-26T23:57:56,true,3,,7,,RUE,DU SAUVEUX,88390,LES FORGES,,,88178,,,,,,,,,,,,,,,,,,,2004-12-31,F,,,,,02.0B,NAFRev1,N,6.38749,48.174717,0.95,housenumber,7 Rue du Sauveux 88390 Les Forges,88178_0085_00007,G,7 RUE DU SAUVEUX,
302607197,00027,30260719700027,O,1983-10-01,NN,,,2006-10-26T23:57:56,true,3,,7,,RUE,DU SAUVEUX,88390,LES FORGES,,,88178,,,,,,,,,,,,,,,,,,,2004-12-31,F,,,,,02.0B,NAFRev1,N,6.38749,48.174717,0.95,housenumber,7 Rue du Sauveux 88390 Les Forges,88178_0085_00007,G,7 RUE DU SAUVEUX,
302713284,00016,30271328400016,O,,,,,,true,1,,9,,RUE,DU SAUVEUX,88390,LES FORGES,,,88178,,,,,,,,,,,,,,,,,,,1984-12-25,F,,,,,02.20,NAP,N,6.387998,48.173968,0.95,housenumber,9 Rue du Sauveux 88390 Les Forges,88178_0085_00009,G,9 RUE DU SAUVEUX,
303967020,00031,30396702000031,O,2001-10-04,NN,,,2008-11-07T00:19:38,true,4,,3,,RUE,GENERAL LECLERC,88390,LES FORGES,,,88178,,,,,,,,,,,,,,,,,,,2008-07-31,F,,,,,43.22B,NAFRev2,N,6.390946,48.172581,0.91,housenumber,3 Rue du General Leclerc 88390 Les Forges,88178_0027_00003,G,3 RUE DU GENERAL LECLERC,
305298812,00010,30529881200010,O,,NN,,,,true,1,,3,,RUE,DU SOLEIL LEVANT,88390,LES FORGES,,,88178,,,,,,,,,,,,,,,,,,,1987-12-31,F,,,,,55.73,NAP,N,6.401738,48.177242,0.96,housenumber,3 Rue du Soleil Levant 88390 Les Forges,88178_0090_00003,G,3 RUE DU SOLEIL LEVANT,
305541427,00012,30554142700012,O,,,,,,true,1,,,,,,88390,LES FORGES,,,88178,,,,,,,,,,,,,,,,,,,1985-12-25,F,,,,,81.21,NAP,N,,,0,,,,,,
305942096,00010,30594209600010,O,,NN,,,,true,1,,,,,,88390,LES FORGES,,,88178,,,,,,,,,,,,,,,,,,,,F,,,,,86.06,NAP,N,,,0,,,,,,
306041062,00010,30604106200010,O,,,,,,true,1,,,,LD,LA BOURIEURE,88390,LES FORGES,,,88178,,,,,,,,,,,,,,,,,,,1987-07-26,F,,,,,65.06,NAP,N,,,0,,,,,,
306043597,00013,30604359700013,O,,NN,,,,true,1,,,,,,88390,LES FORGES,,,88178,,,,,,,,,,,,,,,,,,,1987-12-31,F,,,,,64.49,NAP,N,,,0,,,,,,
306155284,00020,30615528400020,O,,,,,,true,1,,3,,RUE,DU POT A L OISEAU,88390,LES FORGES,,,88178,,,,,,,,,,,,,,,,,,,1985-12-25,F,,,,,64.43,NAP,N,6.398432,48.174643,0.95,housenumber,3 Rue du Pot à l’Oiseau 88390 Les Forges,88178_0075_00003,G,3 RUE DU POT A L OISEAU,
306242454,00016,30624245400016,O,,,,,,true,1,,,,,,88390,LES FORGES,,,88178,,,,,,,,,,,,,,,,,,,1984-12-25,F,,,,,65.06,NAP,N,,,0,,,,,,
306257650,00011,30625765000011,O,1976-01-01,NN,,,,true,1,,5,,RUE,DES EPINETTES,88390,LES FORGES,,,88178,,,,,,,,,,,,,,,,,,,2002-10-30,F,,,,,45.3F,NAF1993,O,6.394166,48.177169,0.95,housenumber,5 Rue des Epinettes 88390 Les Forges,88178_0022_00005,G,5 RUE DES EPINETTES,
306288614,00010,30628861400010,O,1974-01-01,,,,,true,1,,38,,RUE,DES CHASSEURS,88390,LES FORGES,,,88178,,,,,,,,,,,,,,,,,,,2001-12-31,F,,,,,01.4B,NAF1993,N,6.399293,48.17155,0.96,housenumber,38 Rue des Chasseurs 88390 Les Forges,88178_0008_00038,G,38 RUE DES CHASSEURS,
306441759,00025,30644175900025,O,,NN,,,,true,1,,15,,RTE,DE SANCHEY,88390,LES FORGES,,,88178,,,,,,,,,,,,,,,,,,,1999-12-31,F,,,,,37.2Z,NAF1993,N,6.378598,48.176199,0.85,housenumber,15 Route de Sanchey 88390 Les Forges,88178_0080_00015,G,15 ROUTE DE SANCHEY,
306541848,00025,30654184800025,O,,NN,,,,true,1,,4,,RTE,DE RENAUVOID,88390,LES FORGES,,,88178,,,,,,,,,,,,,,,,,,,1990-09-30,F,,,,,15.03,NAP,N,6.380221,48.170548,0.86,housenumber,4 Route de Renauvoid 88390 Les Forges,88178_0077_00004,G,4 ROUTE DE RENAUVOID,
306542564,00019,30654256400019,O,,,,,2006-08-22T15:19:00,true,1,,19,,RTE,DE DARNEY,88390,LES FORGES,,,88178,,,,,,,,,,,,,,,,,,,1984-12-25,F,,,,,67.01,NAP,N,6.389937,48.172844,0.84,housenumber,19 Route de Darney 88390 Les Forges,88178_0021_00019,G,19 ROUTE DE DARNEY,
306840943,00014,30684094300014,O,,,,,,true,1,,,,,,88390,LES FORGES,,,88178,,,,,,,,,,,,,,,,,,,1984-12-25,F,,,,,21.09,NAP,N,,,0,,,,,,
306842188,00030,30684218800030,O,1988-10-08,NN,,,,true,4,,14,,RUE,DES MELEZES,88390,LES FORGES,,,88178,,,,,,,,,,,,,,,,,,,2003-12-31,F,,,,,52.6D,NAFRev1,N,6.401125,48.175503,0.96,housenumber,14 Rue des Mélèzes 88390 Les Forges,88178_0035_00014,G,14 RUE DES MELEZES,
306842337,00017,30684233700017,O,1968-01-01,NN,,,,true,1,,10,,RUE,DES MELEZES,88390,LES FORGES,,,88178,,,,,,,,,,,,,,,,,,,2002-07-31,F,,,,,52.6E,NAF1993,N,6.398909,48.175385,0.96,housenumber,10 Rue des Mélèzes 88390 Les Forges,88178_0035_00010,G,10 RUE DES MELEZES,
306883554,00017,30688355400017,O,,,,,,true,1,,,,,,88390,LES FORGES,,,88178,,,,,,,,,,,,,,,,,,,1984-12-25,F,,,,,55.73,NAP,N,,,0,,,,,,
307343111,00018,30734311100018,O,1900-01-01,NN,,,2008-11-07T00:22:49,false,4,,28,,RTE,,88390,LES FORGES,,,88178,,,,,,,,,,,,,,,,,,,1994-12-25,F,,,,,15.8C,NAF1993,O,,,0,,,,,,
307343111,00026,30734311100026,O,1996-08-01,NN,,,2008-01-04T19:46:28,true,3,,8,,RUE,DU SAUVEUR,88390,LES FORGES,,,88178,,,,,,,,,,,,,,,,,,,2008-01-01,A,,,,,68.20B,NAFRev2,N,6.387532,48.175293,0.85,housenumber,8 Rue du Sauveux 88390 Les Forges,88178_0085_00008,G,8 RUE DU SAUVEUX,
309111565,00029,30911156500029,O,1989-10-31,NN,,,,false,4,,8,,RUE,DU 8 MAI,88390,LES FORGES,,,88178,,,,,,,,,,,,,,,,,,,1996-12-31,F,,,,,15.8C,NAF1993,O,6.390948,48.176007,0.95,interpolation,8 Rue du 8 Mai 88390 Les Forges,,G,6 RUE DU 8 MAI,
309143980,00022,30914398000022,O,1983-10-01,NN,,,2006-10-27T00:21:00,true,3,,7,,RUE,DU SAUVEUX,88390,LES FORGES,,,88178,,,,,,,,,,,,,,,,,,,2004-12-31,F,,,,,02.0B,NAFRev1,N,6.38749,48.174717,0.95,housenumber,7 Rue du Sauveux 88390 Les Forges,88178_0085_00007,G,7 RUE DU SAUVEUX,
309224962,00014,30922496200014,O,,NN,,,2006-10-27T00:21:18,true,1,,48,,RTE,DE MIRECOURT,88390,LES FORGES,,,88178,,,,,,,,,,,,,,,,,,,2004-12-08,F,,,,,65.06,NAP,N,6.384149,48.180278,0.87,housenumber,48 Route de Mirecourt 88390 Les Forges,88178_0040_00048,G,48 ROUTE DE MIRECOURT,
309401735,00027,30940173500027,O,,,,,,true,1,,2,,RUE,DES MELEZES,88390,LES FORGES,,,88178,,,,,,,,,,,,,,,,,,,1990-08-12,F,,,,,55.3A,NAF1993,N,6.397283,48.175424,0.96,housenumber,2 Rue des Mélèzes 88390 Les Forges,88178_0035_00002,G,2 RUE DES MELEZES,
309765923,00029,30976592300029,O,1993-02-01,NN,,,2008-11-07T00:24:38,true,3,,3,,ALL,DES HETRES,88390,LES FORGES,,,88178,,,,,,,,,,,,,,,,,,,2003-12-25,F,,,,,45.2V,NAFRev1,O,6.407789,48.175206,0.84,housenumber,3 Allée des Hêtres 88390 Les Forges,88178_0031_00003,G,3 ALLEE DES HETRES,
309766145,00010,30976614500010,O,,,,,,true,1,,12,,,LOTISSEMENT DUPOT A L'OISE,88390,LES FORGES,,,88178,,,,,,,,,,,,,,,,,,,1985-12-25,F,,,,,55.72,NAP,N,6.399486,48.174759,0.42,housenumber,12 Rue du Pot à l’Oiseau 88390 Les Forges,88178_0075_00012,G,12 RUE DU POT A L OISEAU,
309975563,00011,30997556300011,O,,,,,,true,1,,26,,RTE,DE MIRECOURT,88390,LES FORGES,,,88178,,,,,,,,,,,,,,,,,,,1984-12-25,F,,,,,67.08,NAP,N,6.387118,48.178217,0.87,housenumber,26 Route de Mirecourt 88390 Les Forges,88178_0040_00026,G,26 ROUTE DE MIRECOURT,
311240550,00013,31124055000013,O,1977-01-01,NN,,,2019-06-24T13:17:25,true,8,,38,,RUE,DES MELEZES,88390,LES FORGES,,,88178,,,,,,,,,,,,,,,,,,,2017-01-08,A,,,,,47.89Z,NAFRev2,O,6.409226,48.175899,0.96,housenumber,38 Rue des Mélèzes 88390 Les Forges,88178_0035_00038,G,38 RUE DES MELEZES,
311312086,00011,31131208600011,O,,,,,,true,1,,77,,RUE,DES MELEZES,88390,LES FORGES,,,88178,,,,,,,,,,,,,,,,,,,1984-12-25,F,,,,,55.60,NAP,N,6.41006,48.176032,0.96,housenumber,77 Rue des Mélèzes 88390 Les Forges,88178_0035_00077,G,77 RUE DES MELEZES,
311662456,00012,31166245600012,O,1900-01-01,,,,2016-09-07T08:37:22,true,5,,51,,RTE,DE MIRECOURT,88390,LES FORGES,,,88178,,,,,,,,,,,,,,,,,,,2016-07-01,F,,,,,86.21Z,NAFRev2,N,6.383815,48.180499,0.87,housenumber,51 Route de Mirecourt 88390 Les Forges,88178_0040_00051,G,51 ROUTE DE MIRECOURT,
314580184,00013,31458018400013,O,1978-01-01,NN,,,2017-11-21T11:43:12,true,4,,27,,RTE,DE MIRECOURT,88390,LES FORGES,,,88178,,,,,,,,,,,,,,,,,,,2017-10-02,A,,,,,56.10A,NAFRev2,N,6.385345,48.179239,0.87,housenumber,27 Route de Mirecourt 88390 Les Forges,88178_0040_00027,G,27 ROUTE DE MIRECOURT,
314580184,00021,31458018400021,O,1996-03-11,NN,,,,false,3,,19,,RTE,DE DARNEY,88390,LES FORGES,,,88178,,,,,,,,,,,,,,,,,,,2000-11-01,F,LE ROLLERS,,,,70.2C,NAF1993,N,6.389937,48.172844,0.84,housenumber,19 Route de Darney 88390 Les Forges,88178_0021_00019,G,19 ROUTE DE DARNEY,
315879742,00015,31587974200015,O,1979-01-01,NN,,,2008-01-04T20:42:06,true,3,,31,,RUE,DES CHASSEURS,88390,LES FORGES,,,88178,,,,,,,,,,,,,,,,,,,2008-01-01,A,,,,,68.20B,NAFRev2,N,6.398148,48.171021,0.96,housenumber,31 Rue des Chasseurs 88390 Les Forges,88178_0008_00031,G,31 RUE DES CHASSEURS,
318929965,00016,31892996500016,O,,NN,,,,true,1,,19,,RTE,D EPINAL,88390,LES FORGES,,,88178,,,,,,,,,,,,,,,,,,,1989-12-01,F,,,,,81.21,NAP,N,6.383638,48.181463,0.33,street,Allée de l’Epine 88390 Les Forges,88178_0023,G,ALLEE DE L EPINE,
319412136,00016,31941213600016,O,1980-05-15,NN,,,,true,4,,1,,RUE,DES JARDINS,88390,LES FORGES,,,88178,,,,,,,,,,,,,,,,,,,2003-03-01,F,,,,,52.6D,NAFRev1,N,6.393071,48.177413,0.65,housenumber,1 Rue du Jardin 88390 Les Forges,88178_0032_00001,G,1 RUE DU JARDIN,
319704680,00051,31970468000051,O,2005-04-20,,,,2010-04-08T03:45:51,true,3,,,,,,88390,LES FORGES,,,88178,,,,,,,,,,,,,,,,,,,2009-12-31,F,,,,,68.20B,NAFRev2,N,,,0,,,,,,
320046709,00020,32004670900020,O,2017-05-02,,,7420ZQ,2021-02-23T10:44:10,true,1,,9,,RUE,DE LA CROIX BRICE,88390,LES FORGES,,,88178,,,,,,,,,,,,,,,,,,,2017-05-02,A,,,,FOTO 88,74.20Z,NAFRev2,N,6.394488,48.172063,0.95,housenumber,9 Rue de la Croix-Brice 88390 Les Forges,88178_0019_00009,G,9 RUE DE LA CROIX BRICE,
320363310,00014,32036331000014,O,,,,,,true,1,,23,,RUE,DU 8 MAI,88390,LES FORGES,,,88178,,,,,,,,,,,,,,,,,,,1984-12-25,F,,,,,60.09,NAP,N,6.395435,48.175819,0.95,housenumber,23 Rue du 8 Mai 88390 Les Forges,88178_0100_00023,G,23 RUE DU 8 MAI,
320795230,00020,32079523000020,O,2001-04-16,NN,,,2011-09-05T14:49:04,true,4,,14,,RUE,DU PRE DU PUITS,88390,LES FORGES,,,88178,,,,,,,,,,,,,,,,,,,2008-01-01,F,,,,,68.20B,NAFRev2,N,6.38857,48.182051,0.95,housenumber,14 Rue du Pré du Puits 88390 Les Forges,88178_0078_00014,G,14 RUE DU PRE DU PUITS,
322145764,00013,32214576400013,O,,NN,,,,true,1,,1,,RUE,DES CHASSEURS,88390,LES FORGES,,,88178,,,,,,,,,,,,,,,,,,,1995-09-30,F,,,,,70.2C,NAF1993,N,6.397666,48.174769,0.96,housenumber,1 Rue des Chasseurs 88390 Les Forges,88178_0008_00001,G,1 RUE DES CHASSEURS,
323962472,00037,32396247200037,O,1992-09-05,NN,,,,false,3,,34,,RTE,DE MIRECOURT,88390,LES FORGES,,,88178,,,,,,,,,,,,,,,,,,,1994-12-25,F,,,,,55.5A,NAF1993,O,6.386326,48.178948,0.87,housenumber,34 Route de Mirecourt 88390 Les Forges,88178_0040_00034,G,34 ROUTE DE MIRECOURT,
324858398,00013,32485839800013,O,,NN,,,,true,1,,26,,RUE,DU GAL LECLERC,88390,LES FORGES,,,88178,,,,,,,,,,,,,,,,,,,1996-02-29,F,,,,,52.4C,NAF1993,N,6.396521,48.175036,0.87,housenumber,26 Rue du General Leclerc 88390 Les Forges,88178_0027_00026,G,26 RUE DU GENERAL LECLERC,
325561520,00025,32556152000025,O,1985-11-15,12,2020,,2022-08-29T09:18:55,true,7,ZONE ARTISANALE,,,,LE PRE DU PUITS,88390,LES FORGES,,BP 2,88178,,,,,,,,,,,,,,,,,,,2012-12-31,A,,,,,33.20A,NAFRev2,O,6.387124,48.181269,0.82,street,Rue du Pré du Puits 88390 Les Forges,88178_0078,G,RUE DU PRE DU PUITS,
325992907,00031,32599290700031,O,2001-10-25,NN,,,2014-07-08T00:30:35,true,4,,15,,RUE,DES CHASSEURS,88390,LES FORGES,,,88178,,,,,,,,,,,,,,,,,,,2009-03-31,F,,,,,49.32Z,NAFRev2,N,6.399679,48.171821,0.96,housenumber,15 Rue des Chasseurs 88390 Les Forges,88178_0008_00015,G,15 RUE DES CHASSEURS,
326364486,00034,32636448600034,O,1991-04-09,NN,,,2008-11-07T00:43:44,false,4,,2,,RUE,DU PRE DU PUITS,88390,LES FORGES,,,88178,,,,,,,,,,,,,,,,,,,2006-08-31,F,,,,,45.3A,NAFRev1,O,6.385165,48.180715,0.95,housenumber,2 Rue du Pré du Puits 88390 Les Forges,88178_0078_00002,G,2 RUE DU PRE DU PUITS,
327981676,00023,32798167600023,O,1995-01-01,NN,,,2006-11-25T10:06:39,true,1,,13,,RUE,DES EPINETTE,88390,LES FORGES,,,88178,,,,,,,,,,,,,,,,,,,2001-05-31,F,,,,,74.1J,NAF1993,N,6.396765,48.175612,0.91,housenumber,13 Rue des Epinettes 88390 Les Forges,88178_0022_00013,G,13 RUE DES EPINETTES,
328369681,00031,32836968100031,O,2009-11-23,,,,2021-02-23T10:49:35,true,1,,1,B,RUE,DES POMMIERS,88390,LES FORGES,,,88178,,,,,,,,,,,,,,,,,,,2009-11-23,A,,,,,68.20A,NAFRev2,N,6.38774,48.177271,0.86,housenumber,1bis Rue des Pommiers 88390 Les Forges,88178_0067_00001_bis,G,1BIS RUE DES POMMIERS,
328407358,00014,32840735800014,O,1983-10-01,NN,,,2010-08-19T10:07:51,true,4,,7,,RUE,DU SAUVEUX,88390,LES FORGES,,,88178,,,,,,,,,,,,,,,,,,,2009-12-25,F,,,,,02.20Z,NAFRev2,N,6.38749,48.174717,0.95,housenumber,7 Rue du Sauveux 88390 Les Forges,88178_0085_00007,G,7 RUE DU SAUVEUX,
329394662,00012,32939466200012,O,1984-01-16,,,,2008-11-07T00:47:28,true,4,,1,,ALL,DES HETRES,88390,LES FORGES,,,88178,,,,,,,,,,,,,,,,,,,1993-12-25,F,,,,,45.3E,NAF1993,N,6.407996,48.175261,0.84,housenumber,1 Allée des Hêtres 88390 Les Forges,88178_0031_00001,G,1 ALLEE DES HETRES,
331787382,00026,33178738200026,O,1990-03-01,NN,,,2016-04-13T04:21:33,true,4,,20,,RUE,DES EPINETTES,88390,LES FORGES,,,88178,,,,,,,,,,,,,,,,,,,2016-03-31,F,,,,,68.20A,NAFRev2,N,6.394644,48.176942,0.95,housenumber,20 Rue des Epinettes 88390 Les Forges,88178_0022_00020,G,20 RUE DES EPINETTES,
332062702,00011,33206270200011,O,1985-01-01,NN,,,,true,1,,,,,ZONE ARTISANALE,88390,LES FORGES,,,88178,,,,,,,,,,,,,,,,,,,1998-01-01,F,,,,,70.2A,NAF1993,N,2.7640352,42.6301915,0.9,poi.retail,Zone Artisanale (Zone commerciale) Thuir,https://osm.org/way/191039530,G,,
332144260,00012,33214426000012,O,1985-04-01,NN,,,2009-06-27T04:57:59,true,5,,,,,MAIRIE,88390,LES FORGES,,,88178,,,,,,,,,,,,,,,,,,,2008-01-01,A,,,,,86.90D,NAFRev2,N,6.387786,48.178473,0.92,street,Rue de la Mairie 88390 Les Forges,88178_0033,G,RUE DE LA MAIRIE,
333553063,00012,33355306300012,O,,NN,,,,true,1,,27,,RUE,DE MIRECOURT,88390,LES FORGES,,,88178,,,,,,,,,,,,,,,,,,,,F,,,,,67.01,NAP,N,6.385345,48.179239,0.82,housenumber,27 Route de Mirecourt 88390 Les Forges,88178_0040_00027,G,27 ROUTE DE MIRECOURT,
333694313,00011,33369431300011,O,,,,,,true,1,,65,,RTE,DE MIRECOURT,88390,LES FORGES,,,88178,,,,,,,,,,,,,,,,,,,1985-12-25,F,,,,,55.10,NAP,N,6.382844,48.181268,0.87,housenumber,65 Route de Mirecourt 88390 Les Forges,88178_0040_00065,G,65 ROUTE DE MIRECOURT,
334789401,00042,33478940100042,O,2006-02-02,,,,2007-06-11T16:51:58,false,2,,2,B,RUE,PRE DU PUITS,88390,LES FORGES,,,88178,,,,,,,,,,,,,,,,,,,2007-03-01,F,,,,,51.1R,NAFRev1,N,6.385029,48.180735,0.82,housenumber,2bis Rue du Pré du Puits 88390 Les Forges,88178_0078_00002_bis,G,2BIS RUE DU PRE DU PUITS,
334802303,00035,33480230300035,O,1993-07-20,NN,,,2019-06-19T08:32:53,true,4,,5,,RTE,DE MIRECOURT,88390,LES FORGES,,,88178,,,,,,,,,,,,,,,,,,,2019-06-30,F,,,,,86.90E,NAFRev2,N,6.388601,48.17714,0.86,housenumber,5 Route de Mirecourt 88390 Les Forges,88178_0040_00005,G,5 ROUTE DE MIRECOURT,
338374747,00016,33837474700016,O,,NN,,,,true,1,,15,,ALL,DES NOISETIERS,88390,LES FORGES,,,88178,,,,,,,,,,,,,,,,,,,1992-11-20,F,,,,,55.5D,NAF1993,N,6.392251,48.171046,0.87,housenumber,15 Allée des Noisetiers 88390 Les Forges,88178_0058_00015,G,15 ALLEE DES NOISETIERS,
338868235,00130,33886823500130,O,2019-05-01,,,,2021-03-23T08:37:19,false,2,,29,B,RUE,DU PONT TOURNANT,88390,LES FORGES,,,88178,,,,,,,,,,,,,,,,,,,2021-02-01,F,,,,,86.90D,NAFRev2,N,6.381852,48.180234,0.88,housenumber,29bis Rue du Pont Tournant 88390 Les Forges,88178_0070_00029_bis,G,29BIS RUE DU PONT TOURNANT,
339373110,00057,33937311000057,O,1995-05-01,NN,,,2008-11-07T00:59:03,false,4,,13,,RUE,DU 08 MAI 1945,88390,LES FORGES,,BP 22,88178,,,,,,,,,,,,,,,,,,,1996-12-25,F,,,,,25.2G,NAF1993,N,6.391791,48.176302,0.84,housenumber,13 Rue du 8 Mai 1945 88390 Les Forges,88178_n8c73g_00013,G,13 RUE DU 8 MAI 1945,
339756116,00010,33975611600010,O,,NN,,,,true,1,,4,,RUE,DU GENERAL LECLERC,88390,LES FORGES,,,88178,,,,,,,,,,,,,,,,,,,1987-03-09,F,,,,,64.46,NAP,N,6.391469,48.172484,0.95,housenumber,4 Rue du General Leclerc 88390 Les Forges,88178_0027_00004,G,4 RUE DU GENERAL LECLERC,
339936569,00013,33993656900013,O,1987-01-07,NN,,,,true,1,,15,,RUE,DES CHASSEURS,88390,LES FORGES,,,88178,,,,,,,,,,,,,,,,,,,2000-06-30,F,,,,,60.2L,NAF1993,O,6.399679,48.171821,0.96,housenumber,15 Rue des Chasseurs 88390 Les Forges,88178_0008_00015,G,15 RUE DES CHASSEURS,
339994394,00023,33999439400023,O,1987-07-06,NN,,,2012-05-05T02:39:37,true,7,ZONE ARTISANALE,,,,LE PRE DU PUITS,88390,LES FORGES,,,88178,,,,,,,,,,,,,,,,,,,2010-12-31,F,,,,,68.20B,NAFRev2,N,6.387124,48.181269,0.82,street,Rue du Pré du Puits 88390 Les Forges,88178_0078,G,RUE DU PRE DU PUITS,
340287002,00018,34028700200018,O,,NN,,,,true,1,,19,,RTE,D EPINAL,88390,LES FORGES,,,88178,,,,,,,,,,,,,,,,,,,1989-12-01,F,,,,,67.08,NAP,N,6.383638,48.181463,0.33,street,Allée de l’Epine 88390 Les Forges,88178_0023,G,ALLEE DE L EPINE,
340817212,00038,34081721200038,O,2009-01-01,,,,2015-03-06T08:31:10,true,2,,30,,RUE,DU POT A L OISEAU,88390,LES FORGES,,,88178,,,,,,,,,,,,,,,,,,,2014-12-31,F,,,,,70.22Z,NAFRev2,N,6.40399,48.175205,0.95,housenumber,30 Rue du Pot à l’Oiseau 88390 Les Forges,88178_0075_00030,G,30 RUE DU POT A L OISEAU,
341605947,00033,34160594700033,O,,NN,,,,true,1,,,,RUE,PRE DU PUITS,88390,LES FORGES,,,88178,,,,,,,,,,,,,,,,,,,1994-12-31,F,,,,,74.2A,NAF1993,N,6.387124,48.181269,0.9,street,Rue du Pré du Puits 88390 Les Forges,88178_0078,G,RUE DU PRE DU PUITS,
341678688,00027,34167868800027,O,2011-05-01,,,,2012-11-09T00:35:35,false,2,,19,,RTE,DE MIRECOURT,88390,LES FORGES,,,88178,,,,,,,,,,,,,,,,,,,2012-04-01,F,,,,,47.22Z,NAFRev2,N,6.3869,48.178232,0.87,housenumber,19 Route de Mirecourt 88390 Les Forges,88178_0040_00019,G,19 ROUTE DE MIRECOURT,
341678688,00043,34167868800043,O,2013-03-18,,,,2014-02-26T05:07:49,true,2,,2,,RUE,DU CHEVAL FIN,88390,LES FORGES,,,88178,,,,,,,,,,,,,,,,,,,2014-02-28,F,,,,,47.22Z,NAFRev2,N,6.386562,48.177401,0.95,housenumber,2 Rue du Cheval Fin 88390 Les Forges,88178_0010_00002,G,2 RUE DU CHEVAL FIN,
341822716,00013,34182271600013,O,1987-07-01,NN,,,2015-03-12T04:44:01,false,4,,1,B,RUE,DU SAUVEUX,88390,LES FORGES,,,88178,,,,,,,,,,,,,,,,,,,2015-01-17,F,,,,,68.20A,NAFRev2,N,6.388445,48.17613,0.95,housenumber,1b Rue du Sauveux 88390 Les Forges,88178_0085_00001_b,G,1B RUE DU SAUVEUX,