siren,nic,siret,statutDiffusionEtablissement,dateCreationEtablissement,trancheEffectifsEtablissement,anneeEffectifsEtablissement,activitePrincipaleRegistreMetiersEtablissement,dateDernierTraitementEtablissement,etablissementSiege,nombrePeriodesEtablissement,complementAdresseEtablissement,numeroVoieEtablissement,indiceRepetitionEtablissement,typeVoieEtablissement,libelleVoieEtablissement,codePostalEtablissement,libelleCommuneEtablissement,libelleCommuneEtrangerEtablissement,distributionSpecialeEtablissement,codeCommuneEtablissement,codeCedexEtablissement,libelleCedexEtablissement,codePaysEtrangerEtablissement,libellePaysEtrangerEtablissement,complementAdresse2Etablissement,numeroVoie2Etablissement,indiceRepetition2Etablissement,typeVoie2Etablissement,libelleVoie2Etablissement,codePostal2Etablissement,libelleCommune2Etablissement,libelleCommuneEtranger2Etablissement,distributionSpeciale2Etablissement,codeCommune2Etablissement,codeCedex2Etablissement,libelleCedex2Etablissement,codePaysEtranger2Etablissement,libellePaysEtranger2Etablissement,dateDebut,etatAdministratifEtablissement,enseigne1Etablissement,enseigne2Etablissement,enseigne3Etablissement,denominationUsuelleEtablissement,activitePrincipaleEtablissement,nomenclatureActivitePrincipaleEtablissement,caractereEmployeurEtablissement,longitude,latitude,geo_score,geo_type,geo_adresse,geo_id,geo_ligne,geo_l4,geo_l5
219103934,00010,21910393400010,O,1983-03-01,02,2020,,2022-08-29T09:09:28,true,4,,,,PL,DE LA MAIRIE,91780,MEROBERT,,,91393,,,,,,,,,,,,,,,,,,,2008-01-01,A,MAIRIE,,,,84.11Z,NAFRev2,O,1.980756,48.408145,0.38,street,Rue de la Plaine 91780 Mérobert,91393_0073,G,RUE DE LA PLAINE,
219103934,00028,21910393400028,O,1983-12-21,01,2020,,2022-08-29T09:09:28,false,3,,5,,RUE,DE LA MAIRIE,91780,MEROBERT,,,91393,,,,,,,,,,,,,,,,,,,2008-01-01,A,ECOLE ELEMENTAIRE PUBLIQUE,,,,85.20Z,NAFRev2,N,1.981183,48.408347,0.53,housenumber,5 Rue de la Plaine 91780 Mérobert,91393_0073_00005,G,5 RUE DE LA PLAINE,
219103934,00036,21910393400036,O,1999-12-25,NN,,,2020-08-17T15:32:54,false,3,MAIRIE,,,PL,DE LA MAIRIE,91780,MEROBERT,,,91393,,,,,,,,,,,,,,,,,,,2019-11-05,F,SERVICE D'ASSAINISSEMENT,,,,37.00Z,NAFRev2,N,1.980756,48.408145,0.38,street,Rue de la Plaine 91780 Mérobert,91393_0073,G,RUE DE LA PLAINE,
269103172,00012,26910317200012,O,1994-01-25,NN,,,2010-06-26T03:17:56,true,3,MAIRIE,,,PL,DE LA MAIRIE,91780,MEROBERT,,,91393,,,,,,,,,,,,,,,,,,,2008-01-01,A,CDE,,,,88.99B,NAFRev2,N,1.980756,48.408145,0.38,street,Rue de la Plaine 91780 Mérobert,91393_0073,G,RUE DE LA PLAINE,
269103180,00015,26910318000015,O,1994-01-25,NN,,,2021-05-27T11:24:03,true,4,MAIRIE,,,PL,DE LA PLAINE,91780,MEROBERT,,,91393,,,,,,,,,,,,,,,,,,,2020-12-31,F,CCAS,,,,88.99B,NAFRev2,N,1.980756,48.408145,0.81,street,Rue de la Plaine 91780 Mérobert,91393_0073,G,RUE DE LA PLAINE,
299101949,00012,29910194900012,O,1994-05-11,NN,,,2021-02-25T09:57:17,true,4,MAIRIE,,,PL,DE LA MAIRIE,91780,MEROBERT,,,91393,,,,,,,,,,,,,,,,,,,2008-01-01,F,,,,,42.99Z,NAFRev2,N,1.980756,48.408145,0.38,street,Rue de la Plaine 91780 Mérobert,91393_0073,G,RUE DE LA PLAINE,
310437686,00010,31043768600010,O,1900-01-01,NN,,,2008-01-04T20:00:53,true,3,,,,,,91780,MEROBERT,,,91393,,,,,,,,,,,,,,,,,,,2008-01-01,A,,,,,56.30Z,NAFRev2,N,,,0,,,,,,
311334502,00029,31133450200029,O,1983-02-03,NN,,,,true,1,,6,,RUE,DE LA GARENNE,91780,MEROBERT,,,91393,,,,,,,,,,,,,,,,,,,2001-10-28,F,,,,,74.8F,NAF1993,N,2.003787,48.415379,0.95,housenumber,6 Rue de la Garenne 91780 Mérobert,91393_0021_00006,G,6 RUE DE LA GARENNE,
312054190,00029,31205419000029,O,,NN,,,,true,1,,,,,LES 4 VENTS,91780,MEROBERT,,,91393,,,,,,,,,,,,,,,,,,,1995-12-25,F,,,,,15.5C,NAF1993,N,4.4354465,45.142244,0.9,poi.bar,Les 4 Vents (Bar) Saint-Bonnet-le-Froid,https://osm.org/node/2303152808,G,,
315597385,00030,31559738500030,O,1984-11-27,NN,,,2021-01-29T11:33:49,true,4,,9,,RUE,TRAVERSIERE,91780,MEROBERT,,,91393,,,,,,,,,,,,,,,,,,,1996-06-12,F,,,,,45.3A,NAF1993,O,2.006316,48.415495,0.94,housenumber,9 Rue Traversière 91780 Mérobert,91393_0119_00009,G,9 RUE TRAVERSIERE,
315743856,00041,31574385600041,O,2003-08-06,NN,,,2008-11-07T00:31:13,true,3,,10,,RUE,DES ECOLES,91780,MEROBERT,,,91393,,,,,,,,,,,,,,,,,,,2006-09-30,F,,,,,60.2E,NAFRev1,N,2.003787,48.416944,0.95,housenumber,10 Rue des Ecoles 91780 Mérobert,91393_0017_00010,G,10 RUE DES ECOLES,
317960854,00014,31796085400014,O,1980-01-01,NN,,,2016-03-20T03:52:54,true,3,,36,,,GRANDE RUE,91780,MEROBERT,,,91393,,,,,,,,,,,,,,,,,,,2008-01-01,A,,,,,68.20B,NAFRev2,N,2.00522,48.415903,0.95,housenumber,36 Grande Rue 91780 Mérobert,91393_0020_00036,G,36 GRANDE RUE,
321849945,00019,32184994500019,O,,,,,2009-10-29T05:22:38,true,1,,,,HAM,D AUBRAY,91780,MEROBERT,,,91393,,,,,,,,,,,,,,,,,,,1990-10-09,F,,,,,69.25,NAP,N,1.98083,48.408275,0.75,street,Aubray 91780 Mérobert,91393_ik68fm,G,AUBRAY,
323318063,00035,32331806300035,O,1987-04-01,03,2020,4399CZ,2022-08-29T09:17:53,true,4,,53,,,GRANDE RUE,91780,MEROBERT,,,91393,,,,,,,,,,,,,,,,,,,2008-01-01,A,,,,,43.99C,NAFRev2,O,2.003341,48.416635,0.95,housenumber,53 Grande Rue 91780 Mérobert,91393_0020_00053,G,53 GRANDE RUE,
328862479,00016,32886247900016,O,1984-01-02,NN,,,,true,1,,11,,RUE,DE LA GARENNE,91780,MEROBERT,,,91393,,,,,,,,,,,,,,,,,,,2001-07-10,F,,,,,74.1J,NAF1993,N,2.003413,48.415138,0.95,housenumber,11 Rue de la Garenne 91780 Mérobert,91393_0021_00011,G,11 RUE DE LA GARENNE,
329208516,00016,32920851600016,O,1984-01-31,NN,,,2009-01-04T15:11:40,true,3,,9,,RUE,DE LA PLAINE,91780,MEROBERT,,,91393,,,,,,,,,,,,,,,,,,,2008-01-01,A,,,,,77.31Z,NAFRev2,N,1.980042,48.408189,0.95,housenumber,9 Rue de la Plaine 91780 Mérobert,91393_0073_00009,G,9 RUE DE LA PLAINE,
332588797,00016,33258879700016,O,1985-05-15,NN,,,2008-04-05T00:34:52,true,3,,,,,AUBRAY,91780,MEROBERT,,,91393,,,,,,,,,,,,,,,,,,,2008-01-01,A,,,,,01.11Z,NAFRev2,N,1.98083,48.408275,0.94,street,Aubray 91780 Mérobert,91393_ik68fm,G,AUBRAY,
338568561,00025,33856856100025,O,1997-01-20,NN,,1812ZB,2017-05-04T05:03:42,true,4,,21,B,,GRANDE RUE,91780,MEROBERT,,,91393,,,,,,,,,,,,,,,,,,,2008-02-24,A,,,,,18.12Z,NAFRev2,O,2.007209,48.41565,0.83,housenumber,21bis Grande Rue 91780 Mérobert,91393_0020_00021_bis,G,21BIS GRANDE RUE,
338659725,00026,33865972500026,O,2003-01-11,,,,2005-12-07T17:35:38,true,3,,7,,RUE,DES ECOLES,91780,MEROBERT,,,91393,,,,,,,,,,,,,,,,,,,2003-12-25,F,,,,,85.1G,NAFRev1,N,2.004057,48.416969,0.95,housenumber,7 Rue des Ecoles 91780 Mérobert,91393_0017_00007,G,7 RUE DES ECOLES,
339367385,00046,33936738500046,O,1996-07-02,NN,,,,true,1,,4,,RUE,DE LA CROIX BOISSEE,91780,MEROBERT,,,91393,,,,,,,,,,,,,,,,,,,1998-12-31,F,,,,,22.2J,NAF1993,N,2.006982,48.41638,0.95,housenumber,4 Rue de la Croix Boissée 91780 Mérobert,91393_0013_00004,G,4 RUE DE LA CROIX BOISSEE,
341598829,00016,34159882900016,O,1987-06-30,NN,,,,true,1,,86,,RUE,DE LA PLAINE AUBRAY,91780,MEROBERT,,,91393,,,,,,,,,,,,,,,,,,,1998-02-23,F,,,,,01.1A,NAF1993,N,1.980756,48.408145,0.58,street,Rue de la Plaine 91780 Mérobert,91393_0073,G,RUE DE LA PLAINE,
341599017,00017,34159901700017,O,1987-06-30,NN,,,2007-01-18T09:24:08,true,3,,8,,,GRANDE RUE,91780,MEROBERT,,,91393,,,,,,,,,,,,,,,,,,,1998-12-25,F,,,,,01.1A,NAF1993,N,2.009163,48.415307,0.95,housenumber,8 Grande Rue 91780 Mérobert,91393_0020_00008,G,8 GRANDE RUE,
341599132,00014,34159913200014,O,1987-06-30,NN,,,2008-01-04T21:54:10,true,3,,26,,,GRANDE RUE,91780,MEROBERT,,,91393,,,,,,,,,,,,,,,,,,,2008-01-01,A,,,,,01.11Z,NAFRev2,N,2.00702,48.415577,0.95,housenumber,26 Grande Rue 91780 Mérobert,91393_0020_00026,G,26 GRANDE RUE,
341825537,00036,34182553700036,O,2020-09-21,,,,2021-07-01T09:31:17,true,2,,51,,RUE,GRANDE RUE,91780,MEROBERT,,,91393,,,,,,,,,,,,,,,,,,,2021-06-29,F,,,,,86.90F,NAFRev2,N,2.003669,48.416448,0.84,housenumber,51 Grande Rue 91780 Mérobert,91393_0020_00051,G,51 GRANDE RUE,
342292901,00010,34229290100010,O,1971-12-04,NN,,,2016-01-12T00:12:43,true,3,,9,,RUE,DE LA PLAINE,91780,MEROBERT,,,91393,,,,,,,,,,,,,,,,,,,2008-01-01,A,,,,,01.11Z,NAFRev2,N,1.980042,48.408189,0.95,housenumber,9 Rue de la Plaine 91780 Mérobert,91393_0073_00009,G,9 RUE DE LA PLAINE,
343406195,00010,34340619500010,O,,NN,,,,true,1,,12,B,RUE,DE LA GARENNE,91780,MEROBERT,,,91393,,,,,,,,,,,,,,,,,,,1990-03-31,F,,,,,55.60,NAP,N,2.003228,48.414625,0.87,housenumber,12bis Rue de la Garenne 91780 Mérobert,91393_0021_00012_bis,G,12BIS RUE DE LA GARENNE,
344655394,00015,34465539400015,O,1988-04-25,NN,,,2022-04-06T14:47:45,true,3,,9,,RUE,DE LA PLAINE,91780,MEROBERT,,,91393,,,,,,,,,,,,,,,,,,,2008-01-01,A,,,,,41.10D,NAFRev2,N,1.980042,48.408189,0.95,housenumber,9 Rue de la Plaine 91780 Mérobert,91393_0073_00009,G,9 RUE DE LA PLAINE,
345261382,00013,34526138200013,O,1900-01-01,NN,,,2011-04-28T00:37:50,false,4,,20,,RUE,DE LA GARENNE,91780,MEROBERT,,,91393,,,,,,,,,,,,,,,,,,,1992-12-25,F,,,,,60.2L,NAF1993,N,2.0015,48.413396,0.95,housenumber,20 Rue de la Garenne 91780 Mérobert,91393_0021_00020,G,20 RUE DE LA GARENNE,
349161307,00013,34916130700013,O,1988-11-20,NN,,,2017-01-12T05:01:27,true,4,LD AUBRAY,9,,RUE,DE LA PLAINE,91780,MEROBERT,,,91393,,,,,,,,,,,,,,,,,,,2013-02-23,F,,,,,01.11Z,NAFRev2,N,1.980042,48.408189,0.95,housenumber,9 Rue de la Plaine 91780 Mérobert,91393_0073_00009,G,9 RUE DE LA PLAINE,
351108113,00025,35110811300025,O,1997-09-08,NN,,,,true,1,,4,,RUE,DE LA PLAINE,91780,MEROBERT,,,91393,,,,,,,,,,,,,,,,,,,1999-01-18,F,,,,,60.2B,NAF1993,O,1.981847,48.408339,0.95,housenumber,4 Rue de la Plaine 91780 Mérobert,91393_0073_00004,G,4 RUE DE LA PLAINE,
378027346,00014,37802734600014,O,1990-04-01,01,2020,4399CZ,2022-08-29T09:05:15,true,4,,12,,RUE,DE LA GARENNE,91780,MEROBERT,,,91393,,,,,,,,,,,,,,,,,,,2008-01-01,A,,,,,43.99C,NAFRev2,O,2.003486,48.41507,0.95,housenumber,12 Rue de la Garenne 91780 Mérobert,91393_0021_00012,G,12 RUE DE LA GARENNE,
379115405,00027,37911540500027,O,1993-12-01,NN,,,2008-11-08T00:35:11,false,4,,6,,RUE,TRAVERSIERE,91780,MEROBERT,,,91393,,,,,,,,,,,,,,,,,,,2007-01-01,F,,,,,45.4D,NAFRev1,O,2.006088,48.41471,0.94,housenumber,6 Rue Traversière 91780 Mérobert,91393_0119_00006,G,6 RUE TRAVERSIERE,
383542826,00011,38354282600011,O,,,,,2012-03-23T05:04:59,true,1,,36,T,RUE,DES VIGNES,91780,MEROBERT,,,91393,,,,,,,,,,,,,,,,,,,1996-12-31,F,,,,,01.4B,NAF1993,N,2.008664,48.413821,0.77,street,Rue des Vignes 91780 Mérobert,91393_0125,G,RUE DES VIGNES,
384451076,00010,38445107600010,O,1991-12-06,NN,,,2008-01-04T22:38:58,true,3,,36,T,RUE,VIGNES,91780,MEROBERT,,,91393,,,,,,,,,,,,,,,,,,,2008-01-01,A,,,,,68.20B,NAFRev2,N,2.008664,48.413821,0.52,street,Rue des Vignes 91780 Mérobert,91393_0125,G,RUE DES VIGNES,
384703609,00014,38470360900014,O,1992-02-01,NN,,,,true,1,,13,,,GRANDE RUE,91780,MEROBERT,,,91393,,,,,,,,,,,,,,,,,,,2002-01-31,F,,,,,01.1A,NAF1993,N,2.007883,48.415528,0.95,housenumber,13 Grande Rue 91780 Mérobert,91393_0020_00013,G,13 GRANDE RUE,
387890866,00016,38789086600016,O,1992-07-01,NN,,,,false,4,,20,,RUE,DE LA GARENNE,91780,MEROBERT,,,91393,,,,,,,,,,,,,,,,,,,1994-12-25,F,,,,,60.2M,NAF1993,O,2.0015,48.413396,0.95,housenumber,20 Rue de la Garenne 91780 Mérobert,91393_0021_00020,G,20 RUE DE LA GARENNE,
390749059,00015,39074905900015,O,1993-03-31,NN,,,,false,3,,7,,HAM,D'AUBRAY,91780,MEROBERT,,,91393,,,,,,,,,,,,,,,,,,,1994-04-28,F,,,,,70.2C,NAF1993,N,1.980745,48.408276,0.7,housenumber,7 Aubray 91780 Mérobert,91393_ik68fm_00007,G,7 AUBRAY,
390804870,00017,39080487000017,O,1993-04-01,NN,,,,false,4,,7,,,HAMEAU D'AUBRAY,91780,MEROBERT,,,91393,,,,,,,,,,,,,,,,,,,1994-12-25,F,,,,,00.0Z,NAF1993,N,1.980745,48.408276,0.43,housenumber,7 Aubray 91780 Mérobert,91393_ik68fm_00007,G,7 AUBRAY,
392614533,00017,39261453300017,O,1993-10-06,NN,,,2014-07-08T01:21:06,true,5,,11,,RUE,DE LA GARENNE,91780,MEROBERT,,,91393,,,,,,,,,,,,,,,,,,,2011-09-30,F,,,,,41.20B,NAFRev2,O,2.003413,48.415138,0.95,housenumber,11 Rue de la Garenne 91780 Mérobert,91393_0021_00011,G,11 RUE DE LA GARENNE,
397754045,00011,39775404500011,O,,NN,,,,true,1,,,,,LES QUATRES VENTS,91780,MEROBERT,,,91393,,,,,,,,,,,,,,,,,,,1996-12-31,F,,,,,22.2C,NAF1993,N,2.0369792,49.0853041,0.89,poi.industrial,Zone Artisanale Les Quatres Vents (Zone industrielle) Boissy-l'Aillerie,https://osm.org/way/39750885,G,,
399277532,00020,39927753200020,O,2015-07-01,,,,2017-06-23T03:13:17,true,2,,44,,,GRANDE RUE,91780,MEROBERT,,,91393,,,,,,,,,,,,,,,,,,,2017-01-01,F,,,,CHEF A DOMICILE,56.21Z,NAFRev2,N,2.004381,48.416088,0.95,housenumber,44 Grande Rue 91780 Mérobert,91393_0020_00044,G,44 GRANDE RUE,
402353890,00013,40235389000013,O,1995-10-02,NN,,,,true,1,,6,B,,GRANDE RUE,91780,MEROBERT,,,91393,,,,,,,,,,,,,,,,,,,2001-09-30,F,,,,,45.3E,NAF1993,O,2.009593,48.415255,0.95,housenumber,6b Grande Rue 91780 Mérobert,91393_0020_00006_b,G,6B GRANDE RUE,
403905813,00016,40390581300016,O,1995-09-25,NN,,,2010-04-18T07:08:01,true,4,,,,PL,DE LA MAIRIE,91780,MEROBERT,,,91393,,,,,,,,,,,,,,,,,,,2008-09-22,A,,,,,93.12Z,NAFRev2,N,1.980756,48.408145,0.38,street,Rue de la Plaine 91780 Mérobert,91393_0073,G,RUE DE LA PLAINE,
404047425,00016,40404742500016,O,1986-07-01,NN,,,2008-01-04T20:33:29,true,3,,22,,,GRANDE RUE,91780,MEROBERT,,,91393,,,,,,,,,,,,,,,,,,,2008-01-01,A,,,,,01.11Z,NAFRev2,N,2.007594,48.415508,0.95,housenumber,22 Grande Rue 91780 Mérobert,91393_0020_00022,G,22 GRANDE RUE,
405126863,00019,40512686300019,O,1979-01-01,NN,,,2006-10-28T03:26:20,true,3,,28,,GR,RUE,91780,MEROBERT,,,91393,,,,,,,,,,,,,,,,,,,2004-12-31,F,,,,,01.1A,NAFRev1,N,2.006753,48.415625,0.76,housenumber,28 Grande Rue 91780 Mérobert,91393_0020_00028,G,28 GRANDE RUE,
405126871,00012,40512687100012,O,1969-01-01,NN,,,,true,1,,3,,RUE,DE LA GARENNE,91780,MEROBERT,,,91393,,,,,,,,,,,,,,,,,,,2001-05-31,F,,,,,01.1A,NAF1993,N,2.003944,48.416011,0.95,housenumber,3 Rue de la Garenne 91780 Mérobert,91393_0021_00003,G,3 RUE DE LA GARENNE,
405126889,00014,40512688900014,O,1980-11-01,NN,,,2018-08-29T12:29:09,true,4,,8,,RUE,CROIX BOISSEE,91780,MEROBERT,,,91393,,,,,,,,,,,,,,,,,,,2018-06-30,F,,,,,01.11Z,NAFRev2,N,2.007802,48.416175,0.89,housenumber,8 Rue de la Croix Boissée 91780 Mérobert,91393_0013_00008,G,8 RUE DE LA CROIX BOISSEE,
405126897,00017,40512689700017,O,1985-10-01,NN,,,2008-01-04T20:50:53,true,3,,,,RUE,DES VIGNES,91780,MEROBERT,,,91393,,,,,,,,,,,,,,,,,,,2008-01-01,A,,,,,01.11Z,NAFRev2,N,2.008664,48.413821,0.95,street,Rue des Vignes 91780 Mérobert,91393_0125,G,RUE DES VIGNES,
405126905,00018,40512690500018,O,,NN,,,,true,1,,5,,RUE,DE LA PLAINE,91780,MEROBERT,,,91393,,,,,,,,,,,,,,,,,,,1996-09-30,F,,,,,01.1A,NAF1993,N,1.981183,48.408347,0.95,housenumber,5 Rue de la Plaine 91780 Mérobert,91393_0073_00005,G,5 RUE DE LA PLAINE,
408700524,00015,40870052400015,O,1991-09-01,NN,,,2008-01-04T21:15:22,true,3,,26,,GR,RUE,91780,MEROBERT,,,91393,,,,,,,,,,,,,,,,,,,2008-01-01,A,,,,,01.11Z,NAFRev2,N,2.00702,48.415577,0.76,housenumber,26 Grande Rue 91780 Mérobert,91393_0020_00026,G,26 GRANDE RUE,
408700532,00018,40870053200018,O,1996-01-01,NN,,,2021-05-18T03:36:54,true,4,,11,,RUE,DE LA GARENNE,91780,MEROBERT,,,91393,,,,,,,,,,,,,,,,,,,2020-11-01,F,,,,,01.11Z,NAFRev2,N,2.003413,48.415138,0.95,housenumber,11 Rue de la Garenne 91780 Mérobert,91393_0021_00011,G,11 RUE DE LA GARENNE,
409241551,00012,40924155100012,O,1996-10-02,NN,,,2014-07-08T01:41:05,true,5,,9,,RUE,TRAVERSIERE,91780,MEROBERT,,,91393,,,,,,,,,,,,,,,,,,,2012-10-31,F,,,,,43.21A,NAFRev2,O,2.006316,48.415495,0.94,housenumber,9 Rue Traversière 91780 Mérobert,91393_0119_00009,G,9 RUE TRAVERSIERE,
409492568,00020,40949256800020,O,2000-03-15,NN,,,2007-05-19T12:29:13,false,4,,37,,RUE,DES VIGNES,91780,MEROBERT,,,91393,,,,,,,,,,,,,,,,,,,2005-11-01,F,,,,,60.2L,NAFRev1,O,2.008009,48.413896,0.95,housenumber,37 Rue des Vignes 91780 Mérobert,91393_0125_00037,G,37 RUE DES VIGNES,
414549295,00015,41454929500015,O,1996-07-31,NN,,4932ZA,2015-05-14T08:09:44,true,5,,19,,RUE,DES VIGNES,91780,MEROBERT,,,91393,,,,,,,,,,,,,,,,,,,2014-02-27,F,,,,,49.32Z,NAFRev2,O,2.010025,48.413612,0.95,housenumber,19 Rue des Vignes 91780 Mérobert,91393_0125_00019,G,19 RUE DES VIGNES,
417736105,00012,41773610500012,O,1998-01-09,NN,,,2008-11-08T01:32:28,false,4,,32,,,GRANDE RUE,91780,MEROBERT,,,91393,,,,,,,,,,,,,,,,,,,2000-01-01,F,,,,,25.2G,NAF1993,O,2.006528,48.415662,0.95,housenumber,32 Grande Rue 91780 Mérobert,91393_0020_00032,G,32 GRANDE RUE,
418169777,00012,41816977700012,O,1998-03-02,NN,,,2012-06-27T04:45:04,true,4,FERME DE LA RECETTE,36,,,GRANDE RUE,91780,MEROBERT,,,91393,,,,,,,,,,,,,,,,,,,2012-05-31,F,,,,,01.11Z,NAFRev2,N,2.00522,48.415903,0.95,housenumber,36 Grande Rue 91780 Mérobert,91393_0020_00036,G,36 GRANDE RUE,
418477204,00014,41847720400014,O,1998-04-09,NN,,,,true,4,,4,,RUE,DE LA PLAINE AUBRAY,91780,MEROBERT,,,91393,,,,,,,,,,,,,,,,,,,2002-06-24,F,,,,,60.2B,NAF1993,O,1.981847,48.408339,0.73,housenumber,4 Rue de la Plaine 91780 Mérobert,91393_0073_00004,G,4 RUE DE LA PLAINE,
418490512,00013,41849051200013,O,1997-06-16,,,,,false,3,,7,,PL,DE LA MAIRIE,91780,MEROBERT,,,91393,,,,,,,,,,,,,,,,,,,1999-01-11,F,,,,,85.1A,NAF1993,N,1.980629,48.408219,0.43,housenumber,7 Rue de la Plaine 91780 Mérobert,91393_0073_00007,G,7 RUE DE LA PLAINE,
418844874,00010,41884487400010,O,1998-03-31,NN,,,2008-01-04T23:27:29,true,3,,36,T,RUE,DES VIGNES,91780,MEROBERT,,,91393,,,,,,,,,,,,,,,,,,,2008-01-01,A,,,,,68.20A,NAFRev2,N,2.008664,48.413821,0.77,street,Rue des Vignes 91780 Mérobert,91393_0125,G,RUE DES VIGNES,
419025523,00012,41902552300012,O,1998-03-16,NN,,,2008-09-03T05:15:06,true,3,,8,B,RUE,DE LA PLAINE AUBRAY,91780,MEROBERT,,,91393,,,,,,,,,,,,,,,,,,,2008-01-01,A,,,,,01.11Z,NAFRev2,N,1.980587,48.408079,0.59,housenumber,8bis Rue de la Plaine 91780 Mérobert,91393_0073_00008_bis,G,8BIS RUE DE LA PLAINE,
419223482,00011,41922348200011,O,1998-06-08,NN,,,2011-04-23T09:56:12,false,5,,7,,HAM,D'AUBRAY,91780,MEROBERT,,,91393,,,,,,,,,,,,,,,,,,,2009-01-01,F,,,,,64.20Z,NAFRev2,O,1.980745,48.408276,0.7,housenumber,7 Aubray 91780 Mérobert,91393_ik68fm_00007,G,7 AUBRAY,
419461793,00012,41946179300012,O,1998-07-02,NN,,,2021-06-28T15:19:14,true,5,,9,,RUE,DE LA PLAINE,91780,MEROBERT,,,91393,,,,,,,,,,,,,,,,,,,2019-12-31,F,,,,,01.11Z,NAFRev2,O,1.980042,48.408189,0.95,housenumber,9 Rue de la Plaine 91780 Mérobert,91393_0073_00009,G,9 RUE DE LA PLAINE,
420287443,00048,42028744300048,O,2009-10-01,NN,,,2017-05-04T01:05:52,false,2,CHEZ MR HERON JEAN MARIE,50,,,GRANDE RUE,91780,MEROBERT,,,91393,,,,,,,,,,,,,,,,,,,2015-12-09,F,,,,,94.99Z,NAFRev2,O,2.003248,48.416613,0.95,housenumber,50 Grande Rue 91780 Mérobert,91393_0020_00050,G,50 GRANDE RUE,
420861312,00015,42086131200015,O,1998-10-10,NN,,,2014-01-22T05:40:50,false,4,,6,T,,GRANDE RUE,91780,MEROBERT,,,91393,,,,,,,,,,,,,,,,,,,2013-12-31,F,,,,,68.20B,NAFRev2,N,2.009318,48.415293,0.95,housenumber,6t Grande Rue 91780 Mérobert,91393_0020_00006_t,G,6T GRANDE RUE,
421398777,00019,42139877700019,O,1999-01-01,NN,,,2012-05-05T06:38:31,true,3,,44,,,GRANDE RUE,91780,MEROBERT,,,91393,,,,,,,,,,,,,,,,,,,2008-01-01,A,,,,,56.21Z,NAFRev2,O,2.004381,48.416088,0.95,housenumber,44 Grande Rue 91780 Mérobert,91393_0020_00044,G,44 GRANDE RUE,
423188531,00010,42318853100010,O,1999-06-01,NN,,4399CZ,2015-05-14T04:06:28,true,5,,45,,CHE,DES VIEILLES VIGNES,91780,MEROBERT,,,91393,,,,,,,,,,,,,,,,,,,2014-10-31,F,,,,,43.99C,NAFRev2,N,2.006475,48.414064,0.46,housenumber,45 Rue des Vignes 91780 Mérobert,91393_0125_00045,G,45 RUE DES VIGNES,
423203587,00013,42320358700013,O,1999-06-01,NN,,,2020-05-28T08:42:29,false,4,,45,,CHE,DES VIEILLES VIGNES,91780,MEROBERT,,,91393,,,,,,,,,,,,,,,,,,,2020-04-01,F,,,,,68.20B,NAFRev2,N,2.006475,48.414064,0.46,housenumber,45 Rue des Vignes 91780 Mérobert,91393_0125_00045,G,45 RUE DES VIGNES,
424280576,00010,42428057600010,O,1999-10-01,NN,,,2006-11-25T16:34:18,true,3,L ELDORADO,4,,RUE,DE LA PLAINE,91780,MEROBERT,,,91393,,,,,,,,,,,,,,,,,,,2005-06-23,F,,,,,92.7C,NAFRev1,N,1.981847,48.408339,0.95,housenumber,4 Rue de la Plaine 91780 Mérobert,91393_0073_00004,G,4 RUE DE LA PLAINE,
431526508,00012,43152650800012,O,1992-02-01,NN,,,2008-01-04T18:12:06,true,3,,20,,,GRANDE RUE,91780,MEROBERT,,,91393,,,,,,,,,,,,,,,,,,,2008-01-01,A,,,,,68.10Z,NAFRev2,N,2.008088,48.415408,0.95,housenumber,20 Grande Rue 91780 Mérobert,91393_0020_00020,G,20 GRANDE RUE,
438152118,00016,43815211800016,O,2001-06-01,NN,,,2008-01-04T20:05:31,true,3,,3,,RUE,DE LA GARENNE,91780,MEROBERT,,,91393,,,,,,,,,,,,,,,,,,,2008-01-01,A,,,,,01.11Z,NAFRev2,N,2.003944,48.416011,0.95,housenumber,3 Rue de la Garenne 91780 Mérobert,91393_0021_00003,G,3 RUE DE LA GARENNE,
438717670,00014,43871767000014,O,2001-07-08,NN,,4520AA,2021-04-19T15:09:44,true,8,AUBRAY,4,,RUE,DE LA PLAINE,91780,MEROBERT,,,91393,,,,,,,,,,,,,,,,,,,2021-03-12,F,,,,,49.39A,NAFRev2,N,1.981847,48.408339,0.95,housenumber,4 Rue de la Plaine 91780 Mérobert,91393_0073_00004,G,4 RUE DE LA PLAINE,
439678459,00025,43967845900025,O,2010-12-15,,,,2019-08-12T14:12:25,false,2,,43,,RUE,DES VIGNES,91780,MEROBERT,,,91393,,,,,,,,,,,,,,,,,,,2019-07-10,F,,,,,68.20B,NAFRev2,N,2.007251,48.414062,0.95,housenumber,43 Rue des Vignes 91780 Mérobert,91393_0125_00043,G,43 RUE DES VIGNES,
441416583,00017,44141658300017,O,2002-02-01,NN,,,2007-04-13T05:29:17,true,3,,13,,,GRANDE RUE,91780,MEROBERT,,,91393,,,,,,,,,,,,,,,,,,,2007-06-30,F,,,,,01.1A,NAFRev1,N,2.007883,48.415528,0.95,housenumber,13 Grande Rue 91780 Mérobert,91393_0020_00013,G,13 GRANDE RUE,
443060850,00023,44306085000023,O,2006-06-01,NN,,4322AZ,2018-09-29T12:27:50,true,4,,4,,PL,DE L EGLISE,91780,MEROBERT,,,91393,,,,,,,,,,,,,,,,,,,2016-09-30,F,,,,,43.22A,NAFRev2,O,2.004674,48.416511,0.83,housenumber,4 Place de l’Eglise 91780 Mérobert,91393_0018_00004,G,4 PLACE DE L EGLISE,
444146997,00010,44414699700010,O,1963-07-27,NN,,,2013-06-20T04:28:06,true,3,,2,,IMP,DE LA MARE,91780,MEROBERT,,,91393,,,,,,,,,,,,,,,,,,,2008-01-01,A,,,,,68.20B,NAFRev2,N,2.003334,48.4163,0.83,housenumber,2 Impasse de la Mare 91780 Mérobert,91393_0065_00002,G,2 IMPASSE DE LA MARE,
444639355,00023,44463935500023,O,2008-11-15,01,2020,3320BZ,2022-08-29T09:20:44,true,1,,8,,PL,DE L EGLISE,91780,MEROBERT,,,91393,,,,,,,,,,,,,,,,,,,2008-11-15,A,,,,,33.12Z,NAFRev2,O,2.00479,48.416874,0.83,housenumber,8 Place de l’Eglise 91780 Mérobert,91393_0018_00008,G,8 PLACE DE L EGLISE,
445212186,00016,44521218600016,O,2003-03-01,NN,,,2022-01-28T03:38:25,true,4,,2,,PL,DE L'EGLISE,91780,MEROBERT,,,91393,,,,,,,,,,,,,,,,,,,2021-10-26,F,,,,,68.20B,NAFRev2,N,2.004636,48.41627,0.83,housenumber,2 Place de l’Eglise 91780 Mérobert,91393_0018_00002,G,2 PLACE DE L EGLISE,
448756320,00025,44875632000025,O,2005-05-01,,,,2009-06-27T10:53:49,false,2,,45,,,GRANDE RUE,91780,MEROBERT,,,91393,,,,,,,,,,,,,,,,,,,2007-07-01,F,,,,,45.2V,NAFRev1,O,2.004146,48.41627,0.95,housenumber,45 Grande Rue 91780 Mérobert,91393_0020_00045,G,45 GRANDE RUE,
449945567,00013,44994556700013,O,2003-10-06,NN,,,2008-11-08T02:29:07,false,4,,21,,RUE,DE LA GARENNE,91780,MEROBERT,,,91393,,,,,,,,,,,,,,,,,,,2004-12-25,F,ENT DE MACEDO JORGE,,,,45.3E,NAFRev1,O,2.002651,48.413953,0.95,housenumber,21 Rue de la Garenne 91780 Mérobert,91393_0021_00021,G,21 RUE DE LA GARENNE,
450203815,00011,45020381500011,O,2003-06-02,NN,,,2008-01-05T21:29:12,true,3,HAMEAU D'AUBRAY,7,,,GRANDE RUE,91780,MEROBERT,,,91393,,,,,,,,,,,,,,,,,,,2008-01-01,A,,,,,68.20B,NAFRev2,N,2.009678,48.415291,0.95,housenumber,7 Grande Rue 91780 Mérobert,91393_0020_00007,G,7 GRANDE RUE,
452029804,00021,45202980400021,O,2015-09-10,,,,2021-02-23T13:35:42,true,1,,21,,,GRANDE RUE,91780,MEROBERT,,,91393,,,,,,,,,,,,,,,,,,,2015-09-10,A,,,,,47.78C,NAFRev2,N,2.006888,48.415705,0.95,housenumber,21 Grande Rue 91780 Mérobert,91393_0020_00021,G,21 GRANDE RUE,
453521593,00013,45352159300013,O,2004-05-01,NN,,,2006-11-25T19:14:11,true,3,,2,,,TRAVESIERE,91780,MEROBERT,,,91393,,,,,,,,,,,,,,,,,,,2004-12-25,F,,,,,52.5Z,NAFRev1,N,,,0,,,,,,
477905814,00034,47790581400034,O,2016-08-09,,,,2021-02-18T10:30:05,true,3,,9,,RUE,GRANDE RUE,91780,MEROBERT,,,91393,,,,,,,,,,,,,,,,,,,2021-02-01,A,,,,,46.19B,NAFRev2,N,2.009167,48.415401,0.83,housenumber,9 Grande Rue 91780 Mérobert,91393_0020_00009,G,9 GRANDE RUE,