siren,nic,siret,statutDiffusionEtablissement,dateCreationEtablissement,trancheEffectifsEtablissement,anneeEffectifsEtablissement,activitePrincipaleRegistreMetiersEtablissement,dateDernierTraitementEtablissement,etablissementSiege,nombrePeriodesEtablissement,complementAdresseEtablissement,numeroVoieEtablissement,indiceRepetitionEtablissement,typeVoieEtablissement,libelleVoieEtablissement,codePostalEtablissement,libelleCommuneEtablissement,libelleCommuneEtrangerEtablissement,distributionSpecialeEtablissement,codeCommuneEtablissement,codeCedexEtablissement,libelleCedexEtablissement,codePaysEtrangerEtablissement,libellePaysEtrangerEtablissement,complementAdresse2Etablissement,numeroVoie2Etablissement,indiceRepetition2Etablissement,typeVoie2Etablissement,libelleVoie2Etablissement,codePostal2Etablissement,libelleCommune2Etablissement,libelleCommuneEtranger2Etablissement,distributionSpeciale2Etablissement,codeCommune2Etablissement,codeCedex2Etablissement,libelleCedex2Etablissement,codePaysEtranger2Etablissement,libellePaysEtranger2Etablissement,dateDebut,etatAdministratifEtablissement,enseigne1Etablissement,enseigne2Etablissement,enseigne3Etablissement,denominationUsuelleEtablissement,activitePrincipaleEtablissement,nomenclatureActivitePrincipaleEtablissement,caractereEmployeurEtablissement,longitude,latitude,geo_score,geo_type,geo_adresse,geo_id,geo_ligne,geo_l4,geo_l5
095850723,00073,09585072300073,O,2011-12-21,00,2019,,2021-10-27T08:03:28,false,2,,320,,RUE,DES GRANDS PRES,02200,BILLY-SUR-AISNE,,,02089,,,,,,,,,,,,,,,,,,,2019-04-30,F,,,,,46.61Z,NAFRev2,O,3.352451,49.369849,0.95,housenumber,320 Rue des Grands Pres 02200 Billy-sur-Aisne,02089_0076_00320,G,320 RUE DES GRANDS PRES,
210200879,00018,21020087900018,O,1983-03-01,11,2020,,2022-08-29T09:05:39,true,4,,31,,RUE,DE LA PAIX,02200,BILLY-SUR-AISNE,,,02089,,,,,,,,,,,,,,,,,,,2008-01-01,A,MAIRIE,,,,84.11Z,NAFRev2,O,3.384371,49.356582,0.95,housenumber,31 Rue de la Paix 02200 Billy-sur-Aisne,02089_0110_00031,G,31 RUE DE LA PAIX,
210200879,00026,21020087900026,O,1983-12-21,02,2020,,2022-08-29T09:05:39,false,3,,22,,PL,DE LA MAIRIE,02200,BILLY-SUR-AISNE,,,02089,,,,,,,,,,,,,,,,,,,2008-01-01,A,ECOLE PRIMAIRE PUBLIQUE HEROU PASTEUR,,,,85.20Z,NAFRev2,N,3.384116,49.356077,0.85,housenumber,22 Place de la Mairie 02200 Billy-sur-Aisne,02089_0085_00022,G,22 PLACE DE LA MAIRIE,
250202025,00020,25020202500020,O,2007-03-27,NN,,,2019-11-14T14:00:12,true,4,MAIRIE,31,,RUE,DE LA PAIX,02200,BILLY-SUR-AISNE,,,02089,,,,,,,,,,,,,,,,,,,2017-01-01,F,,,,,36.00Z,NAFRev2,O,3.384371,49.356582,0.95,housenumber,31 Rue de la Paix 02200 Billy-sur-Aisne,02089_0110_00031,G,31 RUE DE LA PAIX,
260200894,00012,26020089400012,O,1983-03-01,NN,,,2020-11-06T11:56:04,true,4,MAIRIE,31,,RUE,DE LA PAIX,02200,BILLY-SUR-AISNE,,,02089,,,,,,,,,,,,,,,,,,,2020-01-01,F,CCAS,,,,88.99B,NAFRev2,N,3.384371,49.356582,0.95,housenumber,31 Rue de la Paix 02200 Billy-sur-Aisne,02089_0110_00031,G,31 RUE DE LA PAIX,
300866068,00012,30086606800012,O,,,,,2019-11-14T14:00:12,true,1,,99,,RUE,DE LA LIBERATION,02200,BILLY-SUR-AISNE,,,02089,,,,,,,,,,,,,,,,,,,1984-12-25,F,,,,,55.71,NAP,N,3.383678,49.355489,0.84,housenumber,99 Route de la Libération 02200 Billy-sur-Aisne,02089_0080_00099,G,99 ROUTE DE LA LIBERATION,
301773693,00017,30177369300017,O,1975-01-01,11,2020,,2022-08-29T09:11:23,true,5,ZONE INDUSTRIELLE,132,,RTE,DE REIMS,02200,BILLY-SUR-AISNE,,,02089,,,,,,,,,,,,,,,,,,,2015-12-31,A,,,,,43.22B,NAFRev2,O,3.35271,49.370999,0.85,housenumber,132 Route de Reims 02200 Billy-sur-Aisne,02089_0125_00132,G,132 ROUTE DE REIMS,
302642269,00013,30264226900013,O,,,,,2019-11-14T14:00:12,true,1,,,,,,02200,BILLY-SUR-AISNE,,,02089,,,,,,,,,,,,,,,,,,,1984-12-25,F,,,,,02.20,NAP,N,,,0,,,,,,
302726252,00018,30272625200018,O,,,,,2019-11-14T14:00:12,true,1,,,,RUE,LA GORGE,02200,BILLY-SUR-AISNE,,,02089,,,,,,,,,,,,,,,,,,,1998-03-01,F,,,,,01.1C,NAF1993,N,3.380896,49.353291,0.94,street,Rue de la Gorge 02200 Billy-sur-Aisne,02089_0070,G,RUE DE LA GORGE,
302726278,00013,30272627800013,O,,,,,2019-11-14T14:00:12,true,1,,,,,,02200,BILLY-SUR-AISNE,,,02089,,,,,,,,,,,,,,,,,,,1988-12-25,F,,,,,01.10,NAP,N,,,0,,,,,,
302908983,00075,30290898300075,O,2020-07-01,11,2020,,2022-08-29T09:11:39,false,1,,161,,RUE,DES GRANDS PRES,02200,BILLY-SUR-AISNE,,,02089,,,,,,,,,,,,,,,,,,,2020-07-01,A,,,,,85.59B,NAFRev2,O,3.352495,49.369513,0.95,housenumber,161 Rue des Grands Pres 02200 Billy-sur-Aisne,02089_0076_00161,G,161 RUE DES GRANDS PRES,
303846604,00021,30384660400021,O,2019-09-23,12,2020,,2022-08-29T09:11:52,true,1,,320,,RUE,DES GRANDS PRES,02200,BILLY-SUR-AISNE,,,02089,,,,,,,,,,,,,,,,,,,2019-09-23,A,,,,,49.41B,NAFRev2,O,3.352451,49.369849,0.95,housenumber,320 Rue des Grands Pres 02200 Billy-sur-Aisne,02089_0076_00320,G,320 RUE DES GRANDS PRES,
304180573,00012,30418057300012,O,,NN,,,2019-11-14T14:00:12,true,1,,176,,RUE,DE BONNEVAL,02200,BILLY-SUR-AISNE,,,02089,,,,,,,,,,,,,,,,,,,1987-12-31,F,,,,,64.46,NAP,N,3.382362,49.355056,0.91,housenumber,176 Rue de Bonnevalle 02200 Billy-sur-Aisne,02089_0025_00176,G,176 RUE DE BONNEVALLE,
304250103,00013,30425010300013,O,1975-01-01,NN,,,2019-11-14T14:00:12,true,4,,362,,RUE,DU CHATEAU,02200,BILLY-SUR-AISNE,,,02089,,,,,,,,,,,,,,,,,,,1999-12-25,F,,,,,45.2J,NAF1993,N,3.385326,49.353323,0.95,housenumber,362 Rue du Château 02200 Billy-sur-Aisne,02089_0045_00362,G,362 RUE DU CHATEAU,
304915341,00016,30491534100016,O,,NN,,,2019-11-14T14:00:12,true,1,,,,RTE,DE REIMS,02200,BILLY-SUR-AISNE,,,02089,,,,,,,,,,,,,,,,,,,1989-03-15,F,,,,,72.01,NAP,N,3.369249,49.367066,0.81,street,Route de Reims 02200 Billy-sur-Aisne,02089_0125,G,ROUTE DE REIMS,
305378903,00010,30537890300010,O,1989-07-01,NN,,,2019-11-14T14:00:12,true,4,,126,,RTE,DE REIMS,02200,BILLY-SUR-AISNE,,,02089,,,,,,,,,,,,,,,,,,,2003-06-30,F,,,,,70.2C,NAFRev1,N,3.35153,49.371238,0.85,housenumber,126 Route de Reims 02200 Billy-sur-Aisne,02089_0125_00126,G,126 ROUTE DE REIMS,
305999112,00025,30599911200025,O,1988-02-03,NN,,,2019-11-14T14:00:12,false,4,,355,,RUE,DE LA BOULLOIRE,02200,BILLY-SUR-AISNE,,,02089,,,,,,,,,,,,,,,,,,,2000-01-01,F,,,,,45.3A,NAF1993,O,3.383233,49.358999,0.95,housenumber,355 Rue de la Boulloire 02200 Billy-sur-Aisne,02089_0030_00355,G,355 RUE DE LA BOULLOIRE,
306134164,00046,30613416400046,O,2003-01-01,NN,,,2019-11-14T14:00:12,false,5,,126,,RTE,DE REIMS,02200,BILLY-SUR-AISNE,,,02089,,,,,,,,,,,,,,,,,,,2008-06-30,F,,,,,47.64Z,NAFRev2,N,3.35153,49.371238,0.85,housenumber,126 Route de Reims 02200 Billy-sur-Aisne,02089_0125_00126,G,126 ROUTE DE REIMS,
306248840,00010,30624884000010,O,1900-01-01,,,,2019-11-14T14:00:12,false,4,,99,,RUE,DE LA LIBERATION,02200,BILLY-SUR-AISNE,,,02089,,,,,,,,,,,,,,,,,,,1993-01-01,F,,,,,45.4D,NAF1993,N,3.383678,49.355489,0.84,housenumber,99 Route de la Libération 02200 Billy-sur-Aisne,02089_0080_00099,G,99 ROUTE DE LA LIBERATION,
306248873,00011,30624887300011,O,1900-01-01,NN,,,2019-11-14T14:00:12,false,4,,99,,RUE,DE LA LIBERATION,02200,BILLY-SUR-AISNE,,,02089,,,,,,,,,,,,,,,,,,,1993-01-01,F,,,,,45.4D,NAF1993,N,3.383678,49.355489,0.84,housenumber,99 Route de la Libération 02200 Billy-sur-Aisne,02089_0080_00099,G,99 ROUTE DE LA LIBERATION,
306856436,00036,30685643600036,O,1984-10-24,NN,,,2019-11-14T14:00:12,false,5,,657,,RUE,DU BOIS DE L EGLISE,02200,BILLY-SUR-AISNE,,,02089,,,,,,,,,,,,,,,,,,,2001-05-17,F,GARAGE DU BOIS DE L'EGLISE,,,,50.2Z,NAF1993,N,3.3761,49.364893,0.95,housenumber,657 Rue du Bois de l’Église 02200 Billy-sur-Aisne,02089_0020_00657,G,657 RUE DU BOIS DE L EGLISE,
307171538,00027,30717153800027,O,,,,,2019-11-14T14:00:12,true,1,,15,,PL,DE LA MAIRIE,02200,BILLY-SUR-AISNE,,,02089,,,,,,,,,,,,,,,,,,,1989-07-20,F,,,,,38.40,NAP,N,3.383741,49.356294,0.85,housenumber,15 Place de la Mairie 02200 Billy-sur-Aisne,02089_0085_00015,G,15 PLACE DE LA MAIRIE,
310097712,00015,31009771200015,O,1977-01-01,NN,,,2019-11-14T14:00:12,true,1,,135,,RUE,DES MONTIERS,02200,BILLY-SUR-AISNE,,,02089,,,,,,,,,,,,,,,,,,,1999-06-30,F,,,,,45.4A,NAF1993,N,3.386623,49.357246,0.95,housenumber,135 Rue des Montiers 02200 Billy-sur-Aisne,02089_0100_00135,G,135 RUE DES MONTIERS,
310429105,00029,31042910500029,O,1977-06-01,NN,,,2019-11-14T14:00:12,true,6,,319,,RUE,VOISIN,02200,BILLY-SUR-AISNE,,,02089,,,,,,,,,,,,,,,,,,,2006-03-15,F,,,,,45.4J,NAFRev1,O,3.390172,49.3553,0.94,housenumber,319 Rue de Voisin 02200 Billy-sur-Aisne,02089_0140_00319,G,319 RUE DE VOISIN,
310701412,00010,31070141200010,O,,,,,2019-11-14T14:00:12,true,1,,176,,RUE,DE BONNEVAL,02200,BILLY-SUR-AISNE,,,02089,,,,,,,,,,,,,,,,,,,,F,,,,,69.11,NAP,N,3.382362,49.355056,0.91,housenumber,176 Rue de Bonnevalle 02200 Billy-sur-Aisne,02089_0025_00176,G,176 RUE DE BONNEVALLE,
310810247,00018,31081024700018,O,,NN,,,2019-11-14T14:00:12,true,1,,126,,RTE,DE REIMS,02200,BILLY-SUR-AISNE,,,02089,,,,,,,,,,,,,,,,,,,,F,,,,,55.13,NAP,N,3.35153,49.371238,0.85,housenumber,126 Route de Reims 02200 Billy-sur-Aisne,02089_0125_00126,G,126 ROUTE DE REIMS,
311110852,00010,31111085200010,O,1977-01-01,NN,,,2019-11-14T14:00:12,true,5,,126,,RTE,DE REIMS,02200,BILLY-SUR-AISNE,,,02089,,,,,,,,,,,,,,,,,,,2012-03-30,F,,,,,46.62Z,NAFRev2,N,3.35153,49.371238,0.85,housenumber,126 Route de Reims 02200 Billy-sur-Aisne,02089_0125_00126,G,126 ROUTE DE REIMS,
316162395,00024,31616239500024,O,,NN,,,2019-11-14T14:00:12,true,1,,349,,RUE,BELIER,02200,BILLY-SUR-AISNE,,,02089,,,,,,,,,,,,,,,,,,,1990-09-01,F,,,,,77.09,NAP,N,3.384176,49.35813,0.88,housenumber,349 Rue du Bélier 02200 Billy-sur-Aisne,02089_0010_00349,G,349 RUE DU BELIER,
316279173,00025,31627917300025,O,1998-12-01,NN,,,2019-11-14T14:00:12,false,4,,10,,RES,LES AUCHES,02200,BILLY-SUR-AISNE,,,02089,,,,,,,,,,,,,,,,,,,2008-08-15,F,,,,,43.33Z,NAFRev2,N,3.381722,49.358404,0.88,housenumber,10 Residence les Auches 02200 Billy-sur-Aisne,02089_a005_00010,G,10 RESIDENCE LES AUCHES,
316279173,00033,31627917300033,O,2008-08-15,,,4333ZZ,2019-11-14T14:00:12,false,2,,137,,RUE,DU BAIS DE L EGLISE,02200,BILLY-SUR-AISNE,,,02089,,,,,,,,,,,,,,,,,,,2017-08-16,F,,,,,43.33Z,NAFRev2,N,3.380499,49.361014,0.87,housenumber,137 Rue du Bois de l’Église 02200 Billy-sur-Aisne,02089_0020_00137,G,137 RUE DU BOIS DE L EGLISE,
316279173,00041,31627917300041,O,2017-08-16,,,4333ZZ,2021-07-02T08:33:53,true,2,,103,,RUE,DU BOIS DE L'EGLISE,02200,BILLY-SUR-AISNE,,,02089,,,,,,,,,,,,,,,,,,,2021-03-29,F,,,,,43.33Z,NAFRev2,N,3.380569,49.360718,0.95,housenumber,103 Rue du Bois de l’Église 02200 Billy-sur-Aisne,02089_0020_00103,G,103 RUE DU BOIS DE L EGLISE,
316762764,00025,31676276400025,O,1999-06-19,NN,,,2019-11-14T14:00:12,true,4,,8,,RES,DES GLAIEULS,02200,BILLY-SUR-AISNE,,,02089,,,,,,,,,,,,,,,,,,,2011-12-31,F,,,,,86.21Z,NAFRev2,N,3.380779,49.359259,0.79,housenumber,8 Residence les Glaieuls 02200 Billy-sur-Aisne,02089_a030_00008,G,8 RESIDENCE LES GLAIEULS,
317008639,00013,31700863900013,O,1979-01-01,,,,2019-11-14T14:00:12,true,4,,126,,RTE,DE REIMS,02200,BILLY-SUR-AISNE,,BP 4,02089,02202,SOISSONS CEDEX,,,,,,,,,,,,,,,,,2003-12-25,F,,,,,29.5B,NAFRev1,N,3.35153,49.371238,0.85,housenumber,126 Route de Reims 02200 Billy-sur-Aisne,02089_0125_00126,G,126 ROUTE DE REIMS,
318365178,00017,31836517800017,O,1980-01-01,NN,,,2019-11-14T14:00:12,false,5,,,,,FERME DE LA CHAUMIERE,02200,BILLY-SUR-AISNE,,,02089,,,,,,,,,,,,,,,,,,,2017-03-11,F,,,,,68.20B,NAFRev2,N,4.449039,48.7602461,0.74,poi.farmyard,Ferme de la Noue de Chaudière (Corps de ferme) Pringy,https://osm.org/way/190600199,G,,
321882722,00093,32188272200093,O,1995-08-01,NN,,,2019-11-14T14:00:12,false,3,,120,,RTE,DE REIMS,02200,BILLY-SUR-AISNE,,,02089,,,,,,,,,,,,,,,,,,,2005-01-01,F,BIGMAT PILLAUD,,,,51.5F,NAFRev1,O,3.350706,49.371441,0.85,housenumber,120 Route de Reims 02200 Billy-sur-Aisne,02089_0125_00120,G,120 ROUTE DE REIMS,
321882722,00143,32188272200143,O,2005-01-01,11,2020,,2022-08-29T09:17:17,false,6,,340,,RUE,DES GRANDS PRES,02200,BILLY-SUR-AISNE,,,02089,,,,,,,,,,,,,,,,,,,2021-11-09,F,PILLAUD MATERIAUX,,,PILLAUD MATERIAUX,46.73A,NAFRev2,O,3.353062,49.370674,0.95,housenumber,340 Rue des Grands Pres 02200 Billy-sur-Aisne,02089_0076_00340,G,340 RUE DES GRANDS PRES,
322165184,00019,32216518400019,O,1981-07-01,NN,,,2019-11-14T14:00:12,true,5,LIEU DIT LE COLOMBIER,643,,RTE,DE REIMS,02200,BILLY-SUR-AISNE,,,02089,,,,,,,,,,,,,,,,,,,2008-05-31,F,,,,,96.02A,NAFRev2,N,3.381447,49.364437,0.85,housenumber,643 Route de Reims 02200 Billy-sur-Aisne,02089_0125_00643,G,643 ROUTE DE REIMS,
322830142,00012,32283014200012,O,,NN,,,2019-11-14T14:00:12,true,1,,,,PL,DE L EGLISE,02200,BILLY-SUR-AISNE,,,02089,,,,,,,,,,,,,,,,,,,1995-01-26,F,,,,,85.1C,NAF1993,N,3.38514,49.355953,0.83,street,Place de l’Eglise 02200 Billy-sur-Aisne,02089_0060,G,PLACE DE L EGLISE,
322830357,00024,32283035700024,O,1996-04-18,NN,,,2019-11-14T14:00:12,true,5,,111,,PL,DE L EGLISE,02200,BILLY-SUR-AISNE,,,02089,,,,,,,,,,,,,,,,,,,2016-06-01,A,,,,,86.90F,NAFRev2,N,3.385272,49.355801,0.85,housenumber,111 Place de l’Eglise 02200 Billy-sur-Aisne,02089_0060_00111,G,111 PLACE DE L EGLISE,
323859413,00011,32385941300011,O,,,,,2019-11-14T14:00:12,true,1,,150,,RUE,DE LA CROIX LAHORS,02200,BILLY-SUR-AISNE,,,02089,,,,,,,,,,,,,,,,,,,1985-12-25,F,,,,,55.73,NAP,N,3.379977,49.359775,0.95,housenumber,150 Rue de la Croix Lahors 02200 Billy-sur-Aisne,02089_0050_00150,G,150 RUE DE LA CROIX LAHORS,
325141562,00018,32514156200018,O,,NN,,,2019-11-14T14:00:12,true,1,,60,,PL,DE L EGLISE,02200,BILLY-SUR-AISNE,,,02089,,,,,,,,,,,,,,,,,,,1987-02-15,F,,,,,67.01,NAP,N,3.384904,49.355955,0.85,housenumber,60 Place de l’Eglise 02200 Billy-sur-Aisne,02089_0060_00060,G,60 PLACE DE L EGLISE,
329222269,00014,32922226900014,O,1983-10-12,NN,,,2019-11-14T14:00:12,false,4,,111,,PL,DE L EGLISE,02200,BILLY-SUR-AISNE,,,02089,,,,,,,,,,,,,,,,,,,1997-12-25,F,,,,,85.1C,NAF1993,N,3.385272,49.355801,0.85,housenumber,111 Place de l’Eglise 02200 Billy-sur-Aisne,02089_0060_00111,G,111 PLACE DE L EGLISE,
329222269,00022,32922226900022,O,1996-08-30,NN,,,2019-11-14T14:00:12,true,4,,,,RES,LES GLAIEULS,02200,BILLY-SUR-AISNE,,,02089,,,,,,,,,,,,,,,,,,,2008-01-01,A,,,,,86.21Z,NAFRev2,N,3.380788,49.359685,0.88,street,Residence les Glaieuls 02200 Billy-sur-Aisne,02089_A030,G,RESIDENCE LES GLAIEULS,
329314843,00015,32931484300015,O,2003-07-01,NN,,,2019-11-14T14:00:12,false,5,,30,,PL,DE L EGLISE,02200,BILLY-SUR-AISNE,,,02089,,,,,,,,,,,,,,,,,,,2011-03-31,F,,,,,47.91A,NAFRev2,N,3.384557,49.356101,0.85,housenumber,30 Place de l’Eglise 02200 Billy-sur-Aisne,02089_0060_00030,G,30 PLACE DE L EGLISE,
329371959,00019,32937195900019,O,,,,,2019-11-14T14:00:12,true,1,,552,,RUE,DE LA BOUILLOIRE,02200,BILLY-SUR-AISNE,,,02089,,,,,,,,,,,,,,,,,,,1985-12-25,F,,,,,64.11,NAP,N,3.381138,49.360154,0.87,housenumber,552 Rue de la Boulloire 02200 Billy-sur-Aisne,02089_0030_00552,G,552 RUE DE LA BOULLOIRE,
329901177,00017,32990117700017,O,1984-07-01,NN,,,2019-11-14T14:00:12,true,4,,,,LD,LA GORGE,02200,BILLY-SUR-AISNE,,,02089,,,,,,,,,,,,,,,,,,,1998-12-25,F,,,,,01.1C,NAF1993,O,3.380896,49.353291,0.93,street,Rue de la Gorge 02200 Billy-sur-Aisne,02089_0070,G,RUE DE LA GORGE,
330200098,00029,33020009800029,O,1997-10-24,NN,,,2019-11-14T14:00:12,false,3,,,,LD,LE CLOS PHILIPPE,02200,BILLY-SUR-AISNE,,,02089,,,,,,,,,,,,,,,,,,,2008-01-01,F,CTRE D OCCASION DU SOISSONNAIS COS,,,,45.11Z,NAFRev2,N,,,0,,,,,,
330825670,00020,33082567000020,O,1998-02-05,,,,2019-11-14T14:00:12,true,1,,,,,LA GORGE,02200,BILLY-SUR-AISNE,,,02089,,,,,,,,,,,,,,,,,,,1998-03-10,F,,,,,01.1C,NAF1993,N,3.380896,49.353291,0.93,street,Rue de la Gorge 02200 Billy-sur-Aisne,02089_0070,G,RUE DE LA GORGE,
330894197,00020,33089419700020,O,,NN,,,2021-09-02T09:21:24,true,1,,126,,RTE,DE REIMS,02200,BILLY-SUR-AISNE,,,02089,,,,,,,,,,,,,,,,,,,1989-01-25,F,,,,,77.01,NAP,N,3.35153,49.371238,0.85,housenumber,126 Route de Reims 02200 Billy-sur-Aisne,02089_0125_00126,G,126 ROUTE DE REIMS,
331017046,00011,33101704600011,O,,NN,,,2019-11-14T14:00:12,true,1,,,,,FERME DE LA CHAUMIERE,02200,BILLY-SUR-AISNE,,,02089,,,,,,,,,,,,,,,,,,,1986-12-25,F,,,,,01.1A,NAF1993,N,4.449039,48.7602461,0.74,poi.farmyard,Ferme de la Noue de Chaudière (Corps de ferme) Pringy,https://osm.org/way/190600199,G,,
331634998,00016,33163499800016,O,,NN,,,2019-11-14T14:00:12,true,1,,261,,RUE,DE VOISIN,02200,BILLY-SUR-AISNE,,,02089,,,,,,,,,,,,,,,,,,,,F,,,,,66.02,NAP,N,3.389249,49.355208,0.95,housenumber,261 Rue de Voisin 02200 Billy-sur-Aisne,02089_0140_00261,G,261 RUE DE VOISIN,
332171487,00017,33217148700017,O,,NN,,,2019-11-14T14:00:12,true,1,,,,RTE,DE REIMS,02200,BILLY-SUR-AISNE,,,02089,,,,,,,,,,,,,,,,,,,1993-11-30,F,,,,,50.3A,NAF1993,N,3.369249,49.367066,0.81,street,Route de Reims 02200 Billy-sur-Aisne,02089_0125,G,ROUTE DE REIMS,
332226851,00043,33222685100043,O,1998-09-29,NN,,,2019-11-14T14:00:12,true,3,,112,,RTE,DE REIMS,02200,BILLY-SUR-AISNE,,,02089,,,,,,,,,,,,,,,,,,,2008-01-01,A,,,,,68.20B,NAFRev2,N,3.34839,49.372015,0.85,housenumber,112 Route de Reims 02200 Billy-sur-Aisne,02089_0125_00112,G,112 ROUTE DE REIMS,
333450419,00010,33345041900010,O,,NN,,,2019-11-14T14:00:12,true,1,,471,,RUE,DE LA MONTAGNE,02200,BILLY-SUR-AISNE,,,02089,,,,,,,,,,,,,,,,,,,1993-11-12,F,,,,,45.3F,NAF1993,O,3.384755,49.349883,0.95,housenumber,471 Rue de la Montagne 02200 Billy-sur-Aisne,02089_0095_00471,G,471 RUE DE LA MONTAGNE,
333533925,00017,33353392500017,O,1985-09-01,22,2020,,2022-08-29T09:23:15,true,5,,,,,,02200,BILLY-SUR-AISNE,,,02089,,,,,,,,,,,,,,,,,,,2008-12-31,A,,,,,01.13Z,NAFRev2,O,,,0,,,,,,
334364650,00021,33436465000021,O,1998-03-18,NN,,,2019-12-17T04:08:04,true,3,MR TONAPLAN PIERRE,190,,RUE,DU BELIER,02200,BILLY-SUR-AISNE,,,02089,,,,,,,,,,,,,,,,,,,2008-01-01,A,,,,,68.20B,NAFRev2,N,3.385452,49.359333,0.95,housenumber,190 Rue du Bélier 02200 Billy-sur-Aisne,02089_0010_00190,G,190 RUE DU BELIER,
335580155,00026,33558015500026,O,2002-07-10,NN,,,2019-11-14T14:00:12,false,5,ZI RTE DE REIMS,320,,RUE,DES GRANDS PRES,02200,BILLY-SUR-AISNE,,,02089,,,,,,,,,,,,,,,,,,,2011-10-31,F,,,,,46.61Z,NAFRev2,O,3.352451,49.369849,0.95,housenumber,320 Rue des Grands Pres 02200 Billy-sur-Aisne,02089_0076_00320,G,320 RUE DES GRANDS PRES,
337968556,00015,33796855600015,O,,,,,2019-11-14T14:00:12,true,1,,5,,RUE,DES GRANDS JARDINS,02200,BILLY-SUR-AISNE,,,02089,,,,,,,,,,,,,,,,,,,1990-12-31,F,,,,,60.2L,NAF1993,N,3.386622,49.361158,0.95,housenumber,5 Rue des Grands Jardins 02200 Billy-sur-Aisne,02089_0075_00005,G,5 RUE DES GRANDS JARDINS,
339381055,00013,33938105500013,O,1986-10-20,NN,,,2020-06-08T14:00:59,true,5,,108,,RTE,DE REIMS,02200,BILLY-SUR-AISNE,,BP 40,02089,02202,SOISSONS CEDEX,,,,,,,,,,,,,,,,,2010-02-18,F,,,,,24.20Z,NAFRev2,O,3.347721,49.372171,0.85,housenumber,108 Route de Reims 02200 Billy-sur-Aisne,02089_0125_00108,G,108 ROUTE DE REIMS,
340157494,00014,34015749400014,O,,NN,,,2019-11-14T14:00:12,true,1,,61,,PL,DE L EGLISE,02200,BILLY-SUR-AISNE,,,02089,,,,,,,,,,,,,,,,,,,1992-12-31,F,,,,,15.1F,NAF1993,N,3.384777,49.35591,0.85,housenumber,61 Place de l’Eglise 02200 Billy-sur-Aisne,02089_0060_00061,G,61 PLACE DE L EGLISE,
340760651,00018,34076065100018,O,1987-02-02,NN,,,2019-11-14T14:00:12,true,4,,,,RTE,DE REIMS Z I,02200,BILLY-SUR-AISNE,,,02089,,,,,,,,,,,,,,,,,,,1991-03-06,F,,,,,55.60,NAP,N,,,0,,,,,,
341277515,00019,34127751500019,O,,NN,,,2019-11-14T14:00:12,true,1,,60,,PL,DE L EGLISE,02200,BILLY-SUR-AISNE,,,02089,,,,,,,,,,,,,,,,,,,1993-09-30,F,,,,,55.3A,NAF1993,N,3.384904,49.355955,0.85,housenumber,60 Place de l’Eglise 02200 Billy-sur-Aisne,02089_0060_00060,G,60 PLACE DE L EGLISE,
341445179,00011,34144517900011,O,,NN,,,2019-11-14T14:00:12,true,1,,20,,RUE,BONNEVALLE,02200,BILLY-SUR-AISNE,,,02089,,,,,,,,,,,,,,,,,,,1987-05-19,F,,,,,86.07,NAP,N,3.382612,49.354192,0.95,housenumber,20 Rue de Bonnevalle 02200 Billy-sur-Aisne,02089_0025_00020,G,20 RUE DE BONNEVALLE,
341627552,00019,34162755200019,O,1980-02-04,NN,,,2019-11-14T14:00:12,true,1,,126,,RTE,DE REIMS,02200,BILLY-SUR-AISNE,,,02089,,,,,,,,,,,,,,,,,,,2002-08-03,F,,,,,70.2C,NAF1993,N,3.35153,49.371238,0.85,housenumber,126 Route de Reims 02200 Billy-sur-Aisne,02089_0125_00126,G,126 ROUTE DE REIMS,
342400884,00033,34240088400033,O,1997-01-01,NN,,,2019-11-14T14:00:12,false,5,ESPACE FORMATION AFIDA,,,RUE,DES GRANDS PRES,02200,BILLY-SUR-AISNE,,,02089,,,,,,,,,,,,,,,,,,,2008-12-31,F,,,,,85.32Z,NAFRev2,O,3.352462,49.369669,0.95,street,Rue des Grands Pres 02200 Billy-sur-Aisne,02089_0076,G,RUE DES GRANDS PRES,
342614914,00014,34261491400014,O,,NN,,,2019-11-14T14:00:12,true,1,,387,,RUE,DE LA LIBERATION,02200,BILLY-SUR-AISNE,,,02089,,,,,,,,,,,,,,,,,,,1989-06-29,F,,,,,80.04,NAP,N,3.383387,49.353105,0.85,housenumber,387 Route de la Libération 02200 Billy-sur-Aisne,02089_0080_00387,G,387 ROUTE DE LA LIBERATION,
343192589,00046,34319258900046,O,2006-11-30,,,,2019-11-14T14:00:12,true,2,ROUTE DE REIMS,,,,ZONE INDUSTRIELLE,02200,BILLY-SUR-AISNE,,,02089,,,,,,,,,,,,,,,,,,,2007-03-29,F,,,,,70.2C,NAFRev1,N,5.0269111,45.7705982,0.92,poi.industrial,Zone Industrielle Meyzieu,https://osm.org/way/117589602,G,,
343360947,00018,34336094700018,O,1988-01-04,NN,,,2019-11-14T14:00:12,true,4,,342,,RUE,DU BOIS DE L EGLISE,02200,BILLY-SUR-AISNE,,,02089,,,,,,,,,,,,,,,,,,,2014-09-30,F,,,,,49.41B,NAFRev2,N,3.379114,49.362936,0.95,housenumber,342 Rue du Bois de l’Église 02200 Billy-sur-Aisne,02089_0020_00342,G,342 RUE DU BOIS DE L EGLISE,
345135131,00166,34513513100166,O,2017-11-07,11,2020,,2022-08-29T09:29:36,false,1,,,,,ZONE INDUSTRIELLE,02200,BILLY-SUR-AISNE,,,02089,,,,,,,,,,,,,,,,,,,2017-11-07,A,AD POIDS LOURDS IDF SOISSONS,,,,45.31Z,NAFRev2,O,5.0269111,45.7705982,0.92,poi.industrial,Zone Industrielle Meyzieu,https://osm.org/way/117589602,G,,
348413436,00018,34841343600018,O,1988-10-17,NN,,,2019-11-14T14:00:12,true,5,,15,,RUE,DE LA GORGE,02200,BILLY-SUR-AISNE,,,02089,,,,,,,,,,,,,,,,,,,2008-01-01,F,,,,,02.20Z,NAFRev2,N,3.381877,49.354185,0.95,housenumber,15 Rue de la Gorge 02200 Billy-sur-Aisne,02089_0070_00015,G,15 RUE DE LA GORGE,
348413949,00010,34841394900010,O,1988-10-01,NN,,,2019-11-14T14:00:12,false,4,,356,,RUE,DE LA BOUILLOIRE,02200,BILLY-SUR-AISNE,,,02089,,,,,,,,,,,,,,,,,,,1997-01-01,F,,,,,51.3G,NAF1993,O,3.383301,49.359084,0.87,housenumber,356 Rue de la Boulloire 02200 Billy-sur-Aisne,02089_0030_00356,G,356 RUE DE LA BOULLOIRE,
348898164,00036,34889816400036,O,1990-06-17,NN,,,2019-11-14T14:00:12,false,4,,111,,PL,DE L EGLISE,02200,BILLY-SUR-AISNE,,,02089,,,,,,,,,,,,,,,,,,,2000-07-05,F,,,,,85.1C,NAF1993,N,3.385272,49.355801,0.85,housenumber,111 Place de l’Eglise 02200 Billy-sur-Aisne,02089_0060_00111,G,111 PLACE DE L EGLISE,
348898164,00044,34889816400044,O,2000-07-05,NN,,,2019-11-14T14:00:12,false,3,,8,,RES,LES GLAIEULS,02200,BILLY-SUR-AISNE,,,02089,,,,,,,,,,,,,,,,,,,2007-07-01,F,,,,,85.1C,NAFRev1,N,3.380779,49.359259,0.89,housenumber,8 Residence les Glaieuls 02200 Billy-sur-Aisne,02089_a030_00008,G,8 RESIDENCE LES GLAIEULS,
349031047,00013,34903104700013,O,1988-11-22,NN,,,2019-11-14T14:00:12,true,4,,108,,RTE,31 DE ROUEN A REIMS,02200,BILLY-SUR-AISNE,,,02089,,,,,,,,,,,,,,,,,,,2014-08-29,F,,,,,64.30Z,NAFRev2,N,3.347721,49.372171,0.58,housenumber,108 Route de Reims 02200 Billy-sur-Aisne,02089_0125_00108,G,108 ROUTE DE REIMS,
349185264,00034,34918526400034,O,1996-03-22,NN,,,2019-11-14T14:00:12,false,4,Z I,,,RTE,DE REIMS,02200,BILLY-SUR-AISNE,,,02089,,,,,,,,,,,,,,,,,,,2000-12-31,F,,,,,71.1Z,NAF1993,N,3.369249,49.367066,0.81,street,Route de Reims 02200 Billy-sur-Aisne,02089_0125,G,ROUTE DE REIMS,
349324749,00036,34932474900036,O,1989-05-19,NN,,,2019-11-14T14:00:12,true,4,,108,,RTE,DE REIMS,02200,BILLY-SUR-AISNE,,,02089,,,,,,,,,,,,,,,,,,,2002-12-25,F,,,,,28.3C,NAF1993,N,3.347721,49.372171,0.85,housenumber,108 Route de Reims 02200 Billy-sur-Aisne,02089_0125_00108,G,108 ROUTE DE REIMS,
349362426,00018,34936242600018,O,1988-11-22,NN,,,2019-11-14T14:00:12,true,3,,108,,RTE,31 DE ROUEN A REIMS,02200,BILLY-SUR-AISNE,,,02089,,,,,,,,,,,,,,,,,,,2008-01-01,A,,,,,64.30Z,NAFRev2,N,3.347721,49.372171,0.58,housenumber,108 Route de Reims 02200 Billy-sur-Aisne,02089_0125_00108,G,108 ROUTE DE REIMS,