siren,nic,siret,statutDiffusionEtablissement,dateCreationEtablissement,trancheEffectifsEtablissement,anneeEffectifsEtablissement,activitePrincipaleRegistreMetiersEtablissement,dateDernierTraitementEtablissement,etablissementSiege,nombrePeriodesEtablissement,complementAdresseEtablissement,numeroVoieEtablissement,indiceRepetitionEtablissement,typeVoieEtablissement,libelleVoieEtablissement,codePostalEtablissement,libelleCommuneEtablissement,libelleCommuneEtrangerEtablissement,distributionSpecialeEtablissement,codeCommuneEtablissement,codeCedexEtablissement,libelleCedexEtablissement,codePaysEtrangerEtablissement,libellePaysEtrangerEtablissement,complementAdresse2Etablissement,numeroVoie2Etablissement,indiceRepetition2Etablissement,typeVoie2Etablissement,libelleVoie2Etablissement,codePostal2Etablissement,libelleCommune2Etablissement,libelleCommuneEtranger2Etablissement,distributionSpeciale2Etablissement,codeCommune2Etablissement,codeCedex2Etablissement,libelleCedex2Etablissement,codePaysEtranger2Etablissement,libellePaysEtranger2Etablissement,dateDebut,etatAdministratifEtablissement,enseigne1Etablissement,enseigne2Etablissement,enseigne3Etablissement,denominationUsuelleEtablissement,activitePrincipaleEtablissement,nomenclatureActivitePrincipaleEtablissement,caractereEmployeurEtablissement,longitude,latitude,geo_score,geo_type,geo_adresse,geo_id,geo_ligne,geo_l4,geo_l5
211500988,00012,21150098800012,O,1983-03-01,01,2020,,2022-08-29T09:06:04,true,3,,,,,,15500,LAURIE,,,15098,,,,,,,,,,,,,,,,,,,2008-01-01,A,MAIRIE,,,,84.11Z,NAFRev2,N,,,0,,,,,,
211500988,00020,21150098800020,O,1995-12-25,NN,,,2008-01-04T18:26:37,false,2,MAIRIE,,,,,15500,LAURIE,,,15098,,,,,,,,,,,,,,,,,,,2008-01-01,A,SCE DE L'EAU,,,,36.00Z,NAFRev2,N,,,0,,,,,,
211500988,00038,21150098800038,O,2003-05-01,,,,2008-01-04T18:26:37,false,3,,,,,LE BOURG,15500,LAURIE,,,15098,,,,,,,,,,,,,,,,,,,2008-01-01,A,CAMPING MUNICIPAL LA PRADE,,,,55.30Z,NAFRev2,N,2.212915,47.9910304,0.9,poi.bar,Le Bourg (Bar) Ingrannes,https://osm.org/node/1718543174,G,,
261502348,00012,26150234800012,O,1983-03-01,NN,,,2010-06-26T03:05:15,true,3,,,,,,15500,LAURIE,,,15098,,,,,,,,,,,,,,,,,,,2008-01-01,A,CDE,,,,88.99B,NAFRev2,N,,,0,,,,,,
261504930,00015,26150493000015,O,1983-03-01,NN,,,2016-07-23T12:29:08,true,4,,,,,,15500,LAURIE,,,15098,,,,,,,,,,,,,,,,,,,2016-01-01,F,CCAS,,,,88.99B,NAFRev2,N,,,0,,,,,,
304506439,00013,30450643900013,O,,,,,,true,1,,,,,,15500,LAURIE,,,15098,,,,,,,,,,,,,,,,,,,1996-12-31,F,,,,,02.0B,NAF1993,N,,,0,,,,,,
311904817,00021,31190481700021,O,2010-08-16,,,4332AA,2021-02-23T10:39:22,true,1,,,,,LAIR,15500,LAURIE,,,15098,,,,,,,,,,,,,,,,,,,2010-08-16,A,,,,,43.32A,NAFRev2,N,,,0,,,,,,
311920680,00015,31192068000015,O,,,,,,true,1,,,,,,15500,LAURIE,,,15098,,,,,,,,,,,,,,,,,,,1984-12-25,F,,,,,67.04,NAP,N,,,0,,,,,,
317980068,00017,31798006800017,O,,NN,,,2006-11-25T09:41:55,true,1,,,,,LUSSAUD,15500,LAURIE,,,15098,,,,,,,,,,,,,,,,,,,,F,,,,,96.23,NAP,N,0.9190495,47.3968413,0.76,poi.track,Chemin rural des Huraudières au Grand Village Lussault-sur-Loire,https://osm.org/way/186012511,G,,
320060643,00014,32006064300014,O,1980-06-21,NN,,,2015-11-27T03:15:04,true,3,,,,,MAIRIE LAURIE,15500,LAURIE,,,15098,,,,,,,,,,,,,,,,,,,2008-01-01,A,,,,,02.40Z,NAFRev2,N,3.085,45.284,0.39,municipality,Laurie,15098,G,LAURIE,
328584917,00012,32858491700012,O,,NN,,,,true,1,,,,,,15500,LAURIE,,,15098,,,,,,,,,,,,,,,,,,,1989-07-31,F,,,,,02.20,NAP,N,,,0,,,,,,
331594077,00017,33159407700017,O,1984-08-27,NN,,,2021-05-01T03:33:20,true,3,,,,,AULIAC,15500,LAURIE,,,15098,,,,,,,,,,,,,,,,,,,2008-01-01,A,,,,,01.41Z,NAFRev2,N,,,0,,,,,,
332577006,00015,33257700600015,O,,NN,,,,true,1,,,,,,15500,LAURIE,,,15098,,,,,,,,,,,,,,,,,,,,F,,,,,01.80,NAP,N,,,0,,,,,,
333223154,00019,33322315400019,O,1985-07-31,NN,,,,true,1,,,,,,15500,LAURIE,,,15098,,,,,,,,,,,,,,,,,,,2002-03-19,F,,,,,20.1A,NAF1993,N,,,0,,,,,,
338004005,00017,33800400500017,O,,NN,,,,true,1,,,,,,15500,LAURIE,,,15098,,,,,,,,,,,,,,,,,,,1987-11-30,F,,,,,67.01,NAP,N,,,0,,,,,,
344308085,00010,34430808500010,O,,NN,,,,true,1,,,,,LE BOURG,15500,LAURIE,,,15098,,,,,,,,,,,,,,,,,,,1989-03-31,F,,,,,67.01,NAP,N,2.212915,47.9910304,0.9,poi.bar,Le Bourg (Bar) Ingrannes,https://osm.org/node/1718543174,G,,
350102695,00029,35010269500029,O,1996-07-14,NN,,,2017-05-19T08:25:50,true,4,,,,,,15500,LAURIE,,,15098,,,,,,,,,,,,,,,,,,,2017-05-31,F,,,,,56.10A,NAFRev2,N,,,0,,,,,,
350551560,00013,35055156000013,O,,NN,,,,true,1,,,,,LE BOURG,15500,LAURIE,,,15098,,,,,,,,,,,,,,,,,,,1991-09-30,F,,,,,67.01,NAP,N,2.212915,47.9910304,0.9,poi.bar,Le Bourg (Bar) Ingrannes,https://osm.org/node/1718543174,G,,
352117188,00016,35211718800016,O,,NN,,,,true,1,,,,,LUSSAUD,15500,LAURIE,,,15098,,,,,,,,,,,,,,,,,,,1992-10-26,F,,,,,26.2A,NAF1993,N,0.9190495,47.3968413,0.76,poi.track,Chemin rural des Huraudières au Grand Village Lussault-sur-Loire,https://osm.org/way/186012511,G,,
352125017,00017,35212501700017,O,1989-08-23,NN,,,2006-11-25T11:11:04,true,3,,,,,LUSSAUD,15500,LAURIE,,,15098,,,,,,,,,,,,,,,,,,,1994-12-25,F,,,,,26.2A,NAF1993,N,0.9190495,47.3968413,0.76,poi.track,Chemin rural des Huraudières au Grand Village Lussault-sur-Loire,https://osm.org/way/186012511,G,,
384393211,00014,38439321100014,O,1992-01-01,NN,,,2008-01-04T22:38:03,true,4,,,,,FOUILLERE,15500,LAURIE,,,15098,,,,,,,,,,,,,,,,,,,2008-01-01,A,,,,,68.20B,NAFRev2,N,0.0730908,45.6489223,0.88,poi.bus_stop,Fouillère (Arrêt de bus) Linars,https://osm.org/node/3164419046,G,,
384628525,00014,38462852500014,O,1989-01-01,NN,,,2007-01-18T09:30:42,true,3,,,,,,15500,LAURIE,,,15098,,,,,,,,,,,,,,,,,,,1996-12-25,F,,,,,01.2A,NAF1993,N,,,0,,,,,,
390012540,00014,39001254000014,O,1900-01-01,NN,,,2011-04-28T00:54:24,false,3,,,,,LE BOURG,15500,LAURIE,,,15098,,,,,,,,,,,,,,,,,,,1993-03-17,F,,,,,55.3A,NAF1993,N,2.212915,47.9910304,0.9,poi.bar,Le Bourg (Bar) Ingrannes,https://osm.org/node/1718543174,G,,
391894581,00019,39189458100019,O,,NN,,,,true,1,,,,,LE BOURG,15500,LAURIE,,,15098,,,,,,,,,,,,,,,,,,,1994-12-16,F,,,,,55.3A,NAF1993,N,2.212915,47.9910304,0.9,poi.bar,Le Bourg (Bar) Ingrannes,https://osm.org/node/1718543174,G,,
401128590,00015,40112859000015,O,,NN,,,,true,1,,,,,,15500,LAURIE,,,15098,,,,,,,,,,,,,,,,,,,1996-03-31,F,,,,,55.3B,NAF1993,N,,,0,,,,,,
401561683,00012,40156168300012,O,1994-01-01,NN,,,2007-07-31T04:21:15,true,3,,,,,ANLIAC,15500,LAURIE,,,15098,,,,,,,,,,,,,,,,,,,2007-09-30,F,,,,,01.2A,NAFRev1,N,,,0,,,,,,
403903024,00012,40390302400012,O,1995-01-01,NN,,,2007-01-18T09:37:56,true,3,,,,,,15500,LAURIE,,,15098,,,,,,,,,,,,,,,,,,,1998-12-25,F,,,,,01.2A,NAF1993,N,,,0,,,,,,
407589605,00028,40758960500028,O,1994-01-01,NN,,,,false,4,,,,,AUBEPEYRE,15500,LAURIE,,,15098,,,,,,,,,,,,,,,,,,,2003-04-01,F,,,,,01.3Z,NAFRev1,N,,,0,,,,,,
408993962,00013,40899396200013,O,1996-09-13,NN,,,2013-11-13T03:26:30,true,4,,,,,LUSSAUD,15500,LAURIE,,,15098,,,,,,,,,,,,,,,,,,,2013-12-31,F,,,,,01.41Z,NAFRev2,N,0.9190495,47.3968413,0.76,poi.track,Chemin rural des Huraudières au Grand Village Lussault-sur-Loire,https://osm.org/way/186012511,G,,
409318573,00014,40931857300014,O,1980-01-01,NN,,,,true,4,,,,,LUSSAUD,15500,LAURIE,,,15098,,,,,,,,,,,,,,,,,,,2003-01-31,F,,,,,01.1A,NAFRev1,N,0.9190495,47.3968413,0.76,poi.track,Chemin rural des Huraudières au Grand Village Lussault-sur-Loire,https://osm.org/way/186012511,G,,
409318581,00017,40931858100017,O,1980-01-01,NN,,,2008-01-29T08:03:56,true,4,,,,,LAIR,15500,LAURIE,,,15098,,,,,,,,,,,,,,,,,,,2008-01-01,F,,,,,01.41Z,NAFRev2,N,,,0,,,,,,
409318599,00019,40931859900019,O,1980-01-01,NN,,,2008-06-29T05:56:24,true,4,,,,,COHARDE BASSE,15500,LAURIE,,,15098,,,,,,,,,,,,,,,,,,,2008-03-31,F,,,,,01.42Z,NAFRev2,N,,,0,,,,,,
409318607,00010,40931860700010,O,1980-01-01,NN,,,2012-12-19T05:13:38,true,4,,,,,,15500,LAURIE,,,15098,,,,,,,,,,,,,,,,,,,2012-12-31,F,,,,,01.41Z,NAFRev2,N,,,0,,,,,,
409318615,00013,40931861500013,O,1981-01-01,NN,,,2008-07-30T15:27:58,true,4,,,,,FOUILLERES,15500,LAURIE,,,15098,,,,,,,,,,,,,,,,,,,2008-06-30,F,,,,,01.41Z,NAFRev2,N,0.0730908,45.6489223,0.73,poi.bus_stop,Fouillère (Arrêt de bus) Linars,https://osm.org/node/3164419046,G,,
409318623,00017,40931862300017,O,1983-12-31,NN,,,2016-12-04T04:03:13,true,4,,,,,LUSSAUD,15500,LAURIE,,,15098,,,,,,,,,,,,,,,,,,,2016-12-31,F,,,,,01.41Z,NAFRev2,N,0.9190495,47.3968413,0.76,poi.track,Chemin rural des Huraudières au Grand Village Lussault-sur-Loire,https://osm.org/way/186012511,G,,
409318631,00010,40931863100010,O,1984-12-31,NN,,,2018-02-28T04:01:03,true,4,,,,,AULIAC,15500,LAURIE,,,15098,,,,,,,,,,,,,,,,,,,2018-03-31,F,,,,,01.41Z,NAFRev2,N,,,0,,,,,,
409318649,00012,40931864900012,O,1980-01-01,NN,,,,true,1,,,,,FOULIERES,15500,LAURIE,,,15098,,,,,,,,,,,,,,,,,,,2002-12-31,F,,,,,01.1A,NAF1993,N,3.3338132,44.6016438,0.7,poi.track,Chemin de La Foulière à Réchiniac Saint-Léger-de-Peyre,https://osm.org/way/545524833,G,,
409318656,00017,40931865600017,O,1982-01-01,NN,,,2021-12-04T03:52:42,true,5,,,,,ANLIAC,15500,LAURIE,,,15098,,,,,,,,,,,,,,,,,,,2022-01-01,A,,,,,01.42Z,NAFRev2,N,,,0,,,,,,
409318664,00011,40931866400011,O,1991-12-31,NN,,,2008-01-04T21:25:06,true,3,,,,,LUSSAUD,15500,LAURIE,,,15098,,,,,,,,,,,,,,,,,,,2008-01-01,A,,,,,01.41Z,NAFRev2,N,0.9190495,47.3968413,0.76,poi.track,Chemin rural des Huraudières au Grand Village Lussault-sur-Loire,https://osm.org/way/186012511,G,,
409318672,00014,40931867200014,O,1987-12-31,NN,,,2008-01-04T21:25:06,true,3,,,,,AULIAC,15500,LAURIE,,,15098,,,,,,,,,,,,,,,,,,,2008-01-01,A,,,,,01.43Z,NAFRev2,N,,,0,,,,,,
409318680,00017,40931868000017,O,1985-12-31,NN,,,2006-11-25T15:20:41,true,3,,,,,JUREUGES,15500,LAURIE,,,15098,,,,,,,,,,,,,,,,,,,2006-07-30,F,,,,,01.1A,NAFRev1,N,,,0,,,,,,
409318698,00019,40931869800019,O,1989-12-31,NN,,,2020-06-18T03:35:32,true,4,,,,,,15500,LAURIE,,,15098,,,,,,,,,,,,,,,,,,,2020-04-30,F,,,,,01.43Z,NAFRev2,N,,,0,,,,,,
409318706,00010,40931870600010,O,1987-12-31,NN,,,2008-01-04T21:25:06,true,3,,,,,LUSSAUD,15500,LAURIE,,,15098,,,,,,,,,,,,,,,,,,,2008-01-01,A,,,,,01.41Z,NAFRev2,N,0.9190495,47.3968413,0.76,poi.track,Chemin rural des Huraudières au Grand Village Lussault-sur-Loire,https://osm.org/way/186012511,G,,
409318714,00014,40931871400014,O,1995-06-27,NN,,,,true,1,,,,,,15500,LAURIE,,,15098,,,,,,,,,,,,,,,,,,,1998-06-30,F,,,,,01.1A,NAF1993,N,,,0,,,,,,
410006050,00018,41000605000018,O,1996-11-27,NN,,,2018-05-19T03:40:47,true,3,,,,,MAIRIE,15500,LAURIE,,,15098,,,,,,,,,,,,,,,,,,,2008-01-01,A,,,,,77.31Z,NAFRev2,N,3.0709671,50.6304695,0.92,poi.townhall,Hôtel de Ville Lille,https://osm.org/way/40917078,G,,
410975544,00017,41097554400017,O,1980-01-01,NN,,,2007-04-30T09:11:51,true,3,,,,,LUSSAUD,15500,LAURIE,,,15098,,,,,,,,,,,,,,,,,,,2006-10-05,F,,,,,01.1A,NAFRev1,N,0.9190495,47.3968413,0.76,poi.track,Chemin rural des Huraudières au Grand Village Lussault-sur-Loire,https://osm.org/way/186012511,G,,
410975551,00012,41097555100012,O,1983-12-31,NN,,,2008-01-04T21:51:41,true,3,,,,,,15500,LAURIE,,,15098,,,,,,,,,,,,,,,,,,,2008-01-01,A,,,,,01.41Z,NAFRev2,N,,,0,,,,,,
410975569,00014,41097556900014,O,1987-12-31,NN,,,2012-05-29T07:28:18,true,4,,,,,LUSSAUD,15500,LAURIE,,,15098,,,,,,,,,,,,,,,,,,,2011-12-31,F,,,,,01.42Z,NAFRev2,N,0.9190495,47.3968413,0.76,poi.track,Chemin rural des Huraudières au Grand Village Lussault-sur-Loire,https://osm.org/way/186012511,G,,
425321676,00016,42532167600016,O,1973-01-01,,,,,true,1,,,,,,15500,LAURIE,,,15098,,,,,,,,,,,,,,,,,,,1999-02-09,F,,,,,70.2B,NAF1993,N,,,0,,,,,,
428101158,00015,42810115800015,O,1981-01-01,NN,,,2012-07-28T14:41:31,true,4,,,,,,15500,LAURIE,,,15098,,,,,,,,,,,,,,,,,,,2008-01-01,F,,,,,94.91Z,NAFRev2,N,,,0,,,,,,
448994848,00027,44899484800027,O,2005-10-07,,,,2009-01-11T04:43:31,true,2,,,,,FOULIERES,15500,LAURIE,,,15098,,,,,,,,,,,,,,,,,,,2006-12-13,F,,,,,01.2C,NAFRev1,N,3.3338132,44.6016438,0.7,poi.track,Chemin de La Foulière à Réchiniac Saint-Léger-de-Peyre,https://osm.org/way/545524833,G,,
449647122,00018,44964712200018,O,1991-01-01,NN,,,2008-01-04T23:50:49,true,3,AUBEPEYRE,,,,,15500,LAURIE,,,15098,,,,,,,,,,,,,,,,,,,2008-01-01,A,,,,,01.42Z,NAFRev2,N,,,0,,,,,,
452553456,00016,45255345600016,O,2004-04-01,NN,,,2011-04-27T06:17:04,true,4,,,,,LE BOURG,15500,LAURIE,,,15098,,,,,,,,,,,,,,,,,,,2011-03-29,F,,,,,01.41Z,NAFRev2,N,2.212915,47.9910304,0.9,poi.bar,Le Bourg (Bar) Ingrannes,https://osm.org/node/1718543174,G,,
490835501,00019,49083550100019,O,2006-06-28,,,1629ZA,2015-03-17T01:30:59,true,2,,,,,LE BOURG,15500,LAURIE,,,15098,,,,,,,,,,,,,,,,,,,2008-01-01,A,,,,,16.29Z,NAFRev2,N,2.212915,47.9910304,0.9,poi.bar,Le Bourg (Bar) Ingrannes,https://osm.org/node/1718543174,G,,
492504238,00014,49250423800014,O,2006-10-01,01,2020,,2022-08-29T09:25:17,true,2,,,,,FOULIERES,15500,LAURIE,,,15098,,,,,,,,,,,,,,,,,,,2008-01-01,A,,,,,01.42Z,NAFRev2,N,3.3338132,44.6016438,0.7,poi.track,Chemin de La Foulière à Réchiniac Saint-Léger-de-Peyre,https://osm.org/way/545524833,G,,
492740675,00011,49274067500011,O,2006-08-01,,,,2008-01-05T04:26:42,true,2,JUREUGE,,,,,15500,LAURIE,,,15098,,,,,,,,,,,,,,,,,,,2008-01-01,A,,,,,01.42Z,NAFRev2,N,,,0,,,,,,
502008881,00018,50200888100018,O,2008-01-01,,,,2016-01-12T00:27:35,true,1,,,,,L'AIR,15500,LAURIE,,,15098,,,,,,,,,,,,,,,,,,,2008-01-01,A,,,,,01.42Z,NAFRev2,N,-1.0514061,46.0184468,0.88,poi.hotel,L'Air Marin (Hôtel) Yves,https://osm.org/node/3999884486,G,,
502061062,00019,50206106200019,O,2008-04-01,,,,2021-02-23T14:12:57,true,2,,,,,LA COHARDE BASSE,15500,LAURIE,,,15098,,,,,,,,,,,,,,,,,,,2009-02-01,A,,,,,68.20B,NAFRev2,N,-1.4239611,46.1936351,0.73,poi.footway,Rue Basse Bretagne (Chemin piéton) La Couarde-sur-Mer,https://osm.org/way/102213280,G,,
509781118,00013,50978111800013,O,2009-01-01,,,,2009-07-19T05:45:58,true,2,FOUILIERES,,,,,15500,LAURIE,,,15098,,,,,,,,,,,,,,,,,,,2009-02-01,A,,,,,68.20B,NAFRev2,N,,,0,,,,,,
510449275,00021,51044927500021,O,2021-05-01,,,,2021-06-29T12:08:22,true,1,,,,,LE BOURG,15500,LAURIE,,,15098,,,,,,,,,,,,,,,,,,,2021-05-01,A,A LA BONNE AUBERGE,,,,56.30Z,NAFRev2,N,2.212915,47.9910304,0.9,poi.bar,Le Bourg (Bar) Ingrannes,https://osm.org/node/1718543174,G,,
510724842,00016,51072484200016,O,2009-02-01,,,,2022-03-05T12:13:20,true,1,,,,,LA COHARDE BASSE,15500,LAURIE,,,15098,,,,,,,,,,,,,,,,,,,2009-02-01,A,,,,,01.42Z,NAFRev2,N,-1.4239611,46.1936351,0.73,poi.footway,Rue Basse Bretagne (Chemin piéton) La Couarde-sur-Mer,https://osm.org/way/102213280,G,,
510724842,00024,51072484200024,O,2017-01-01,,,,2021-02-23T15:18:25,false,1,,,,,LA COHARDE BASSE,15500,LAURIE,,,15098,,,,,,,,,,,,,,,,,,,2017-01-01,A,,,,,55.20Z,NAFRev2,N,-1.4239611,46.1936351,0.73,poi.footway,Rue Basse Bretagne (Chemin piéton) La Couarde-sur-Mer,https://osm.org/way/102213280,G,,
531934891,00015,53193489100015,O,2011-03-30,,,,2018-03-17T03:52:52,true,1,,,,,LE BOURG,15500,LAURIE,,,15098,,,,,,,,,,,,,,,,,,,2011-03-30,A,,,,,01.42Z,NAFRev2,N,2.212915,47.9910304,0.9,poi.bar,Le Bourg (Bar) Ingrannes,https://osm.org/node/1718543174,G,,
537170730,00015,53717073000015,O,,00,,,,true,1,,,,,LE BOURG,15500,LAURIE,,,15098,,,,,,,,,,,,,,,,,,,,F,,,,,01.80,NAP,N,2.212915,47.9910304,0.9,poi.bar,Le Bourg (Bar) Ingrannes,https://osm.org/node/1718543174,G,,
751716028,00012,75171602800012,O,2012-01-01,,,,2012-06-22T10:25:16,true,2,,,,,LUSSAUD,15500,LAURIE,,,15098,,,,,,,,,,,,,,,,,,,2012-03-31,F,,,,,01.41Z,NAFRev2,N,0.9190495,47.3968413,0.76,poi.track,Chemin rural des Huraudières au Grand Village Lussault-sur-Loire,https://osm.org/way/186012511,G,,
779087840,00012,77908784000012,O,,00,,,,true,1,,,,,,15500,LAURIE,,,15098,,,,,,,,,,,,,,,,,,,1987-03-31,F,,,,,01.80,NAP,N,,,0,,,,,,
779087857,00016,77908785700016,O,,,,,,true,1,,,,,,15500,LAURIE,,,15098,,,,,,,,,,,,,,,,,,,1984-12-25,F,,,,,55.60,NAP,N,,,0,,,,,,
779087865,00019,77908786500019,O,1900-01-01,NN,,,2008-11-08T03:18:47,true,3,,,,,,15500,LAURIE,,,15098,,,,,,,,,,,,,,,,,,,1994-12-25,F,,,,,20.1A,NAF1993,O,,,0,,,,,,
790024541,00019,79002454100019,O,2013-01-01,,,,2012-12-19T05:13:38,true,1,,,,,LA COHARDE BASSE,15500,LAURIE,,,15098,,,,,,,,,,,,,,,,,,,2013-01-01,A,,,,,01.42Z,NAFRev2,N,-1.4239611,46.1936351,0.73,poi.footway,Rue Basse Bretagne (Chemin piéton) La Couarde-sur-Mer,https://osm.org/way/102213280,G,,
798412987,00017,79841298700017,O,2014-01-01,,,,2013-11-13T03:26:30,true,1,,,,,LUSSAUD,15500,LAURIE,,,15098,,,,,,,,,,,,,,,,,,,2014-01-01,A,,,,,01.41Z,NAFRev2,N,0.9190495,47.3968413,0.76,poi.track,Chemin rural des Huraudières au Grand Village Lussault-sur-Loire,https://osm.org/way/186012511,G,,
815326137,00016,81532613700016,O,2015-11-12,,,,2015-12-17T19:30:54,true,1,,,,,LUSSAUD,15500,LAURIE,,,15098,,,,,,,,,,,,,,,,,,,2015-11-12,A,,,,,47.78C,NAFRev2,N,0.9190495,47.3968413,0.76,poi.track,Chemin rural des Huraudières au Grand Village Lussault-sur-Loire,https://osm.org/way/186012511,G,,
824088033,00017,82408803300017,O,2017-01-01,,,,2016-12-04T04:03:13,true,1,,,,,LUSSAUD,15500,LAURIE,,,15098,,,,,,,,,,,,,,,,,,,2017-01-01,A,,,,,01.41Z,NAFRev2,N,0.9190495,47.3968413,0.76,poi.track,Chemin rural des Huraudières au Grand Village Lussault-sur-Loire,https://osm.org/way/186012511,G,,
828119156,00010,82811915600010,O,2017-03-01,NN,,,2022-05-18T13:36:46,true,2,,,,LD,ANLIAC,15500,LAURIE,,,15098,,,,,,,,,,,,,,,,,,,2021-12-31,F,,,,,01.41Z,NAFRev2,N,,,0,,,,,,
834310195,00013,83431019500013,O,2017-11-25,,,,2020-09-18T11:56:31,true,1,,,,,LAIR,15500,LAURIE,,,15098,,,,,,,,,,,,,,,,,,,2017-11-25,A,,,,,01.45Z,NAFRev2,N,,,0,,,,,,
837778836,00010,83777883600010,O,2018-04-01,,,,2018-02-28T04:01:03,true,1,,,,,ANLIAC,15500,LAURIE,,,15098,,,,,,,,,,,,,,,,,,,2018-04-01,A,,,,,01.41Z,NAFRev2,N,,,0,,,,,,
840879043,00015,84087904300015,O,2014-07-09,,,,2018-07-05T20:01:32,true,1,MAIRIE,,,PL,DE LA MAIRIE,15500,LAURIE,,,15098,,,,,,,,,,,,,,,,,,,2014-07-09,A,,,,,94.99Z,NAFRev2,N,4.9019022,46.7490994,0.79,poi.park,Place de la Mairie (Parc) Épervans,https://osm.org/way/234085031,G,,
879923001,00066,87992300100066,O,2020-03-16,,,,2020-03-28T03:52:16,false,1,SECTION B NUMERO 341,,,LD,PLANIE,15500,LAURIE,,,15098,,,,,,,,,,,,,,,,,,,2020-03-16,A,,,,,35.11Z,NAFRev2,N,,,0,,,,,,
881172233,00010,88117223300010,O,2020-01-27,,,,2020-02-01T03:42:16,true,1,,,,,LE BOURG,15500,LAURIE,,,15098,,,,,,,,,,,,,,,,,,,2020-01-27,A,A LA BONNE AUBERGE,,,JACQUIN MALAURY,56.30Z,NAFRev2,N,2.212915,47.9910304,0.9,poi.bar,Le Bourg (Bar) Ingrannes,https://osm.org/node/1718543174,G,,
897958773,00011,89795877300011,O,2021-03-17,,,,2021-04-07T13:49:50,true,1,,,,,ANLIAC,15500,LAURIE,,,15098,,,,,,,,,,,,,,,,,,,2021-03-17,A,,,,,68.20B,NAFRev2,N,,,0,,,,,,
902091420,00015,90209142000015,O,2021-02-18,,,,2021-08-06T09:04:25,true,1,,,,LD,FOULIERES,15500,LAURIE,,,15098,,,,,,,,,,,,,,,,,,,2021-02-18,A,,,,,35.11Z,NAFRev2,N,3.3338132,44.6016438,0.7,poi.track,Chemin de La Foulière à Réchiniac Saint-Léger-de-Peyre,https://osm.org/way/545524833,G,,
