siren,nic,siret,statutDiffusionEtablissement,dateCreationEtablissement,trancheEffectifsEtablissement,anneeEffectifsEtablissement,activitePrincipaleRegistreMetiersEtablissement,dateDernierTraitementEtablissement,etablissementSiege,nombrePeriodesEtablissement,complementAdresseEtablissement,numeroVoieEtablissement,indiceRepetitionEtablissement,typeVoieEtablissement,libelleVoieEtablissement,codePostalEtablissement,libelleCommuneEtablissement,libelleCommuneEtrangerEtablissement,distributionSpecialeEtablissement,codeCommuneEtablissement,codeCedexEtablissement,libelleCedexEtablissement,codePaysEtrangerEtablissement,libellePaysEtrangerEtablissement,complementAdresse2Etablissement,numeroVoie2Etablissement,indiceRepetition2Etablissement,typeVoie2Etablissement,libelleVoie2Etablissement,codePostal2Etablissement,libelleCommune2Etablissement,libelleCommuneEtranger2Etablissement,distributionSpeciale2Etablissement,codeCommune2Etablissement,codeCedex2Etablissement,libelleCedex2Etablissement,codePaysEtranger2Etablissement,libellePaysEtranger2Etablissement,dateDebut,etatAdministratifEtablissement,enseigne1Etablissement,enseigne2Etablissement,enseigne3Etablissement,denominationUsuelleEtablissement,activitePrincipaleEtablissement,nomenclatureActivitePrincipaleEtablissement,caractereEmployeurEtablissement,longitude,latitude,geo_score,geo_type,geo_adresse,geo_id,geo_ligne,geo_l4,geo_l5
212104145,00017,21210414500017,O,1983-03-01,02,2020,,2022-08-29T09:06:17,true,3,,,,,,21230,MIMEURE,,,21414,,,,,,,,,,,,,,,,,,,2008-01-01,A,MAIRIE,,,,84.11Z,NAFRev2,O,,,0,,,,,,
212104145,00025,21210414500025,O,1983-12-21,NN,,,,false,4,,,,,,21230,MIMEURE,,,21414,,,,,,,,,,,,,,,,,,,2001-12-31,F,ECOLE PRIMAIRE PUBLIQUE,,,,80.1Z,NAF1993,N,,,0,,,,,,
262105422,00014,26210542200014,O,1986-01-01,NN,,,2016-11-20T14:09:48,true,4,,,,,MAIRIE,21230,MIMEURE,,,21414,,,,,,,,,,,,,,,,,,,2016-01-01,F,CCAS,,,,88.99B,NAFRev2,N,4.496473,47.148249,0.9,street,Place de la Mairie 21230 Mimeure,21414_cgeni0,G,PLACE DE LA MAIRIE,
292107539,00010,29210753900010,O,1991-06-14,NN,,,2012-05-05T00:39:58,true,4,,,,,MAIRIE,21230,MIMEURE,,,21414,,,,,,,,,,,,,,,,,,,2011-10-25,F,,,,,42.99Z,NAFRev2,N,4.496473,47.148249,0.9,street,Place de la Mairie 21230 Mimeure,21414_cgeni0,G,PLACE DE LA MAIRIE,
301729281,00024,30172928100024,O,1986-05-30,NN,,,,true,1,,,,,LA VIEILLE CURE,21230,MIMEURE,,,21414,,,,,,,,,,,,,,,,,,,2002-12-20,F,,,,,85.1G,NAF1993,N,4.499737,47.148968,0.93,street,Rue de la Vieille Cure 21230 Mimeure,21414_6rm8q2,G,RUE DE LA VIEILLE CURE,
306020223,00013,30602022300013,O,1976-01-01,NN,,,2008-11-07T00:21:47,true,4,,,,,,21230,MIMEURE,,,21414,,,,,,,,,,,,,,,,,,,2008-03-31,F,,,,,43.34Z,NAFRev2,N,,,0,,,,,,
309441632,00028,30944163200028,O,2012-12-20,,,,2017-03-13T12:03:04,true,3,LA COLOMBIERE,2,,RUE,DU PRE AUX OISEAUX,21230,MIMEURE,,,21414,,,,,,,,,,,,,,,,,,,2017-04-01,A,,,,SCULPTEUR D'AUTOMATES,16.29Z,NAFRev2,N,4.493083,47.149459,0.81,housenumber,2 Rue du Pré des Oiseaux 21230 Mimeure,21414_m63n0h_00002,G,2 RUE DU PRE DES OISEAUX,
311675953,00039,31167595300039,O,1983-09-01,12,2020,,2022-08-29T09:13:45,true,4,ZONE INDUSTRIELLE,,,,PAQUIS AU ROY,21230,MIMEURE,,,21414,,,,,,,,,,,,,,,,,,,2008-01-01,A,,,,,18.12Z,NAFRev2,O,4.485851,47.139479,0.93,locality,Paquis au Roy 21230 Mimeure,21414_B085,G,PAQUIS AU ROY,
312243520,00037,31224352000037,O,1986-04-01,,,,,false,3,,,,,,21230,MIMEURE,,,21414,,,,,,,,,,,,,,,,,,,2003-10-31,F,LA MOTOCULTURE DE PLAISANCE,,,,52.4N,NAFRev1,N,,,0,,,,,,
313488546,00018,31348854600018,O,1978-01-01,,,,2008-04-25T00:15:06,false,3,,,,HAM,THOREILLE,21230,MIMEURE,,,21414,,,,,,,,,,,,,,,,,,,1999-08-31,F,,,,,52.5Z,NAF1993,N,4.514952,47.148672,0.91,street,Rue du Sud (thoreille) 21230 Mimeure,21414_0180,G,RUE DU SUD,THOREILLE
316535970,00032,31653597000032,O,1988-09-01,02,2020,,2022-08-29T09:15:16,true,7,,6,,RUE,DE LA CROIX FOLLOT,21230,MIMEURE,,,21414,,,,,,,,,,,,,,,,,,,2016-04-01,A,,,,ECOSOLAIRE,46.49Z,NAFRev2,O,4.496851,47.151627,0.94,housenumber,6 Rue de la Croix Follot 21230 Mimeure,21414_vfybv6_00006,G,6 RUE DE LA CROIX FOLLOT,
323393215,00013,32339321500013,O,,,,,,true,1,,,,,,21230,MIMEURE,,,21414,,,,,,,,,,,,,,,,,,,1984-12-25,F,,,,,45.22,NAP,N,,,0,,,,,,
327728242,00022,32772824200022,O,2017-06-01,,,4540ZP,2020-08-06T03:51:16,true,2,HAMEAU DE SOLONGE,6,,RUE,DES PRALOTS,21230,MIMEURE,,,21414,,,,,,,,,,,,,,,,,,,2020-05-27,F,,,,L'ATELIER RESTAURATION,45.40Z,NAFRev2,N,4.476189,47.157924,0.94,housenumber,6 Rue des Pralots 21230 Mimeure,21414_va3muf_00006,G,6 RUE DES PRALOTS,
328147418,00011,32814741800011,O,1983-09-01,NN,,,,false,4,,,,,ZONE INDUSTRIELLE,21230,MIMEURE,,,21414,,,,,,,,,,,,,,,,,,,2003-02-20,F,,,,,70.2C,NAFRev1,N,5.0269111,45.7705982,0.92,poi.industrial,Zone Industrielle Meyzieu,https://osm.org/way/117589602,G,,
329428130,00010,32942813000010,O,,NN,,,,true,1,,,,,THOREILLE,21230,MIMEURE,,,21414,,,,,,,,,,,,,,,,,,,1996-07-15,F,,,,,01.1A,NAF1993,N,4.514952,47.148672,0.91,street,Rue du Sud (thoreille) 21230 Mimeure,21414_0180,G,RUE DU SUD,THOREILLE
331708859,00011,33170885900011,O,1985-01-01,NN,,,2008-01-04T20:16:33,true,3,,,,,,21230,MIMEURE,,,21414,,,,,,,,,,,,,,,,,,,2008-01-01,A,,,,,01.11Z,NAFRev2,N,,,0,,,,,,
333747145,00014,33374714500014,O,1985-10-15,,,,2008-11-07T00:53:42,true,4,,,,,ZON INDUS ARNAY LE DUC,21230,MIMEURE,,,21414,,,,,,,,,,,,,,,,,,,1993-12-25,F,,,,,29.2F,NAF1993,N,,,0,,,,,,
340539014,00019,34053901400019,O,1987-03-02,01,2020,4399CZ,2022-08-29T09:26:23,true,4,,,,,,21230,MIMEURE,,,21414,,,,,,,,,,,,,,,,,,,2008-01-01,A,,,,,43.99C,NAFRev2,O,,,0,,,,,,
353730799,00031,35373079900031,O,2009-06-12,,,,2012-11-09T00:43:43,true,2,,,,,THOREILLE,21230,MIMEURE,,,21414,,,,,,,,,,,,,,,,,,,2011-01-26,F,,,,,70.22Z,NAFRev2,N,4.514952,47.148672,0.91,street,Rue du Sud (thoreille) 21230 Mimeure,21414_0180,G,RUE DU SUD,THOREILLE
382758910,00014,38275891000014,O,1991-08-16,NN,,,2008-12-06T05:11:28,true,3,,,,,HAMEAU DE THOREILLE,21230,MIMEURE,,,21414,,,,,,,,,,,,,,,,,,,2008-01-01,A,,,,,56.21Z,NAFRev2,N,4.514952,47.148672,0.48,street,Rue du Sud (thoreille) 21230 Mimeure,21414_0180,G,RUE DU SUD,THOREILLE
382758910,00022,38275891000022,O,1991-08-16,,,,,false,4,,,,,HAMEAU DE THOREILLE,21230,MIMEURE,,,21414,,,,,,,,,,,,,,,,,,,1997-10-31,F,,,,,01.3Z,NAF1993,N,4.514952,47.148672,0.48,street,Rue du Sud (thoreille) 21230 Mimeure,21414_0180,G,RUE DU SUD,THOREILLE
383072022,00015,38307202200015,O,1991-07-01,NN,,,2014-04-25T16:39:14,true,1,,,,,THOREILLE,21230,MIMEURE,,,21414,,,,,,,,,,,,,,,,,,,1999-10-31,F,,,,,51.1R,NAF1993,N,4.514952,47.148672,0.91,street,Rue du Sud (thoreille) 21230 Mimeure,21414_0180,G,RUE DU SUD,THOREILLE
384052247,00044,38405224700044,O,1995-02-13,,,,2019-02-12T14:41:14,false,5,ZI PAQUIS DU ROY,,,,ROY,21230,MIMEURE,,,21414,,,,,,,,,,,,,,,,,,,2019-02-07,F,AUTO ECOLE LUCOTTE,,,,85.53Z,NAFRev2,N,4.485851,47.139479,0.9,locality,Paquis au Roy 21230 Mimeure,21414_B085,G,PAQUIS AU ROY,
387646409,00038,38764640900038,O,1995-06-01,NN,,,,true,1,,,,,,21230,MIMEURE,,,21414,,,,,,,,,,,,,,,,,,,2001-07-05,F,,,,,22.2C,NAF1993,O,,,0,,,,,,
387836133,00018,38783613300018,O,1992-05-29,NN,,,2019-03-16T03:36:00,true,3,,,,,,21230,MIMEURE,,,21414,,,,,,,,,,,,,,,,,,,2008-01-01,A,,,,,68.20A,NAFRev2,N,,,0,,,,,,
393094115,00010,39309411500010,O,1993-11-01,NN,,,2014-07-08T01:21:43,true,6,,,,HAM,DE THOREILLE,21230,MIMEURE,,,21414,,,,,,,,,,,,,,,,,,,2013-03-31,F,,,,,43.22A,NAFRev2,N,4.514952,47.148672,0.72,street,Rue du Sud (thoreille) 21230 Mimeure,21414_0180,G,RUE DU SUD,THOREILLE
394244016,00017,39424401600017,O,1994-03-04,NN,,,,true,3,CARRIERE,,,,PONT DE COLONNE,21230,MIMEURE,,,21414,,,,,,,,,,,,,,,,,,,1994-12-25,F,,,,,14.2A,NAF1993,O,4.49047,47.149377,0.37,street,Rue de la Chapelle Contaut 21230 Mimeure,21414_0036,G,RUE DE LA CHAPELLE CONTAUT,
394817688,00010,39481768800010,O,1900-01-01,NN,,,2021-11-17T10:29:25,false,4,,,,HAM,DE SOLONGE,21230,MIMEURE,,,21414,,,,,,,,,,,,,,,,,,,1995-12-25,F,,,,,92.3B,NAF1993,N,4.48139,47.162804,0.83,street,Chemin de l’Aubepin (solonge) 21230 Mimeure,21414_0005,G,CHEMIN DE L AUBEPIN,SOLONGE
394817688,00028,39481768800028,O,2021-04-18,,,,2021-12-04T14:25:31,true,1,HAMEAU DE SOLONGE,2,,RUE,DES MILLIERES,21230,MIMEURE,,,21414,,,,,,,,,,,,,,,,,,,2021-04-18,A,,,,,01.19Z,NAFRev2,N,4.479499,47.158381,0.94,housenumber,2 Rue des Millieres 21230 Mimeure,21414_kgr1t1_00002,G,2 RUE DES MILLIERES,
397482308,00012,39748230800012,O,1994-05-24,NN,,,2012-07-01T05:19:31,false,4,,,,,SOLONGE,21230,MIMEURE,,,21414,,,,,,,,,,,,,,,,,,,2011-05-28,F,,,,,02.10Z,NAFRev2,N,4.480666,47.163018,0.93,street,Solonge 21230 Mimeure,21414_o8iznl,G,SOLONGE,
397825258,00023,39782525800023,O,2011-10-01,,,,2020-05-26T03:38:38,true,2,THOREILLE,,,,,21230,MIMEURE,,,21414,,,,,,,,,,,,,,,,,,,2019-12-31,F,,,,,01.42Z,NAFRev2,N,4.514952,47.148672,0.91,street,Rue du Sud (thoreille) 21230 Mimeure,21414_0180,D,RUE DU SUD,THOREILLE
398314096,00023,39831409600023,O,1994-10-01,NN,,,2008-01-04T18:47:03,false,3,,,,,,21230,MIMEURE,,,21414,,,,,,,,,,,,,,,,,,,2008-01-01,A,,,,,47.78B,NAFRev2,N,,,0,,,,,,
399892298,00015,39989229800015,O,1995-01-01,NN,,,2014-01-17T09:40:13,true,4,THOREILLE,,,,,21230,MIMEURE,,,21414,,,,,,,,,,,,,,,,,,,2013-12-31,F,,,,,68.20B,NAFRev2,N,4.514952,47.148672,0.91,street,Rue du Sud (thoreille) 21230 Mimeure,21414_0180,D,RUE DU SUD,THOREILLE
401320783,00020,40132078300020,O,1997-09-06,NN,,,2012-08-08T05:14:40,true,4,LOT INDUSTRIEL,,,,PAQUIS AU ROY,21230,MIMEURE,,,21414,,,,,,,,,,,,,,,,,,,2008-07-11,F,,,,,71.20A,NAFRev2,N,4.485851,47.139479,0.93,locality,Paquis au Roy 21230 Mimeure,21414_B085,G,PAQUIS AU ROY,
402896138,00029,40289613800029,O,2001-01-15,NN,,,2016-06-16T04:09:00,true,4,,,,CHE,DE MUSSIGNY,21230,MIMEURE,,,21414,,,,,,,,,,,,,,,,,,,2016-06-02,F,,,,,70.10Z,NAFRev2,N,4.498263,47.150688,0.37,street,Chemin de Chalandry (mimeure) 21230 Mimeure,21414_0030,G,CHEMIN DE CHALANDRY,MIMEURE
405060450,00013,40506045000013,O,1983-12-31,NN,,,2008-01-04T20:49:59,true,3,,,,,SOLONGE,21230,MIMEURE,,,21414,,,,,,,,,,,,,,,,,,,2008-01-01,A,,,,,01.11Z,NAFRev2,N,4.480666,47.163018,0.93,street,Solonge 21230 Mimeure,21414_o8iznl,G,SOLONGE,
405060468,00015,40506046800015,O,1982-12-31,NN,,,2015-06-23T03:33:28,true,4,,,,,,21230,MIMEURE,,,21414,,,,,,,,,,,,,,,,,,,2013-12-31,F,,,,,01.42Z,NAFRev2,N,,,0,,,,,,
405060476,00018,40506047600018,O,1993-05-01,NN,,,2018-09-26T03:48:41,true,4,FERME DE FLACELIERE,,,,,21230,MIMEURE,,,21414,,,,,,,,,,,,,,,,,,,2018-03-31,F,,,,,01.43Z,NAFRev2,N,4.480433,47.150993,0.72,locality,Ferme de Flachère 21230 Mimeure,21414_B150,D,FERME DE FLACHERE,
408277796,00012,40827779600012,O,1977-12-25,,,,2015-05-14T07:38:45,false,6,,,,,BIZOUARD PIERRE,21230,MIMEURE,,,21414,,,,,,,,,,,,,,,,,,,2013-06-27,F,,,,,01.42Z,NAFRev2,O,4.496997,47.148754,0.31,street,Quartier du Bief 21230 Mimeure,21414_sza4aw,G,QUARTIER DU BIEF,
408277796,00020,40827779600020,O,2013-06-27,01,2020,,2022-08-29T09:25:54,true,2,,,,,,21230,MIMEURE,,,21414,,,,,,,,,,,,,,,,,,,2013-12-08,A,,,,,01.42Z,NAFRev2,O,,,0,,,,,,
411073356,00015,41107335600015,O,1997-01-01,NN,,,2016-03-07T03:33:26,true,4,,,,,,21230,MIMEURE,,,21414,,,,,,,,,,,,,,,,,,,2015-12-31,F,,,,,68.20B,NAFRev2,N,,,0,,,,,,
411695190,00016,41169519000016,O,1997-01-01,NN,,,2008-01-04T22:02:46,true,3,,,,,SOLONGE,21230,MIMEURE,,,21414,,,,,,,,,,,,,,,,,,,2008-01-01,A,,,,,01.45Z,NAFRev2,N,4.480666,47.163018,0.93,street,Solonge 21230 Mimeure,21414_o8iznl,G,SOLONGE,
413447988,00010,41344798800010,O,1997-07-15,,,,,true,1,,,,,CHEMIN DE MUSIGNY,21230,MIMEURE,,,21414,,,,,,,,,,,,,,,,,,,1999-02-28,F,,,,,60.2M,NAF1993,N,4.498263,47.150688,0.58,street,Chemin de Chalandry (mimeure) 21230 Mimeure,21414_0030,G,CHEMIN DE CHALANDRY,MIMEURE
414523373,00010,41452337300010,O,1997-11-01,NN,,,2018-12-06T09:50:47,true,3,THOREILLE LES MIMEURE,,,,,21230,MIMEURE,,,21414,,,,,,,,,,,,,,,,,,,2008-01-01,A,,,,,01.42Z,NAFRev2,N,4.514952,47.148672,0.72,street,Rue du Sud (thoreille) 21230 Mimeure,21414_0180,D,RUE DU SUD,THOREILLE
420209561,00018,42020956100018,O,1998-10-08,NN,,,2014-07-08T01:55:05,false,5,,,,RTE,DE THOREILLE,21230,MIMEURE,,,21414,,,,,,,,,,,,,,,,,,,2010-01-01,F,,,,,96.02A,NAFRev2,O,4.514952,47.148672,0.62,street,Rue du Sud (thoreille) 21230 Mimeure,21414_0180,G,RUE DU SUD,THOREILLE
423108232,00012,42310823200012,O,1999-07-01,,,,2008-10-13T02:52:07,false,3,,,,HAM,DE SOLONGE,21230,MIMEURE,,,21414,,,,,,,,,,,,,,,,,,,2000-12-31,F,,,,,01.1C,NAF1993,N,4.48139,47.162804,0.83,street,Chemin de l’Aubepin (solonge) 21230 Mimeure,21414_0005,G,CHEMIN DE L AUBEPIN,SOLONGE
423425933,00011,42342593300011,O,1999-06-25,NN,,,2020-08-25T10:14:27,false,5,Z.I.PAQUIES AU ROY,,,,ZONE INDUSTRIELLE PAQUIS AU RO,21230,MIMEURE,,,21414,,,,,,,,,,,,,,,,,,,2018-06-20,F,,,,,64.20Z,NAFRev2,O,,,0,,,,,,
424826451,00017,42482645100017,O,1999-09-30,NN,,,2014-04-09T19:21:07,true,4,,,,,THOREILLE,21230,MIMEURE,,,21414,,,,,,,,,,,,,,,,,,,2014-03-11,F,,,,,70.22Z,NAFRev2,N,4.514952,47.148672,0.91,street,Rue du Sud (thoreille) 21230 Mimeure,21414_0180,G,RUE DU SUD,THOREILLE
431109834,00017,43110983400017,O,,NN,,,,true,1,,,,HAM,DE SOLONGE,21230,MIMEURE,,,21414,,,,,,,,,,,,,,,,,,,1978-01-01,F,,,,,01.2A,NAF1993,N,4.48139,47.162804,0.83,street,Chemin de l’Aubepin (solonge) 21230 Mimeure,21414_0005,G,CHEMIN DE L AUBEPIN,SOLONGE
431109958,00014,43110995800014,O,1992-01-01,NN,,,2008-01-04T18:02:34,true,3,,,,,THOREILLE,21230,MIMEURE,,,21414,,,,,,,,,,,,,,,,,,,2008-01-01,A,,,,,01.11Z,NAFRev2,N,4.514952,47.148672,0.91,street,Rue du Sud (thoreille) 21230 Mimeure,21414_0180,G,RUE DU SUD,THOREILLE
431110451,00017,43111045100017,O,1997-11-01,NN,,,2008-01-04T18:02:34,true,3,,,,HAM,DE THOREILLE,21230,MIMEURE,,,21414,,,,,,,,,,,,,,,,,,,2008-01-01,A,,,,,68.20B,NAFRev2,N,4.514952,47.148672,0.72,street,Rue du Sud (thoreille) 21230 Mimeure,21414_0180,G,RUE DU SUD,THOREILLE
431111798,00010,43111179800010,O,1968-01-01,NN,,,2010-05-18T09:20:24,true,4,,,,,SOLONGE,21230,MIMEURE,,,21414,,,,,,,,,,,,,,,,,,,2010-03-24,F,,,,,01.11Z,NAFRev2,N,4.480666,47.163018,0.93,street,Solonge 21230 Mimeure,21414_o8iznl,G,SOLONGE,
431563477,00014,43156347700014,O,1999-10-01,NN,,,2006-11-25T16:57:24,true,4,,,,,THOREILLE,21230,MIMEURE,,,21414,,,,,,,,,,,,,,,,,,,2003-01-31,F,,,,,74.1J,NAFRev1,N,4.514952,47.148672,0.91,street,Rue du Sud (thoreille) 21230 Mimeure,21414_0180,G,RUE DU SUD,THOREILLE
431824952,00011,43182495200011,O,2000-06-13,NN,,,2018-08-28T03:51:37,true,3,,,,RUE,DES VIGNOLLES,21230,MIMEURE,,,21414,,,,,,,,,,,,,,,,,,,2008-01-01,A,,,,,68.20B,NAFRev2,N,4.499737,47.148968,0.46,street,Rue de la Vieille Cure 21230 Mimeure,21414_6rm8q2,G,RUE DE LA VIEILLE CURE,
437807795,04170,43780779504170,O,2019-04-01,01,2020,,2022-08-29T09:13:57,false,1,,,,,ZA PAQUIS AU ROY,21230,MIMEURE,,,21414,,,,,,,,,,,,,,,,,,,2019-04-01,A,,,,,71.20A,NAFRev2,N,4.485851,47.139479,0.79,locality,Paquis au Roy 21230 Mimeure,21414_B085,G,PAQUIS AU ROY,
441322492,00030,44132249200030,O,2010-06-30,NN,,,2018-09-29T12:25:11,true,3,,,,RTE,DEPARTEMENTALE 17 L,21230,MIMEURE,,,21414,,,,,,,,,,,,,,,,,,,2016-04-18,F,,,,,46.69A,NAFRev2,O,2.0466333,42.9208228,0.71,poi,Route Départementale D117 (Pont) Puivert,https://osm.org/way/125881206,G,,
447593757,00019,44759375700019,O,2003-02-13,NN,,,2008-01-05T21:22:30,true,3,M. JEAN PIERRE TASIN,,,,,21230,MIMEURE,,,21414,,,,,,,,,,,,,,,,,,,2008-01-01,A,,,,,68.20B,NAFRev2,N,,,0,,,,,,
450508437,00016,45050843700016,O,2003-11-01,NN,,,2014-07-08T02:41:22,false,4,RN 81,,,RTE,N 81,21230,MIMEURE,,,21414,,,,,,,,,,,,,,,,,,,2013-01-02,F,,,,,33.12Z,NAFRev2,O,,,0,,,,,,
450521059,00011,45052105900011,O,2003-10-15,NN,,,2008-01-23T11:16:15,false,3,,,,RTE,NATIONALE 81,21230,MIMEURE,,,21414,,,,,,,,,,,,,,,,,,,2007-03-16,F,,,,,70.2C,NAFRev1,N,,,0,,,,,,
478225790,00011,47822579000011,O,2004-08-01,00,2019,3109BA,2021-10-27T08:12:42,true,5,,,,,Z A DU PAQUIS AU ROY,21230,MIMEURE,,,21414,,,,,,,,,,,,,,,,,,,2019-07-01,A,,,,,31.09B,NAFRev2,N,4.485851,47.139479,0.66,locality,Paquis au Roy 21230 Mimeure,21414_B085,G,PAQUIS AU ROY,
483923108,00011,48392310800011,O,2005-10-01,NN,,4399CZ,2019-06-24T13:19:53,true,4,,5,,CHE,VICINAL,21230,MIMEURE,,,21414,,,,,,,,,,,,,,,,,,,2017-12-31,F,,,,,43.99C,NAFRev2,O,4.498786,47.150857,0.35,housenumber,5 Chemin de Chalandry (mimeure) 21230 Mimeure,21414_0030_00005,G,5 CHEMIN DE CHALANDRY,MIMEURE
488289604,00016,48828960400016,O,2006-01-01,,,,2009-09-08T02:41:46,true,3,,,,,THOREILLE,21230,MIMEURE,,,21414,,,,,,,,,,,,,,,,,,,2009-05-26,F,,,,,68.10Z,NAFRev2,N,4.514952,47.148672,0.91,street,Rue du Sud (thoreille) 21230 Mimeure,21414_0180,G,RUE DU SUD,THOREILLE
497514752,00011,49751475200011,O,2007-05-02,,,4334ZC,2015-05-28T03:44:20,true,3,,,,,GRANDE RUE,21230,MIMEURE,,,21414,,,,,,,,,,,,,,,,,,,2014-09-30,F,,,,,43.34Z,NAFRev2,N,4.496846,47.153858,0.59,street,Chemin de la Grande Couture 21230 Mimeure,21414_0085,G,CHEMIN DE LA GRANDE COUTURE,
497561514,00025,49756151400025,O,2014-11-01,,,,2015-04-16T11:39:47,true,1,,14,,RUE,RUE LA CROIX FOLLOT,21230,MIMEURE,,,21414,,,,,,,,,,,,,,,,,,,2014-11-01,A,,,,,43.34Z,NAFRev2,N,4.495748,47.154546,0.9,housenumber,14 Rue de la Croix Follot 21230 Mimeure,21414_vfybv6_00014,G,14 RUE DE LA CROIX FOLLOT,
508687597,00031,50868759700031,O,2021-10-20,,,,2021-12-14T15:57:03,false,1,,,,,FERME DE LA FLACELIERE,21230,MIMEURE,,,21414,,,,,,,,,,,,,,,,,,,2021-10-20,A,,,,C'ENERGIES,35.11Z,NAFRev2,N,4.480433,47.150993,0.6,locality,Ferme de Flachère 21230 Mimeure,21414_B150,G,FERME DE FLACHERE,
510051956,00025,51005195600025,O,1900-01-01,NN,,,2012-05-05T14:38:10,true,5,,,,LOT,INDUSTRIEL PAQUIS AU ROY,21230,MIMEURE,,,21414,,,,,,,,,,,,,,,,,,,2010-12-31,F,CONTROLE TECHNIQUE VINCENT,,,,71.20A,NAFRev2,N,4.485851,47.139479,0.52,locality,Paquis au Roy 21230 Mimeure,21414_B085,G,PAQUIS AU ROY,
510112253,00016,51011225300016,O,2009-01-16,NN,,,2013-05-18T03:18:52,true,3,,,,,,21230,MIMEURE,,,21414,,,,,,,,,,,,,,,,,,,2012-01-17,F,,,,,43.91B,NAFRev2,O,,,0,,,,,,
511704710,00041,51170471000041,O,2021-06-01,,,,2021-09-04T12:44:54,false,1,,8,,RUE,DES PEUPLIERS,21230,MIMEURE,,,21414,,,,,,,,,,,,,,,,,,,2021-06-01,A,,,,,68.31Z,NAFRev2,N,4.480984,47.16323,0.94,interpolation,8 Rue des Peupliers 21230 Mimeure,,G,6 RUE DES PEUPLIERS,
515620250,00024,51562025000024,O,1998-01-01,NN,,,2008-12-06T05:31:49,false,4,,,,,CHAMPS CHEREAUX,21230,MIMEURE,,,21414,,,,,,,,,,,,,,,,,,,2008-01-01,A,,,,,45.20B,NAFRev2,N,4.483038,47.138662,0.93,locality,Champs Chereaux 21230 Mimeure,21414_B027,G,CHAMPS CHEREAUX,
516910023,00022,51691002300022,O,,NN,,,,true,1,,,,,,21230,MIMEURE,,,21414,,,,,,,,,,,,,,,,,,,1987-06-15,F,,,,,64.49,NAP,N,,,0,,,,,,
518359492,00015,51835949200015,O,2009-12-01,,,,2014-12-03T16:20:44,true,2,,,,,DE THOREILLE,21230,MIMEURE,,,21414,,,,,,,,,,,,,,,,,,,2012-06-30,F,,,,,43.91B,NAFRev2,N,4.514952,47.148672,0.72,street,Rue du Sud (thoreille) 21230 Mimeure,21414_0180,G,RUE DU SUD,THOREILLE
518562368,00010,51856236800010,O,2009-12-03,,,,2010-11-17T15:52:44,true,2,,,,HAM,THOREILLE,21230,MIMEURE,,,21414,,,,,,,,,,,,,,,,,,,2010-11-02,A,,,,,35.11Z,NAFRev2,N,4.514952,47.148672,0.91,street,Rue du Sud (thoreille) 21230 Mimeure,21414_0180,G,RUE DU SUD,THOREILLE
521571398,00010,52157139800010,O,2009-12-11,,,,2010-04-23T11:22:07,true,1,MME CORTOT,,,,MAIRIE,21230,MIMEURE,,,21414,,,,,,,,,,,,,,,,,,,2009-12-11,A,,,,,94.99Z,NAFRev2,N,4.496473,47.148249,0.9,street,Place de la Mairie 21230 Mimeure,21414_cgeni0,G,PLACE DE LA MAIRIE,
522490119,00016,52249011900016,O,2010-03-24,,,,2010-05-19T11:05:00,true,1,SOLONGE,,,,,21230,MIMEURE,,,21414,,,,,,,,,,,,,,,,,,,2010-03-24,A,,,,,01.45Z,NAFRev2,N,4.480666,47.163018,0.93,street,Solonge 21230 Mimeure,21414_o8iznl,D,SOLONGE,
532879426,00031,53287942600031,O,2022-07-04,,,,2022-08-06T12:35:25,true,1,,3,,RUE,PERROT,21230,MIMEURE,,,21414,,,,,,,,,,,,,,,,,,,2022-07-04,A,,,,,68.31Z,NAFRev2,N,4.494753,47.148742,0.94,housenumber,3 Rue Perrot 21230 Mimeure,21414_uuco10_00003,G,3 RUE PERROT,
534192646,00014,53419264600014,O,2011-08-01,,,,2011-08-19T12:13:29,true,1,,5,,CHE,VICINAL,21230,MIMEURE,,,21414,,,,,,,,,,,,,,,,,,,2011-08-01,A,,,,,68.20B,NAFRev2,N,4.498786,47.150857,0.35,housenumber,5 Chemin de Chalandry (mimeure) 21230 Mimeure,21414_0030_00005,G,5 CHEMIN DE CHALANDRY,MIMEURE
538748914,00024,53874891400024,O,2012-01-01,NN,,,2015-05-14T09:31:16,true,4,,,,,ZI PAQUIS DU ROY,21230,MIMEURE,,,21414,,,,,,,,,,,,,,,,,,,2013-09-30,F,ECOLE DE CONDUITE AUXOIS-MORVAN,,,,85.53Z,NAFRev2,N,4.485851,47.139479,0.63,locality,Paquis au Roy 21230 Mimeure,21414_B085,G,PAQUIS AU ROY,
753841055,00019,75384105500019,O,2012-04-13,,,,2020-07-10T07:39:43,false,1,,,,,LE BOURG,21230,MIMEURE,,,21414,,,,,,,,,,,,,,,,,,,2012-04-13,F,,,,,43.32B,NAFRev2,N,2.212915,47.9910304,0.9,poi.bar,Le Bourg (Bar) Ingrannes,https://osm.org/node/1718543174,G,,
753841055,00035,75384105500035,O,2021-03-15,,,4334ZB,2021-04-01T14:35:57,true,1,,7,,RUE,DU PRES DES OISEAUX,21230,MIMEURE,,,21414,,,,,,,,,,,,,,,,,,,2021-03-15,A,,,,,43.34Z,NAFRev2,N,4.491374,47.148996,0.87,housenumber,7 Rue du Pré des Oiseaux 21230 Mimeure,21414_m63n0h_00007,G,7 RUE DU PRE DES OISEAUX,
778233619,00015,77823361900015,O,,,,,2007-01-18T09:45:51,true,1,,,,,,21230,MIMEURE,,,21414,,,,,,,,,,,,,,,,,,,1982-12-21,F,,,,,01.4A,NAF1993,N,,,0,,,,,,
778233627,00018,77823362700018,O,1963-01-01,NN,,,,true,1,,,,,,21230,MIMEURE,,,21414,,,,,,,,,,,,,,,,,,,2001-03-31,F,,,,,45.2V,NAF1993,N,,,0,,,,,,
789731411,00011,78973141100011,O,2013-01-01,,,,2014-12-31T08:40:43,true,2,,,,,LE VILLAGE,21230,MIMEURE,,,21414,,,,,,,,,,,,,,,,,,,2015-01-05,F,,,,,70.22Z,NAFRev2,N,4.494716,47.14973,0.66,locality,Village de Mimeure 21230 Mimeure,21414_B147,G,VILLAGE DE MIMEURE,
790352157,00016,79035215700016,O,2012-12-17,,,3312ZA,2018-03-14T04:08:53,true,1,,,,,LIEUDIT VILLAGE DE MIMEURE,21230,MIMEURE,,,21414,,,,,,,,,,,,,,,,,,,2012-12-17,A,,,,,46.61Z,NAFRev2,N,4.494716,47.14973,0.93,locality,Village de Mimeure 21230 Mimeure,21414_B147,G,VILLAGE DE MIMEURE,
790958409,00019,79095840900019,O,2013-03-01,,,,2018-04-10T03:59:04,true,2,,,,HAM,SOLONGE,21230,MIMEURE,,,21414,,,,,,,,,,,,,,,,,,,2018-03-31,F,ELEVAGE THIBAULT SYLVAIN,,,,01.50Z,NAFRev2,N,4.480666,47.163018,0.93,street,Solonge 21230 Mimeure,21414_o8iznl,G,SOLONGE,
792564676,00015,79256467600015,O,2013-04-16,,,,2019-11-07T03:55:08,true,5,THOREILLE,,,,,21230,MIMEURE,,,21414,,,,,,,,,,,,,,,,,,,2019-08-27,A,,,,,43.22B,NAFRev2,N,4.514952,47.148672,0.91,street,Rue du Sud (thoreille) 21230 Mimeure,21414_0180,D,RUE DU SUD,THOREILLE
792719957,00013,79271995700013,O,2013-05-01,,,,2018-03-12T08:53:44,false,2,,,,RUE,VIEILLE CURE,21230,MIMEURE,,,21414,,,,,,,,,,,,,,,,,,,2017-12-15,F,,,,,46.19B,NAFRev2,N,4.499737,47.148968,0.88,street,Rue de la Vieille Cure 21230 Mimeure,21414_6rm8q2,G,RUE DE LA VIEILLE CURE,
794417386,00016,79441738600016,O,2013-08-05,,,,2016-03-16T08:29:57,true,2,,,,,RUE DES PRES,21230,MIMEURE,,,21414,,,,,,,,,,,,,,,,,,,2016-02-26,F,,,,,43.31Z,NAFRev2,N,4.492276,47.149195,0.76,street,Rue du Pré des Oiseaux 21230 Mimeure,21414_m63n0h,G,RUE DU PRE DES OISEAUX,
799779574,00018,79977957400018,O,2014-02-20,,,,2014-07-10T02:57:47,true,1,,,,HAM,DE THOREILLE,21230,MIMEURE,,,21414,,,,,,,,,,,,,,,,,,,2014-02-20,A,,,,NORA COIFF',96.02A,NAFRev2,N,4.514952,47.148672,0.72,street,Rue du Sud (thoreille) 21230 Mimeure,21414_0180,G,RUE DU SUD,THOREILLE
803328467,00011,80332846700011,O,2014-07-01,,,4322AZ,2014-07-06T04:17:27,true,1,HAMEAU DE THOREILLE,6,,RUE,DU BOIS DE PUITS,21230,MIMEURE,,,21414,,,,,,,,,,,,,,,,,,,2014-07-01,A,,,,,43.22A,NAFRev2,N,4.512871,47.149085,0.83,housenumber,6 Rue du Bois du Puits 21230 Mimeure,21414_rvth5o_00006,G,6 RUE DU BOIS DU PUITS,
803759208,00017,80375920800017,O,2014-07-07,,,,2018-04-21T08:34:07,true,1,,,,,VILLAGE DE MIMEURE,21230,MIMEURE,,,21414,,,,,,,,,,,,,,,,,,,2014-07-07,A,,,,,68.20B,NAFRev2,N,4.494716,47.14973,0.93,locality,Village de Mimeure 21230 Mimeure,21414_B147,G,VILLAGE DE MIMEURE,
804774586,00015,80477458600015,O,2013-01-04,,,,2014-09-25T08:56:04,true,1,HAMEAU DE SOLONGE,12,,RUE,DES MILLIERES,21230,MIMEURE,,,21414,,,,,,,,,,,,,,,,,,,2013-01-04,A,,,,,47.99A,NAFRev2,N,4.477164,47.158368,0.94,housenumber,12 Rue des Millieres 21230 Mimeure,21414_kgr1t1_00012,G,12 RUE DES MILLIERES,